You are viewing a plain text version of this content. The canonical link for it is here.
Posted to notifications@maven.apache.org by Apache Jenkins Server <je...@builds.apache.org> on 2019/07/21 16:14:29 UTC

Build failed in Jenkins: Maven TLP » maven-surefire » SUREFIRE-1675 #17

See https://builds.apache.org/job/maven-box/job/maven-surefire/job/SUREFIRE-1675/17/

Changes:

* investigating maven opts
* investigating maven opts
* investigating maven opts
* investigating maven opts
* investigating maven opts
* investigating maven opts
* investigating maven opts
* investigating maven opts
* investigating maven opts
* investigating maven opts

All tests passed

Build log:
[...truncated 50917 lines...]
[2019-07-21T16:14:15.689Z] [INFO] SureFire Booter .................................... SUCCESS [ 17.259 s]
[2019-07-21T16:14:15.689Z] [INFO] Maven Surefire Test-Grouping Support ............... SUCCESS [ 13.096 s]
[2019-07-21T16:14:15.689Z] [INFO] SureFire Providers ................................. SUCCESS [  1.560 s]
[2019-07-21T16:14:15.689Z] [INFO] Shared JUnit3 Provider Code ........................ SUCCESS [  5.178 s]
[2019-07-21T16:14:15.689Z] [INFO] Shared Java 5 Provider Base ........................ SUCCESS [  7.400 s]
[2019-07-21T16:14:15.689Z] [INFO] Shared JUnit4 Provider Code ........................ SUCCESS [  8.134 s]
[2019-07-21T16:14:15.689Z] [INFO] Shared JUnit48 Provider Code ....................... SUCCESS [  7.962 s]
[2019-07-21T16:14:15.689Z] [INFO] SureFire JUnit Runner .............................. SUCCESS [  5.512 s]
[2019-07-21T16:14:15.689Z] [INFO] SureFire JUnit4 Runner ............................. SUCCESS [ 17.611 s]
[2019-07-21T16:14:15.689Z] [INFO] Maven Surefire Common .............................. SUCCESS [ 43.938 s]
[2019-07-21T16:14:15.689Z] [INFO] SureFire JUnitCore Runner .......................... SUCCESS [02:22 min]
[2019-07-21T16:14:15.689Z] [INFO] SureFire JUnit Platform Runner ..................... SUCCESS [ 11.832 s]
[2019-07-21T16:14:15.689Z] [INFO] SureFire TestNG Utils .............................. SUCCESS [  5.764 s]
[2019-07-21T16:14:15.689Z] [INFO] SureFire TestNG Runner ............................. SUCCESS [  6.986 s]
[2019-07-21T16:14:15.689Z] [INFO] ShadeFire JUnit3 Provider .......................... SUCCESS [  2.430 s]
[2019-07-21T16:14:15.689Z] [INFO] Surefire Report Parser ............................. SUCCESS [  8.398 s]
[2019-07-21T16:14:15.689Z] [INFO] Maven Surefire Plugin .............................. SUCCESS [ 18.727 s]
[2019-07-21T16:14:15.689Z] [INFO] Maven Failsafe Plugin .............................. FAILURE [ 45.793 s]
[2019-07-21T16:14:15.689Z] [INFO] Maven Surefire Report Plugin ....................... SKIPPED
[2019-07-21T16:14:15.689Z] [INFO] Maven Surefire Integration Tests ................... SKIPPED
[2019-07-21T16:14:15.689Z] [INFO] ------------------------------------------------------------------------
[2019-07-21T16:14:15.689Z] [INFO] BUILD FAILURE
[2019-07-21T16:14:15.689Z] [INFO] ------------------------------------------------------------------------
[2019-07-21T16:14:15.689Z] [INFO] Total time:  08:13 min
[2019-07-21T16:14:15.689Z] [INFO] Finished at: 2019-07-21T09:14:15-07:00
[2019-07-21T16:14:15.689Z] [INFO] ------------------------------------------------------------------------
[2019-07-21T16:14:15.689Z] [ERROR] Failed to execute goal org.apache.maven.plugins:maven-invoker-plugin:3.2.0:run (integration-test) on project maven-failsafe-plugin: 2 builds failed. See console output above for details. -> [Help 1]
[2019-07-21T16:14:15.689Z] org.apache.maven.lifecycle.LifecycleExecutionException: Failed to execute goal org.apache.maven.plugins:maven-invoker-plugin:3.2.0:run (integration-test) on project maven-failsafe-plugin: 2 builds failed. See console output above for details.
[2019-07-21T16:14:15.689Z]     at org.apache.maven.lifecycle.internal.MojoExecutor.execute (MojoExecutor.java:215)
[2019-07-21T16:14:15.689Z]     at org.apache.maven.lifecycle.internal.MojoExecutor.execute (MojoExecutor.java:156)
[2019-07-21T16:14:15.689Z]     at org.apache.maven.lifecycle.internal.MojoExecutor.execute (MojoExecutor.java:148)
[2019-07-21T16:14:15.689Z]     at org.apache.maven.lifecycle.internal.LifecycleModuleBuilder.buildProject (LifecycleModuleBuilder.java:117)
[2019-07-21T16:14:15.689Z]     at org.apache.maven.lifecycle.internal.LifecycleModuleBuilder.buildProject (LifecycleModuleBuilder.java:81)
[2019-07-21T16:14:15.689Z]     at org.apache.maven.lifecycle.internal.builder.singlethreaded.SingleThreadedBuilder.build (SingleThreadedBuilder.java:56)
[2019-07-21T16:14:15.689Z]     at org.apache.maven.lifecycle.internal.LifecycleStarter.execute (LifecycleStarter.java:128)
[2019-07-21T16:14:15.689Z]     at org.apache.maven.DefaultMaven.doExecute (DefaultMaven.java:305)
[2019-07-21T16:14:15.689Z]     at org.apache.maven.DefaultMaven.doExecute (DefaultMaven.java:192)
[2019-07-21T16:14:15.689Z]     at org.apache.maven.DefaultMaven.execute (DefaultMaven.java:105)
[2019-07-21T16:14:15.689Z]     at org.apache.maven.cli.MavenCli.execute (MavenCli.java:956)
[2019-07-21T16:14:15.689Z]     at org.apache.maven.cli.MavenCli.doMain (MavenCli.java:288)
[2019-07-21T16:14:15.689Z]     at org.apache.maven.cli.MavenCli.main (MavenCli.java:192)
[2019-07-21T16:14:15.689Z]     at sun.reflect.NativeMethodAccessorImpl.invoke0 (Native Method)
[2019-07-21T16:14:15.689Z]     at sun.reflect.NativeMethodAccessorImpl.invoke (NativeMethodAccessorImpl.java:62)
[2019-07-21T16:14:15.689Z]     at sun.reflect.DelegatingMethodAccessorImpl.invoke (DelegatingMethodAccessorImpl.java:43)
[2019-07-21T16:14:15.689Z]     at java.lang.reflect.Method.invoke (Method.java:498)
[2019-07-21T16:14:15.689Z]     at org.codehaus.plexus.classworlds.launcher.Launcher.launchEnhanced (Launcher.java:289)
[2019-07-21T16:14:15.689Z]     at org.codehaus.plexus.classworlds.launcher.Launcher.launch (Launcher.java:229)
[2019-07-21T16:14:15.689Z]     at org.codehaus.plexus.classworlds.launcher.Launcher.mainWithExitCode (Launcher.java:415)
[2019-07-21T16:14:15.689Z]     at org.codehaus.plexus.classworlds.launcher.Launcher.main (Launcher.java:356)
[2019-07-21T16:14:15.689Z] Caused by: org.apache.maven.plugin.MojoFailureException: 2 builds failed. See console output above for details.
[2019-07-21T16:14:15.689Z]     at org.apache.maven.plugins.invoker.InvokerSession.handleFailures (InvokerSession.java:260)
[2019-07-21T16:14:15.689Z]     at org.apache.maven.plugins.invoker.InvokerMojo.processResults (InvokerMojo.java:68)
[2019-07-21T16:14:15.689Z]     at org.apache.maven.plugins.invoker.AbstractInvokerMojo.execute (AbstractInvokerMojo.java:772)
[2019-07-21T16:14:15.689Z]     at org.apache.maven.plugin.DefaultBuildPluginManager.executeMojo (DefaultBuildPluginManager.java:137)
[2019-07-21T16:14:15.689Z]     at org.apache.maven.lifecycle.internal.MojoExecutor.execute (MojoExecutor.java:210)
[2019-07-21T16:14:15.689Z]     at org.apache.maven.lifecycle.internal.MojoExecutor.execute (MojoExecutor.java:156)
[2019-07-21T16:14:15.690Z]     at org.apache.maven.lifecycle.internal.MojoExecutor.execute (MojoExecutor.java:148)
[2019-07-21T16:14:15.690Z]     at org.apache.maven.lifecycle.internal.LifecycleModuleBuilder.buildProject (LifecycleModuleBuilder.java:117)
[2019-07-21T16:14:15.690Z]     at org.apache.maven.lifecycle.internal.LifecycleModuleBuilder.buildProject (LifecycleModuleBuilder.java:81)
[2019-07-21T16:14:15.690Z]     at org.apache.maven.lifecycle.internal.builder.singlethreaded.SingleThreadedBuilder.build (SingleThreadedBuilder.java:56)
[2019-07-21T16:14:15.690Z]     at org.apache.maven.lifecycle.internal.LifecycleStarter.execute (LifecycleStarter.java:128)
[2019-07-21T16:14:15.690Z]     at org.apache.maven.DefaultMaven.doExecute (DefaultMaven.java:305)
[2019-07-21T16:14:15.690Z]     at org.apache.maven.DefaultMaven.doExecute (DefaultMaven.java:192)
[2019-07-21T16:14:15.690Z]     at org.apache.maven.DefaultMaven.execute (DefaultMaven.java:105)
[2019-07-21T16:14:15.690Z]     at org.apache.maven.cli.MavenCli.execute (MavenCli.java:956)
[2019-07-21T16:14:15.690Z]     at org.apache.maven.cli.MavenCli.doMain (MavenCli.java:288)
[2019-07-21T16:14:15.690Z]     at org.apache.maven.cli.MavenCli.main (MavenCli.java:192)
[2019-07-21T16:14:15.690Z]     at sun.reflect.NativeMethodAccessorImpl.invoke0 (Native Method)
[2019-07-21T16:14:15.690Z]     at sun.reflect.NativeMethodAccessorImpl.invoke (NativeMethodAccessorImpl.java:62)
[2019-07-21T16:14:15.690Z]     at sun.reflect.DelegatingMethodAccessorImpl.invoke (DelegatingMethodAccessorImpl.java:43)
[2019-07-21T16:14:15.690Z]     at java.lang.reflect.Method.invoke (Method.java:498)
[2019-07-21T16:14:15.690Z]     at org.codehaus.plexus.classworlds.launcher.Launcher.launchEnhanced (Launcher.java:289)
[2019-07-21T16:14:15.690Z]     at org.codehaus.plexus.classworlds.launcher.Launcher.launch (Launcher.java:229)
[2019-07-21T16:14:15.690Z]     at org.codehaus.plexus.classworlds.launcher.Launcher.mainWithExitCode (Launcher.java:415)
[2019-07-21T16:14:15.690Z]     at org.codehaus.plexus.classworlds.launcher.Launcher.main (Launcher.java:356)
[2019-07-21T16:14:15.690Z] [ERROR] 
[2019-07-21T16:14:15.690Z] [ERROR] Re-run Maven using the -X switch to enable full debug logging.
[2019-07-21T16:14:15.690Z] [ERROR] 
[2019-07-21T16:14:15.690Z] [ERROR] For more information about the errors and possible solutions, please read the following articles:
[2019-07-21T16:14:15.690Z] [ERROR] [Help 1] http://cwiki.apache.org/confluence/display/MAVEN/MojoFailureException
[2019-07-21T16:14:15.690Z] [ERROR] 
[2019-07-21T16:14:15.690Z] [ERROR] After correcting the problems, you can resume the build with the command
[2019-07-21T16:14:15.690Z] [ERROR]   mvn <goals> -rf :maven-failsafe-plugin
[Pipeline] }
[Pipeline] // withEnv
[Pipeline] }
[Pipeline] // stage
[Pipeline] fileExists
[Pipeline] zip
[2019-07-21T16:14:15.847Z] Writing zip file of C:\Users\jenkins\AppData\Local\Temp\3\jenkins-maven-box-maven-surefire-SUREFIRE-1675-17@2\maven-failsafe-plugin\target\it to C:\Users\jenkins\AppData\Local\Temp\3\jenkins-maven-box-maven-surefire-SUREFIRE-1675-17@2\maven-failsafe-plugin--windows-jdk7-maven3.6.x.zip
[2019-07-21T16:14:15.992Z] Zipped 27 entries.
[2019-07-21T16:14:15.992Z] Archiving C:\Users\jenkins\AppData\Local\Temp\3\jenkins-maven-box-maven-surefire-SUREFIRE-1675-17@2\maven-failsafe-plugin--windows-jdk7-maven3.6.x.zip
[2019-07-21T16:14:15.993Z] [Fast Archiver] No artifacts from Maven TLP » maven-surefire » SUREFIRE-1675 #6 to compare, so performing full copy of artifacts
[Pipeline] fileExists
[Pipeline] archiveArtifacts
[2019-07-21T16:14:16.052Z] Archiving artifacts
[2019-07-21T16:14:16.065Z] [Fast Archiver] No artifacts from Maven TLP » maven-surefire » SUREFIRE-1675 #6 to compare, so performing full copy of artifacts
[Pipeline] cleanWs
[2019-07-21T16:14:16.105Z] [WS-CLEANUP] Deleting project workspace...
[2019-07-21T16:14:16.105Z] [WS-CLEANUP] Deferred wipeout is used...
[2019-07-21T16:14:16.142Z] [WS-CLEANUP] done
[Pipeline] }
[Pipeline] // ws
[Pipeline] }
[Pipeline] // timestamps
[Pipeline] }
[Pipeline] // node
[Pipeline] }
[2019-07-21T16:14:17.571Z] [INFO] run post-build script verify.bsh
[2019-07-21T16:14:17.571Z] [INFO]   The post-build script returned false.
[2019-07-21T16:14:17.571Z] [INFO]           jetty-war-test-failing\pom.xml ................... FAILED (9.4 s)
[2019-07-21T16:14:17.571Z] [INFO] Building: jetty-war-test-passing\pom.xml
[2019-07-21T16:14:21.546Z] [INFO] run post-build script verify.bsh
[2019-07-21T16:14:21.546Z] [INFO]   The post-build script returned false.
[2019-07-21T16:14:21.546Z] [INFO]           jetty-war-test-passing\pom.xml ................... FAILED (3.6 s)
[2019-07-21T16:14:21.546Z] [INFO] Building: multiple-summaries\pom.xml
[2019-07-21T16:14:23.570Z] [INFO]           multiple-summaries\pom.xml ....................... SUCCESS (2.9 s)
[2019-07-21T16:14:23.570Z] [INFO] Building: multiple-summaries-failing\pom.xml
[2019-07-21T16:14:26.173Z] [INFO]           multiple-summaries-failing\pom.xml ............... SUCCESS (2.4 s)
[2019-07-21T16:14:26.173Z] [INFO] Building: working-directory\pom.xml
[2019-07-21T16:14:28.760Z] [INFO]           working-directory\pom.xml ........................ SUCCESS (2.6 s)
[2019-07-21T16:14:28.760Z] [INFO] -------------------------------------------------
[2019-07-21T16:14:28.760Z] [INFO] Build Summary:
[2019-07-21T16:14:28.760Z] [INFO]   Passed: 3, Failed: 2, Errors: 0, Skipped: 0
[2019-07-21T16:14:28.760Z] [INFO] -------------------------------------------------
[2019-07-21T16:14:28.760Z] [ERROR] The following builds failed:
[2019-07-21T16:14:28.760Z] [ERROR] *  jetty-war-test-failing\pom.xml
[2019-07-21T16:14:28.760Z] [ERROR] *  jetty-war-test-passing\pom.xml
[2019-07-21T16:14:28.760Z] [INFO] -------------------------------------------------
[2019-07-21T16:14:28.760Z] [INFO] ------------------------------------------------------------------------
[2019-07-21T16:14:28.760Z] [INFO] Reactor Summary for Apache Maven Surefire 3.0.0-SNAPSHOT:
[2019-07-21T16:14:28.760Z] [INFO] 
[2019-07-21T16:14:28.760Z] [INFO] Apache Maven Surefire .............................. SUCCESS [01:11 min]
[2019-07-21T16:14:28.760Z] [INFO] SureFire Logger API ................................ SUCCESS [ 25.857 s]
[2019-07-21T16:14:28.760Z] [INFO] SureFire API ....................................... SUCCESS [ 19.425 s]
[2019-07-21T16:14:28.760Z] [INFO] Surefire Extensions API ............................ SUCCESS [  3.262 s]
[2019-07-21T16:14:28.760Z] [INFO] SureFire Booter .................................... SUCCESS [ 17.356 s]
[2019-07-21T16:14:28.760Z] [INFO] Maven Surefire Test-Grouping Support ............... SUCCESS [ 13.361 s]
[2019-07-21T16:14:28.760Z] [INFO] SureFire Providers ................................. SUCCESS [  1.290 s]
[2019-07-21T16:14:28.760Z] [INFO] Shared JUnit3 Provider Code ........................ SUCCESS [  5.494 s]
[2019-07-21T16:14:28.760Z] [INFO] Shared Java 5 Provider Base ........................ SUCCESS [  7.099 s]
[2019-07-21T16:14:28.760Z] [INFO] Shared JUnit4 Provider Code ........................ SUCCESS [  7.827 s]
[2019-07-21T16:14:28.760Z] [INFO] Shared JUnit48 Provider Code ....................... SUCCESS [  8.273 s]
[2019-07-21T16:14:28.760Z] [INFO] SureFire JUnit Runner .............................. SUCCESS [  5.831 s]
[2019-07-21T16:14:28.760Z] [INFO] SureFire JUnit4 Runner ............................. SUCCESS [ 38.348 s]
[2019-07-21T16:14:28.760Z] [INFO] Maven Surefire Common .............................. SUCCESS [ 40.942 s]
[2019-07-21T16:14:28.760Z] [INFO] SureFire JUnitCore Runner .......................... SUCCESS [02:23 min]
[2019-07-21T16:14:28.760Z] [INFO] SureFire JUnit Platform Runner ..................... SUCCESS [ 11.277 s]
[2019-07-21T16:14:28.760Z] [INFO] SureFire TestNG Utils .............................. SUCCESS [  5.888 s]
[2019-07-21T16:14:28.760Z] [INFO] SureFire TestNG Runner ............................. SUCCESS [  7.322 s]
[2019-07-21T16:14:28.760Z] [INFO] ShadeFire JUnit3 Provider .......................... SUCCESS [  2.013 s]
[2019-07-21T16:14:28.760Z] [INFO] Surefire Report Parser ............................. SUCCESS [  9.025 s]
[2019-07-21T16:14:28.760Z] [INFO] Maven Surefire Plugin .............................. SUCCESS [ 16.145 s]
[2019-07-21T16:14:28.760Z] [INFO] Maven Failsafe Plugin .............................. FAILURE [ 42.307 s]
[2019-07-21T16:14:28.760Z] [INFO] Maven Surefire Report Plugin ....................... SKIPPED
[2019-07-21T16:14:28.760Z] [INFO] Maven Surefire Integration Tests ................... SKIPPED
[2019-07-21T16:14:28.760Z] [INFO] ------------------------------------------------------------------------
[2019-07-21T16:14:28.760Z] [INFO] BUILD FAILURE
[2019-07-21T16:14:28.760Z] [INFO] ------------------------------------------------------------------------
[2019-07-21T16:14:28.760Z] [INFO] Total time:  08:25 min
[2019-07-21T16:14:28.760Z] [INFO] Finished at: 2019-07-21T09:14:28-07:00
[2019-07-21T16:14:28.760Z] [INFO] ------------------------------------------------------------------------
[2019-07-21T16:14:28.760Z] [ERROR] Failed to execute goal org.apache.maven.plugins:maven-invoker-plugin:3.2.0:run (integration-test) on project maven-failsafe-plugin: 2 builds failed. See console output above for details. -> [Help 1]
[2019-07-21T16:14:28.760Z] org.apache.maven.lifecycle.LifecycleExecutionException: Failed to execute goal org.apache.maven.plugins:maven-invoker-plugin:3.2.0:run (integration-test) on project maven-failsafe-plugin: 2 builds failed. See console output above for details.
[2019-07-21T16:14:28.760Z]     at org.apache.maven.lifecycle.internal.MojoExecutor.execute (MojoExecutor.java:215)
[2019-07-21T16:14:28.760Z]     at org.apache.maven.lifecycle.internal.MojoExecutor.execute (MojoExecutor.java:156)
[2019-07-21T16:14:28.760Z]     at org.apache.maven.lifecycle.internal.MojoExecutor.execute (MojoExecutor.java:148)
[2019-07-21T16:14:28.760Z]     at org.apache.maven.lifecycle.internal.LifecycleModuleBuilder.buildProject (LifecycleModuleBuilder.java:117)
[2019-07-21T16:14:28.760Z]     at org.apache.maven.lifecycle.internal.LifecycleModuleBuilder.buildProject (LifecycleModuleBuilder.java:81)
[2019-07-21T16:14:28.760Z]     at org.apache.maven.lifecycle.internal.builder.singlethreaded.SingleThreadedBuilder.build (SingleThreadedBuilder.java:56)
[2019-07-21T16:14:28.760Z]     at org.apache.maven.lifecycle.internal.LifecycleStarter.execute (LifecycleStarter.java:128)
[2019-07-21T16:14:28.760Z]     at org.apache.maven.DefaultMaven.doExecute (DefaultMaven.java:305)
[2019-07-21T16:14:28.760Z]     at org.apache.maven.DefaultMaven.doExecute (DefaultMaven.java:192)
[2019-07-21T16:14:28.760Z]     at org.apache.maven.DefaultMaven.execute (DefaultMaven.java:105)
[2019-07-21T16:14:28.760Z]     at org.apache.maven.cli.MavenCli.execute (MavenCli.java:956)
[2019-07-21T16:14:28.760Z]     at org.apache.maven.cli.MavenCli.doMain (MavenCli.java:288)
[2019-07-21T16:14:28.760Z]     at org.apache.maven.cli.MavenCli.main (MavenCli.java:192)
[2019-07-21T16:14:28.760Z]     at sun.reflect.NativeMethodAccessorImpl.invoke0 (Native Method)
[2019-07-21T16:14:28.760Z]     at sun.reflect.NativeMethodAccessorImpl.invoke (NativeMethodAccessorImpl.java:62)
[2019-07-21T16:14:28.760Z]     at sun.reflect.DelegatingMethodAccessorImpl.invoke (DelegatingMethodAccessorImpl.java:43)
[2019-07-21T16:14:28.760Z]     at java.lang.reflect.Method.invoke (Method.java:498)
[2019-07-21T16:14:28.760Z]     at org.codehaus.plexus.classworlds.launcher.Launcher.launchEnhanced (Launcher.java:289)
[2019-07-21T16:14:28.760Z]     at org.codehaus.plexus.classworlds.launcher.Launcher.launch (Launcher.java:229)
[2019-07-21T16:14:28.760Z]     at org.codehaus.plexus.classworlds.launcher.Launcher.mainWithExitCode (Launcher.java:415)
[2019-07-21T16:14:28.760Z]     at org.codehaus.plexus.classworlds.launcher.Launcher.main (Launcher.java:356)
[2019-07-21T16:14:28.760Z] Caused by: org.apache.maven.plugin.MojoFailureException: 2 builds failed. See console output above for details.
[2019-07-21T16:14:28.760Z]     at org.apache.maven.plugins.invoker.InvokerSession.handleFailures (InvokerSession.java:260)
[2019-07-21T16:14:28.760Z]     at org.apache.maven.plugins.invoker.InvokerMojo.processResults (InvokerMojo.java:68)
[2019-07-21T16:14:28.760Z]     at org.apache.maven.plugins.invoker.AbstractInvokerMojo.execute (AbstractInvokerMojo.java:772)
[2019-07-21T16:14:28.760Z]     at org.apache.maven.plugin.DefaultBuildPluginManager.executeMojo (DefaultBuildPluginManager.java:137)
[2019-07-21T16:14:28.760Z]     at org.apache.maven.lifecycle.internal.MojoExecutor.execute (MojoExecutor.java:210)
[2019-07-21T16:14:28.760Z]     at org.apache.maven.lifecycle.internal.MojoExecutor.execute (MojoExecutor.java:156)
[2019-07-21T16:14:28.760Z]     at org.apache.maven.lifecycle.internal.MojoExecutor.execute (MojoExecutor.java:148)
[2019-07-21T16:14:28.760Z]     at org.apache.maven.lifecycle.internal.LifecycleModuleBuilder.buildProject (LifecycleModuleBuilder.java:117)
[2019-07-21T16:14:28.760Z]     at org.apache.maven.lifecycle.internal.LifecycleModuleBuilder.buildProject (LifecycleModuleBuilder.java:81)
[2019-07-21T16:14:28.761Z]     at org.apache.maven.lifecycle.internal.builder.singlethreaded.SingleThreadedBuilder.build (SingleThreadedBuilder.java:56)
[2019-07-21T16:14:28.761Z]     at org.apache.maven.lifecycle.internal.LifecycleStarter.execute (LifecycleStarter.java:128)
[2019-07-21T16:14:28.761Z]     at org.apache.maven.DefaultMaven.doExecute (DefaultMaven.java:305)
[2019-07-21T16:14:28.761Z]     at org.apache.maven.DefaultMaven.doExecute (DefaultMaven.java:192)
[2019-07-21T16:14:28.761Z]     at org.apache.maven.DefaultMaven.execute (DefaultMaven.java:105)
[2019-07-21T16:14:28.761Z]     at org.apache.maven.cli.MavenCli.execute (MavenCli.java:956)
[2019-07-21T16:14:28.761Z]     at org.apache.maven.cli.MavenCli.doMain (MavenCli.java:288)
[2019-07-21T16:14:28.761Z]     at org.apache.maven.cli.MavenCli.main (MavenCli.java:192)
[2019-07-21T16:14:28.761Z]     at sun.reflect.NativeMethodAccessorImpl.invoke0 (Native Method)
[2019-07-21T16:14:28.761Z]     at sun.reflect.NativeMethodAccessorImpl.invoke (NativeMethodAccessorImpl.java:62)
[2019-07-21T16:14:28.761Z]     at sun.reflect.DelegatingMethodAccessorImpl.invoke (DelegatingMethodAccessorImpl.java:43)
[2019-07-21T16:14:28.761Z]     at java.lang.reflect.Method.invoke (Method.java:498)
[2019-07-21T16:14:28.761Z]     at org.codehaus.plexus.classworlds.launcher.Launcher.launchEnhanced (Launcher.java:289)
[2019-07-21T16:14:28.761Z]     at org.codehaus.plexus.classworlds.launcher.Launcher.launch (Launcher.java:229)
[2019-07-21T16:14:28.761Z]     at org.codehaus.plexus.classworlds.launcher.Launcher.mainWithExitCode (Launcher.java:415)
[2019-07-21T16:14:28.761Z]     at org.codehaus.plexus.classworlds.launcher.Launcher.main (Launcher.java:356)
[2019-07-21T16:14:28.761Z] [ERROR] 
[2019-07-21T16:14:28.761Z] [ERROR] Re-run Maven using the -X switch to enable full debug logging.
[2019-07-21T16:14:28.761Z] [ERROR] 
[2019-07-21T16:14:28.761Z] [ERROR] For more information about the errors and possible solutions, please read the following articles:
[2019-07-21T16:14:28.761Z] [ERROR] [Help 1] http://cwiki.apache.org/confluence/display/MAVEN/MojoFailureException
[2019-07-21T16:14:28.761Z] [ERROR] 
[2019-07-21T16:14:28.761Z] [ERROR] After correcting the problems, you can resume the build with the command
[2019-07-21T16:14:28.761Z] [ERROR]   mvn <goals> -rf :maven-failsafe-plugin
[Pipeline] }
[Pipeline] // withEnv
[Pipeline] }
[Pipeline] // stage
[Pipeline] fileExists
[Pipeline] zip
[2019-07-21T16:14:28.897Z] Writing zip file of C:\Users\jenkins\AppData\Local\Temp\3\jenkins-maven-box-maven-surefire-SUREFIRE-1675-17\maven-failsafe-plugin\target\it to C:\Users\jenkins\AppData\Local\Temp\3\jenkins-maven-box-maven-surefire-SUREFIRE-1675-17\maven-failsafe-plugin--windows-jdk8-maven3.6.x.zip
[2019-07-21T16:14:28.970Z] Zipped 27 entries.
[2019-07-21T16:14:28.970Z] Archiving C:\Users\jenkins\AppData\Local\Temp\3\jenkins-maven-box-maven-surefire-SUREFIRE-1675-17\maven-failsafe-plugin--windows-jdk8-maven3.6.x.zip
[2019-07-21T16:14:28.971Z] [Fast Archiver] No artifacts from Maven TLP » maven-surefire » SUREFIRE-1675 #6 to compare, so performing full copy of artifacts
[Pipeline] fileExists
[Pipeline] archiveArtifacts
[2019-07-21T16:14:29.032Z] Archiving artifacts
[2019-07-21T16:14:29.045Z] [Fast Archiver] No artifacts from Maven TLP » maven-surefire » SUREFIRE-1675 #6 to compare, so performing full copy of artifacts
[Pipeline] cleanWs
[2019-07-21T16:14:29.085Z] [WS-CLEANUP] Deleting project workspace...
[2019-07-21T16:14:29.085Z] [WS-CLEANUP] Deferred wipeout is used...
[2019-07-21T16:14:29.126Z] [WS-CLEANUP] done
[Pipeline] }
[Pipeline] // ws
[Pipeline] }
[Pipeline] // timestamps
[Pipeline] }
[Pipeline] // node
[Pipeline] }
[Pipeline] // parallel
[Pipeline] echo
Build result: FAILURE
[Pipeline] jiraIssueSelector
[Pipeline] emailext

Build succeeded in Jenkins: Maven TLP » maven-surefire » SUREFIRE-1675 #19

Posted by Apache Jenkins Server <je...@builds.apache.org>.
See https://builds.apache.org/job/maven-box/job/maven-surefire/job/SUREFIRE-1675/19/

Changes:

* investigate JAVA_HOME_IT
* investigate JAVA_HOME_IT
* investigate JAVA_HOME_IT
* investigate JAVA_HOME_IT
* investigate JAVA_HOME_IT
* investigate JAVA_HOME_IT

No tests ran.

Build failed in Jenkins: Maven TLP » maven-surefire » SUREFIRE-1675 #18

Posted by Apache Jenkins Server <je...@builds.apache.org>.
See https://builds.apache.org/job/maven-box/job/maven-surefire/job/SUREFIRE-1675/18/

Changes:

* mvn 3.2.x
* mvn 3.2.x
* mvn 3.2.x
* mvn 3.2.x
* mvn 3.2.x
* mvn 3.2.x

All tests passed

Build log:
[...truncated 49932 lines...]
[2019-07-21T16:27:49.913Z] [WS-CLEANUP] Deleting project workspace...
[2019-07-21T16:27:49.913Z] [WS-CLEANUP] Deferred wipeout is used...
[2019-07-21T16:27:49.945Z] [WS-CLEANUP] done
[Pipeline] }
[Pipeline] // ws
[Pipeline] }
[Pipeline] // timestamps
[Pipeline] }
[Pipeline] // node
[Pipeline] }
[2019-07-21T16:27:55.466Z] [INFO] run post-build script verify.bsh
[2019-07-21T16:27:55.466Z] [INFO]   The post-build script returned false.
[2019-07-21T16:27:55.466Z] [INFO]           jetty-war-test-failing\pom.xml ................... FAILED (8.4 s)
[2019-07-21T16:27:55.466Z] [INFO] Building: jetty-war-test-passing\pom.xml
[2019-07-21T16:27:56.194Z] [INFO] run post-build script verify.bsh
[2019-07-21T16:27:56.194Z] [INFO]   The post-build script returned false.
[2019-07-21T16:27:56.194Z] [INFO]           jetty-war-test-failing\pom.xml ................... FAILED (8.8 s)
[2019-07-21T16:27:56.194Z] [INFO] Building: jetty-war-test-passing\pom.xml
[2019-07-21T16:27:57.729Z] [INFO] run post-build script verify.bsh
[2019-07-21T16:27:57.729Z] [INFO]   The post-build script returned false.
[2019-07-21T16:27:57.729Z] [INFO]           jetty-war-test-passing\pom.xml ................... FAILED (3.0 s)
[2019-07-21T16:27:57.729Z] [INFO] Building: multiple-summaries\pom.xml
[2019-07-21T16:27:58.516Z] [INFO] run post-build script verify.bsh
[2019-07-21T16:27:58.516Z] [INFO]   The post-build script returned false.
[2019-07-21T16:27:58.516Z] [INFO]           jetty-war-test-passing\pom.xml ................... FAILED (2.8 s)
[2019-07-21T16:27:58.516Z] [INFO] Building: multiple-summaries\pom.xml
[2019-07-21T16:28:01.100Z] [INFO]           multiple-summaries\pom.xml ....................... SUCCESS (2.7 s)
[2019-07-21T16:28:01.100Z] [INFO] Building: multiple-summaries-failing\pom.xml
[2019-07-21T16:28:01.143Z] [INFO]           multiple-summaries\pom.xml ....................... SUCCESS (2.9 s)
[2019-07-21T16:28:01.143Z] [INFO] Building: multiple-summaries-failing\pom.xml
[2019-07-21T16:28:03.712Z] [INFO]           multiple-summaries-failing\pom.xml ............... SUCCESS (3.0 s)
[2019-07-21T16:28:03.712Z] [INFO] Building: working-directory\pom.xml
[2019-07-21T16:28:04.569Z] [INFO]           multiple-summaries-failing\pom.xml ............... SUCCESS (2.8 s)
[2019-07-21T16:28:04.569Z] [INFO] Building: working-directory\pom.xml
[2019-07-21T16:28:06.377Z] [INFO]           working-directory\pom.xml ........................ SUCCESS (2.6 s)
[2019-07-21T16:28:06.377Z] [INFO] -------------------------------------------------
[2019-07-21T16:28:06.377Z] [INFO] Build Summary:
[2019-07-21T16:28:06.377Z] [INFO]   Passed: 3, Failed: 2, Errors: 0, Skipped: 0
[2019-07-21T16:28:06.377Z] [INFO] -------------------------------------------------
[2019-07-21T16:28:06.377Z] [ERROR] The following builds failed:
[2019-07-21T16:28:06.377Z] [ERROR] *  jetty-war-test-failing\pom.xml
[2019-07-21T16:28:06.377Z] [ERROR] *  jetty-war-test-passing\pom.xml
[2019-07-21T16:28:06.377Z] [INFO] -------------------------------------------------
[2019-07-21T16:28:06.377Z] [INFO] ------------------------------------------------------------------------
[2019-07-21T16:28:06.377Z] [INFO] Reactor Summary:
[2019-07-21T16:28:06.377Z] [INFO] 
[2019-07-21T16:28:06.377Z] [INFO] Apache Maven Surefire .............................. SUCCESS [ 59.939 s]
[2019-07-21T16:28:06.377Z] [INFO] SureFire Logger API ................................ SUCCESS [ 23.520 s]
[2019-07-21T16:28:06.377Z] [INFO] SureFire API ....................................... SUCCESS [ 18.061 s]
[2019-07-21T16:28:06.377Z] [INFO] Surefire Extensions API ............................ SUCCESS [  3.426 s]
[2019-07-21T16:28:06.377Z] [INFO] SureFire Booter .................................... SUCCESS [ 17.040 s]
[2019-07-21T16:28:06.377Z] [INFO] Maven Surefire Test-Grouping Support ............... SUCCESS [ 11.232 s]
[2019-07-21T16:28:06.377Z] [INFO] SureFire Providers ................................. SUCCESS [  1.230 s]
[2019-07-21T16:28:06.377Z] [INFO] Shared JUnit3 Provider Code ........................ SUCCESS [  5.427 s]
[2019-07-21T16:28:06.377Z] [INFO] Shared Java 5 Provider Base ........................ SUCCESS [  7.704 s]
[2019-07-21T16:28:06.377Z] [INFO] Shared JUnit4 Provider Code ........................ SUCCESS [  7.402 s]
[2019-07-21T16:28:06.378Z] [INFO] Shared JUnit48 Provider Code ....................... SUCCESS [  7.931 s]
[2019-07-21T16:28:06.378Z] [INFO] SureFire JUnit Runner .............................. SUCCESS [  5.615 s]
[2019-07-21T16:28:06.378Z] [INFO] SureFire JUnit4 Runner ............................. SUCCESS [ 35.727 s]
[2019-07-21T16:28:06.378Z] [INFO] Maven Surefire Common .............................. SUCCESS [ 44.160 s]
[2019-07-21T16:28:06.378Z] [INFO] SureFire JUnitCore Runner .......................... SUCCESS [02:23 min]
[2019-07-21T16:28:06.378Z] [INFO] SureFire JUnit Platform Runner ..................... SUCCESS [ 11.934 s]
[2019-07-21T16:28:06.378Z] [INFO] SureFire TestNG Utils .............................. SUCCESS [  5.741 s]
[2019-07-21T16:28:06.378Z] [INFO] SureFire TestNG Runner ............................. SUCCESS [  7.145 s]
[2019-07-21T16:28:06.378Z] [INFO] ShadeFire JUnit3 Provider .......................... SUCCESS [  2.652 s]
[2019-07-21T16:28:06.378Z] [INFO] Surefire Report Parser ............................. SUCCESS [  8.876 s]
[2019-07-21T16:28:06.378Z] [INFO] Maven Surefire Plugin .............................. SUCCESS [ 17.366 s]
[2019-07-21T16:28:06.378Z] [INFO] Maven Failsafe Plugin .............................. FAILURE [ 41.289 s]
[2019-07-21T16:28:06.378Z] [INFO] Maven Surefire Report Plugin ....................... SKIPPED
[2019-07-21T16:28:06.378Z] [INFO] Maven Surefire Integration Tests ................... SKIPPED
[2019-07-21T16:28:06.378Z] [INFO] ------------------------------------------------------------------------
[2019-07-21T16:28:06.378Z] [INFO] BUILD FAILURE
[2019-07-21T16:28:06.378Z] [INFO] ------------------------------------------------------------------------
[2019-07-21T16:28:06.378Z] [INFO] Total time: 08:09 min
[2019-07-21T16:28:06.378Z] [INFO] Finished at: 2019-07-21T09:28:05-07:00
[2019-07-21T16:28:06.378Z] [INFO] Final Memory: 50M/169M
[2019-07-21T16:28:06.378Z] [INFO] ------------------------------------------------------------------------
[2019-07-21T16:28:06.378Z] [ERROR] Failed to execute goal org.apache.maven.plugins:maven-invoker-plugin:3.2.0:run (integration-test) on project maven-failsafe-plugin: 2 builds failed. See console output above for details. -> [Help 1]
[2019-07-21T16:28:06.378Z] org.apache.maven.lifecycle.LifecycleExecutionException: Failed to execute goal org.apache.maven.plugins:maven-invoker-plugin:3.2.0:run (integration-test) on project maven-failsafe-plugin: 2 builds failed. See console output above for details.
[2019-07-21T16:28:06.378Z] 	at org.apache.maven.lifecycle.internal.MojoExecutor.execute(MojoExecutor.java:212)
[2019-07-21T16:28:06.378Z] 	at org.apache.maven.lifecycle.internal.MojoExecutor.execute(MojoExecutor.java:153)
[2019-07-21T16:28:06.378Z] 	at org.apache.maven.lifecycle.internal.MojoExecutor.execute(MojoExecutor.java:145)
[2019-07-21T16:28:06.378Z] 	at org.apache.maven.lifecycle.internal.LifecycleModuleBuilder.buildProject(LifecycleModuleBuilder.java:116)
[2019-07-21T16:28:06.378Z] 	at org.apache.maven.lifecycle.internal.LifecycleModuleBuilder.buildProject(LifecycleModuleBuilder.java:80)
[2019-07-21T16:28:06.378Z] 	at org.apache.maven.lifecycle.internal.builder.singlethreaded.SingleThreadedBuilder.build(SingleThreadedBuilder.java:51)
[2019-07-21T16:28:06.378Z] 	at org.apache.maven.lifecycle.internal.LifecycleStarter.execute(LifecycleStarter.java:120)
[2019-07-21T16:28:06.378Z] 	at org.apache.maven.DefaultMaven.doExecute(DefaultMaven.java:355)
[2019-07-21T16:28:06.378Z] 	at org.apache.maven.DefaultMaven.execute(DefaultMaven.java:155)
[2019-07-21T16:28:06.378Z] 	at org.apache.maven.cli.MavenCli.execute(MavenCli.java:584)
[2019-07-21T16:28:06.378Z] 	at org.apache.maven.cli.MavenCli.doMain(MavenCli.java:216)
[2019-07-21T16:28:06.378Z] 	at org.apache.maven.cli.MavenCli.main(MavenCli.java:160)
[2019-07-21T16:28:06.378Z] 	at sun.reflect.NativeMethodAccessorImpl.invoke0(Native Method)
[2019-07-21T16:28:06.378Z] 	at sun.reflect.NativeMethodAccessorImpl.invoke(NativeMethodAccessorImpl.java:62)
[2019-07-21T16:28:06.378Z] 	at sun.reflect.DelegatingMethodAccessorImpl.invoke(DelegatingMethodAccessorImpl.java:43)
[2019-07-21T16:28:06.378Z] 	at java.lang.reflect.Method.invoke(Method.java:498)
[2019-07-21T16:28:06.378Z] 	at org.codehaus.plexus.classworlds.launcher.Launcher.launchEnhanced(Launcher.java:289)
[2019-07-21T16:28:06.378Z] 	at org.codehaus.plexus.classworlds.launcher.Launcher.launch(Launcher.java:229)
[2019-07-21T16:28:06.378Z] 	at org.codehaus.plexus.classworlds.launcher.Launcher.mainWithExitCode(Launcher.java:415)
[2019-07-21T16:28:06.378Z] 	at org.codehaus.plexus.classworlds.launcher.Launcher.main(Launcher.java:356)
[2019-07-21T16:28:06.378Z] Caused by: org.apache.maven.plugin.MojoFailureException: 2 builds failed. See console output above for details.
[2019-07-21T16:28:06.378Z] 	at org.apache.maven.plugins.invoker.InvokerSession.handleFailures(InvokerSession.java:260)
[2019-07-21T16:28:06.378Z] 	at org.apache.maven.plugins.invoker.InvokerMojo.processResults(InvokerMojo.java:68)
[2019-07-21T16:28:06.378Z] 	at org.apache.maven.plugins.invoker.AbstractInvokerMojo.execute(AbstractInvokerMojo.java:772)
[2019-07-21T16:28:06.378Z] 	at org.apache.maven.plugin.DefaultBuildPluginManager.executeMojo(DefaultBuildPluginManager.java:132)
[2019-07-21T16:28:06.378Z] 	at org.apache.maven.lifecycle.internal.MojoExecutor.execute(MojoExecutor.java:208)
[2019-07-21T16:28:06.378Z] 	... 19 more
[2019-07-21T16:28:06.378Z] [ERROR] 
[2019-07-21T16:28:06.378Z] [ERROR] Re-run Maven using the -X switch to enable full debug logging.
[2019-07-21T16:28:06.378Z] [ERROR] 
[2019-07-21T16:28:06.378Z] [ERROR] For more information about the errors and possible solutions, please read the following articles:
[2019-07-21T16:28:06.378Z] [ERROR] [Help 1] http://cwiki.apache.org/confluence/display/MAVEN/MojoFailureException
[2019-07-21T16:28:06.378Z] [ERROR] 
[2019-07-21T16:28:06.378Z] [ERROR] After correcting the problems, you can resume the build with the command
[2019-07-21T16:28:06.378Z] [ERROR]   mvn <goals> -rf :maven-failsafe-plugin
[Pipeline] }
[Pipeline] // withEnv
[Pipeline] }
[2019-07-21T16:28:06.528Z] [INFO]           working-directory\pom.xml ........................ SUCCESS (2.5 s)
[2019-07-21T16:28:06.528Z] [INFO] -------------------------------------------------
[2019-07-21T16:28:06.528Z] [INFO] Build Summary:
[2019-07-21T16:28:06.528Z] [INFO]   Passed: 3, Failed: 2, Errors: 0, Skipped: 0
[2019-07-21T16:28:06.528Z] [INFO] -------------------------------------------------
[2019-07-21T16:28:06.528Z] [ERROR] The following builds failed:
[2019-07-21T16:28:06.528Z] [ERROR] *  jetty-war-test-failing\pom.xml
[2019-07-21T16:28:06.528Z] [ERROR] *  jetty-war-test-passing\pom.xml
[2019-07-21T16:28:06.528Z] [INFO] -------------------------------------------------
[2019-07-21T16:28:06.528Z] [INFO] ------------------------------------------------------------------------
[2019-07-21T16:28:06.528Z] [INFO] Reactor Summary:
[2019-07-21T16:28:06.528Z] [INFO] 
[2019-07-21T16:28:06.529Z] [INFO] Apache Maven Surefire .............................. SUCCESS [ 59.962 s]
[2019-07-21T16:28:06.529Z] [INFO] SureFire Logger API ................................ SUCCESS [ 23.516 s]
[2019-07-21T16:28:06.529Z] [INFO] SureFire API ....................................... SUCCESS [ 17.622 s]
[2019-07-21T16:28:06.529Z] [INFO] Surefire Extensions API ............................ SUCCESS [  3.386 s]
[2019-07-21T16:28:06.529Z] [INFO] SureFire Booter .................................... SUCCESS [ 17.446 s]
[2019-07-21T16:28:06.529Z] [INFO] Maven Surefire Test-Grouping Support ............... SUCCESS [ 11.356 s]
[2019-07-21T16:28:06.529Z] [INFO] SureFire Providers ................................. SUCCESS [  1.179 s]
[2019-07-21T16:28:06.529Z] [INFO] Shared JUnit3 Provider Code ........................ SUCCESS [  5.430 s]
[2019-07-21T16:28:06.529Z] [INFO] Shared Java 5 Provider Base ........................ SUCCESS [  7.374 s]
[2019-07-21T16:28:06.529Z] [INFO] Shared JUnit4 Provider Code ........................ SUCCESS [  7.539 s]
[2019-07-21T16:28:06.529Z] [INFO] Shared JUnit48 Provider Code ....................... SUCCESS [  8.692 s]
[2019-07-21T16:28:06.529Z] [INFO] SureFire JUnit Runner .............................. SUCCESS [  5.317 s]
[2019-07-21T16:28:06.529Z] [INFO] SureFire JUnit4 Runner ............................. SUCCESS [ 35.684 s]
[2019-07-21T16:28:06.529Z] [INFO] Maven Surefire Common .............................. SUCCESS [ 46.489 s]
[2019-07-21T16:28:06.529Z] [INFO] SureFire JUnitCore Runner .......................... SUCCESS [02:25 min]
[2019-07-21T16:28:06.529Z] [INFO] SureFire JUnit Platform Runner ..................... SUCCESS [ 11.615 s]
[2019-07-21T16:28:06.529Z] [INFO] SureFire TestNG Utils .............................. SUCCESS [  5.784 s]
[2019-07-21T16:28:06.529Z] [INFO] SureFire TestNG Runner ............................. SUCCESS [  6.464 s]
[2019-07-21T16:28:06.529Z] [INFO] ShadeFire JUnit3 Provider .......................... SUCCESS [  2.625 s]
[2019-07-21T16:28:06.529Z] [INFO] Surefire Report Parser ............................. SUCCESS [  8.350 s]
[2019-07-21T16:28:06.529Z] [INFO] Maven Surefire Plugin .............................. SUCCESS [ 15.943 s]
[2019-07-21T16:28:06.529Z] [INFO] Maven Failsafe Plugin .............................. FAILURE [ 40.697 s]
[2019-07-21T16:28:06.529Z] [INFO] Maven Surefire Report Plugin ....................... SKIPPED
[2019-07-21T16:28:06.529Z] [INFO] Maven Surefire Integration Tests ................... SKIPPED
[2019-07-21T16:28:06.529Z] [INFO] ------------------------------------------------------------------------
[2019-07-21T16:28:06.529Z] [INFO] BUILD FAILURE
[2019-07-21T16:28:06.529Z] [INFO] ------------------------------------------------------------------------
[2019-07-21T16:28:06.529Z] [INFO] Total time: 08:09 min
[2019-07-21T16:28:06.529Z] [INFO] Finished at: 2019-07-21T09:28:06-07:00
[Pipeline] // stage
[Pipeline] fileExists
[Pipeline] zip
[2019-07-21T16:28:06.634Z] Writing zip file of C:\Users\jenkins\AppData\Local\Temp\2\jenkins-maven-box-maven-surefire-SUREFIRE-1675-18\maven-failsafe-plugin\target\it to C:\Users\jenkins\AppData\Local\Temp\2\jenkins-maven-box-maven-surefire-SUREFIRE-1675-18\maven-failsafe-plugin--windows-jdk13-maven3.2.x.zip
[2019-07-21T16:28:06.764Z] Zipped 27 entries.
[2019-07-21T16:28:06.764Z] Archiving C:\Users\jenkins\AppData\Local\Temp\2\jenkins-maven-box-maven-surefire-SUREFIRE-1675-18\maven-failsafe-plugin--windows-jdk13-maven3.2.x.zip
[2019-07-21T16:28:06.765Z] [Fast Archiver] No artifacts from Maven TLP » maven-surefire » SUREFIRE-1675 #6 to compare, so performing full copy of artifacts
[Pipeline] fileExists
[2019-07-21T16:28:06.797Z] [INFO] Final Memory: 49M/163M
[2019-07-21T16:28:06.797Z] [INFO] ------------------------------------------------------------------------
[2019-07-21T16:28:06.797Z] [ERROR] Failed to execute goal org.apache.maven.plugins:maven-invoker-plugin:3.2.0:run (integration-test) on project maven-failsafe-plugin: 2 builds failed. See console output above for details. -> [Help 1]
[2019-07-21T16:28:06.797Z] org.apache.maven.lifecycle.LifecycleExecutionException: Failed to execute goal org.apache.maven.plugins:maven-invoker-plugin:3.2.0:run (integration-test) on project maven-failsafe-plugin: 2 builds failed. See console output above for details.
[2019-07-21T16:28:06.797Z] 	at org.apache.maven.lifecycle.internal.MojoExecutor.execute(MojoExecutor.java:212)
[2019-07-21T16:28:06.797Z] 	at org.apache.maven.lifecycle.internal.MojoExecutor.execute(MojoExecutor.java:153)
[2019-07-21T16:28:06.797Z] 	at org.apache.maven.lifecycle.internal.MojoExecutor.execute(MojoExecutor.java:145)
[2019-07-21T16:28:06.797Z] 	at org.apache.maven.lifecycle.internal.LifecycleModuleBuilder.buildProject(LifecycleModuleBuilder.java:116)
[2019-07-21T16:28:06.797Z] 	at org.apache.maven.lifecycle.internal.LifecycleModuleBuilder.buildProject(LifecycleModuleBuilder.java:80)
[2019-07-21T16:28:06.797Z] 	at org.apache.maven.lifecycle.internal.builder.singlethreaded.SingleThreadedBuilder.build(SingleThreadedBuilder.java:51)
[2019-07-21T16:28:06.797Z] 	at org.apache.maven.lifecycle.internal.LifecycleStarter.execute(LifecycleStarter.java:120)
[2019-07-21T16:28:06.797Z] 	at org.apache.maven.DefaultMaven.doExecute(DefaultMaven.java:355)
[2019-07-21T16:28:06.797Z] 	at org.apache.maven.DefaultMaven.execute(DefaultMaven.java:155)
[2019-07-21T16:28:06.797Z] 	at org.apache.maven.cli.MavenCli.execute(MavenCli.java:584)
[2019-07-21T16:28:06.797Z] 	at org.apache.maven.cli.MavenCli.doMain(MavenCli.java:216)
[2019-07-21T16:28:06.797Z] 	at org.apache.maven.cli.MavenCli.main(MavenCli.java:160)
[2019-07-21T16:28:06.797Z] 	at sun.reflect.NativeMethodAccessorImpl.invoke0(Native Method)
[2019-07-21T16:28:06.797Z] 	at sun.reflect.NativeMethodAccessorImpl.invoke(NativeMethodAccessorImpl.java:62)
[2019-07-21T16:28:06.797Z] 	at sun.reflect.DelegatingMethodAccessorImpl.invoke(DelegatingMethodAccessorImpl.java:43)
[2019-07-21T16:28:06.797Z] 	at java.lang.reflect.Method.invoke(Method.java:498)
[2019-07-21T16:28:06.797Z] 	at org.codehaus.plexus.classworlds.launcher.Launcher.launchEnhanced(Launcher.java:289)
[2019-07-21T16:28:06.797Z] 	at org.codehaus.plexus.classworlds.launcher.Launcher.launch(Launcher.java:229)
[2019-07-21T16:28:06.798Z] 	at org.codehaus.plexus.classworlds.launcher.Launcher.mainWithExitCode(Launcher.java:415)
[2019-07-21T16:28:06.798Z] 	at org.codehaus.plexus.classworlds.launcher.Launcher.main(Launcher.java:356)
[2019-07-21T16:28:06.798Z] Caused by: org.apache.maven.plugin.MojoFailureException: 2 builds failed. See console output above for details.
[2019-07-21T16:28:06.798Z] 	at org.apache.maven.plugins.invoker.InvokerSession.handleFailures(InvokerSession.java:260)
[2019-07-21T16:28:06.798Z] 	at org.apache.maven.plugins.invoker.InvokerMojo.processResults(InvokerMojo.java:68)
[2019-07-21T16:28:06.798Z] 	at org.apache.maven.plugins.invoker.AbstractInvokerMojo.execute(AbstractInvokerMojo.java:772)
[2019-07-21T16:28:06.798Z] 	at org.apache.maven.plugin.DefaultBuildPluginManager.executeMojo(DefaultBuildPluginManager.java:132)
[2019-07-21T16:28:06.798Z] 	at org.apache.maven.lifecycle.internal.MojoExecutor.execute(MojoExecutor.java:208)
[2019-07-21T16:28:06.798Z] 	... 19 more
[2019-07-21T16:28:06.798Z] [ERROR] 
[2019-07-21T16:28:06.798Z] [ERROR] Re-run Maven using the -X switch to enable full debug logging.
[2019-07-21T16:28:06.798Z] [ERROR] 
[2019-07-21T16:28:06.798Z] [ERROR] For more information about the errors and possible solutions, please read the following articles:
[2019-07-21T16:28:06.798Z] [ERROR] [Help 1] http://cwiki.apache.org/confluence/display/MAVEN/MojoFailureException
[2019-07-21T16:28:06.798Z] [ERROR] 
[2019-07-21T16:28:06.798Z] [ERROR] After correcting the problems, you can resume the build with the command
[2019-07-21T16:28:06.798Z] [ERROR]   mvn <goals> -rf :maven-failsafe-plugin
[Pipeline] archiveArtifacts
[2019-07-21T16:28:06.826Z] Archiving artifacts
[2019-07-21T16:28:06.845Z] [Fast Archiver] No artifacts from Maven TLP » maven-surefire » SUREFIRE-1675 #6 to compare, so performing full copy of artifacts
[Pipeline] }
[Pipeline] // withEnv
[Pipeline] cleanWs
[Pipeline] }
[2019-07-21T16:28:06.929Z] [WS-CLEANUP] Deleting project workspace...
[2019-07-21T16:28:06.929Z] [WS-CLEANUP] Deferred wipeout is used...
[Pipeline] // stage
[2019-07-21T16:28:06.971Z] [WS-CLEANUP] done
[Pipeline] fileExists
[Pipeline] }
[Pipeline] zip
[2019-07-21T16:28:07.074Z] Writing zip file of C:\Users\jenkins\AppData\Local\Temp\2\jenkins-maven-box-maven-surefire-SUREFIRE-1675-18@2\maven-failsafe-plugin\target\it to C:\Users\jenkins\AppData\Local\Temp\2\jenkins-maven-box-maven-surefire-SUREFIRE-1675-18@2\maven-failsafe-plugin--windows-jdk12-maven3.2.x.zip
[Pipeline] // ws
[Pipeline] }
[Pipeline] // timestamps
[Pipeline] }
[Pipeline] // node
[Pipeline] }
[2019-07-21T16:28:08.656Z] Zipped 27 entries.
[2019-07-21T16:28:08.656Z] Archiving C:\Users\jenkins\AppData\Local\Temp\2\jenkins-maven-box-maven-surefire-SUREFIRE-1675-18@2\maven-failsafe-plugin--windows-jdk12-maven3.2.x.zip
[2019-07-21T16:28:08.657Z] [Fast Archiver] No artifacts from Maven TLP » maven-surefire » SUREFIRE-1675 #6 to compare, so performing full copy of artifacts
[Pipeline] fileExists
[Pipeline] archiveArtifacts
[2019-07-21T16:28:08.768Z] Archiving artifacts
[2019-07-21T16:28:08.799Z] [Fast Archiver] No artifacts from Maven TLP » maven-surefire » SUREFIRE-1675 #6 to compare, so performing full copy of artifacts
[Pipeline] cleanWs
[2019-07-21T16:28:08.847Z] [WS-CLEANUP] Deleting project workspace...
[2019-07-21T16:28:08.847Z] [WS-CLEANUP] Deferred wipeout is used...
[2019-07-21T16:28:08.887Z] [WS-CLEANUP] done
[Pipeline] }
[Pipeline] // ws
[Pipeline] }
[Pipeline] // timestamps
[Pipeline] }
[Pipeline] // node
[Pipeline] }
[Pipeline] // parallel
[Pipeline] echo
Build result: FAILURE
[Pipeline] jiraIssueSelector
[Pipeline] emailext