You are viewing a plain text version of this content. The canonical link for it is here.
Posted to builds@solr.apache.org by Apache Jenkins Server <je...@builds.apache.org> on 2024/08/09 06:40:24 UTC
[JENKINS] Solr » Solr-Check-main-s390x - Build # 688 - Unstable!
Build: https://ci-builds.apache.org/job/Solr/job/Solr-Check-main-s390x/688/
2 tests failed.
FAILED: org.apache.solr.cli.ZkSubcommandsTest.testPutFileCompressed
Error Message:
Should get back what we put in ZK: array lengths differed, expected.length=858 actual.length=859; arrays first differed at element [324]; expected:<64> but was:<-103>
Stack Trace:
Should get back what we put in ZK: array lengths differed, expected.length=858 actual.length=859; arrays first differed at element [324]; expected:<64> but was:<-103>
at __randomizedtesting.SeedInfo.seed([63A8B31DA4680360:F765C7E82DD0D628]:0)
at org.junit.internal.ComparisonCriteria.arrayEquals(ComparisonCriteria.java:78)
at org.junit.internal.ComparisonCriteria.arrayEquals(ComparisonCriteria.java:28)
at org.junit.Assert.internalArrayEquals(Assert.java:534)
at org.junit.Assert.assertArrayEquals(Assert.java:343)
at org.apache.solr.cli.ZkSubcommandsTest.testPutFileCompressed(ZkSubcommandsTest.java:302)
at java.base/jdk.internal.reflect.NativeMethodAccessorImpl.invoke0(Native Method)
at java.base/jdk.internal.reflect.NativeMethodAccessorImpl.invoke(NativeMethodAccessorImpl.java:62)
at java.base/jdk.internal.reflect.DelegatingMethodAccessorImpl.invoke(DelegatingMethodAccessorImpl.java:43)
at java.base/java.lang.reflect.Method.invoke(Method.java:566)
at com.carrotsearch.randomizedtesting.RandomizedRunner.invoke(RandomizedRunner.java:1758)
at com.carrotsearch.randomizedtesting.RandomizedRunner$8.evaluate(RandomizedRunner.java:946)
at com.carrotsearch.randomizedtesting.RandomizedRunner$9.evaluate(RandomizedRunner.java:982)
at com.carrotsearch.randomizedtesting.RandomizedRunner$10.evaluate(RandomizedRunner.java:996)
at com.carrotsearch.randomizedtesting.rules.SystemPropertiesRestoreRule$1.evaluate(SystemPropertiesRestoreRule.java:80)
at org.junit.rules.RunRules.evaluate(RunRules.java:20)
at org.apache.lucene.tests.util.TestRuleSetupTeardownChained$1.evaluate(TestRuleSetupTeardownChained.java:48)
at org.apache.lucene.tests.util.AbstractBeforeAfterRule$1.evaluate(AbstractBeforeAfterRule.java:43)
at org.apache.lucene.tests.util.TestRuleThreadAndTestName$1.evaluate(TestRuleThreadAndTestName.java:45)
at org.apache.lucene.tests.util.TestRuleIgnoreAfterMaxFailures$1.evaluate(TestRuleIgnoreAfterMaxFailures.java:60)
at org.apache.lucene.tests.util.TestRuleMarkFailure$1.evaluate(TestRuleMarkFailure.java:44)
at org.junit.rules.RunRules.evaluate(RunRules.java:20)
at com.carrotsearch.randomizedtesting.rules.StatementAdapter.evaluate(StatementAdapter.java:36)
at com.carrotsearch.randomizedtesting.ThreadLeakControl$StatementRunner.run(ThreadLeakControl.java:390)
at com.carrotsearch.randomizedtesting.ThreadLeakControl.forkTimeoutingTask(ThreadLeakControl.java:843)
at com.carrotsearch.randomizedtesting.ThreadLeakControl$3.evaluate(ThreadLeakControl.java:490)
at com.carrotsearch.randomizedtesting.RandomizedRunner.runSingleTest(RandomizedRunner.java:955)
at com.carrotsearch.randomizedtesting.RandomizedRunner$5.evaluate(RandomizedRunner.java:840)
at com.carrotsearch.randomizedtesting.RandomizedRunner$6.evaluate(RandomizedRunner.java:891)
at com.carrotsearch.randomizedtesting.RandomizedRunner$7.evaluate(RandomizedRunner.java:902)
at com.carrotsearch.randomizedtesting.rules.StatementAdapter.evaluate(StatementAdapter.java:36)
at com.carrotsearch.randomizedtesting.rules.StatementAdapter.evaluate(StatementAdapter.java:36)
at org.apache.lucene.tests.util.AbstractBeforeAfterRule$1.evaluate(AbstractBeforeAfterRule.java:43)
at com.carrotsearch.randomizedtesting.rules.SystemPropertiesRestoreRule$1.evaluate(SystemPropertiesRestoreRule.java:80)
at org.junit.rules.RunRules.evaluate(RunRules.java:20)
at org.apache.lucene.tests.util.AbstractBeforeAfterRule$1.evaluate(AbstractBeforeAfterRule.java:43)
at com.carrotsearch.randomizedtesting.rules.StatementAdapter.evaluate(StatementAdapter.java:36)
at org.apache.lucene.tests.util.TestRuleStoreClassName$1.evaluate(TestRuleStoreClassName.java:38)
at com.carrotsearch.randomizedtesting.rules.NoShadowingOrOverridesOnMethodsRule$1.evaluate(NoShadowingOrOverridesOnMethodsRule.java:40)
at com.carrotsearch.randomizedtesting.rules.NoShadowingOrOverridesOnMethodsRule$1.evaluate(NoShadowingOrOverridesOnMethodsRule.java:40)
at com.carrotsearch.randomizedtesting.rules.StatementAdapter.evaluate(StatementAdapter.java:36)
at com.carrotsearch.randomizedtesting.rules.StatementAdapter.evaluate(StatementAdapter.java:36)
at org.apache.lucene.tests.util.TestRuleAssertionsRequired$1.evaluate(TestRuleAssertionsRequired.java:53)
at org.apache.lucene.tests.util.AbstractBeforeAfterRule$1.evaluate(AbstractBeforeAfterRule.java:43)
at org.apache.lucene.tests.util.TestRuleMarkFailure$1.evaluate(TestRuleMarkFailure.java:44)
at org.apache.lucene.tests.util.TestRuleIgnoreAfterMaxFailures$1.evaluate(TestRuleIgnoreAfterMaxFailures.java:60)
at org.apache.lucene.tests.util.TestRuleIgnoreTestSuites$1.evaluate(TestRuleIgnoreTestSuites.java:47)
at org.junit.rules.RunRules.evaluate(RunRules.java:20)
at com.carrotsearch.randomizedtesting.rules.StatementAdapter.evaluate(StatementAdapter.java:36)
at com.carrotsearch.randomizedtesting.ThreadLeakControl$StatementRunner.run(ThreadLeakControl.java:390)
at com.carrotsearch.randomizedtesting.ThreadLeakControl.lambda$forkTimeoutingTask$0(ThreadLeakControl.java:850)
at java.base/java.lang.Thread.run(Thread.java:829)
Caused by: java.lang.AssertionError: expected:<64> but was:<-103>
at org.junit.Assert.fail(Assert.java:89)
at org.junit.Assert.failNotEquals(Assert.java:835)
at org.junit.Assert.assertEquals(Assert.java:120)
at org.junit.Assert.assertEquals(Assert.java:146)
at org.junit.internal.ExactComparisonCriteria.assertElementsEqual(ExactComparisonCriteria.java:8)
at org.junit.internal.ComparisonCriteria.arrayEquals(ComparisonCriteria.java:76)
... 50 more
FAILED: org.apache.solr.search.facet.SpatialHeatmapFacetsTest.testClassicFacets
Error Message:
java.lang.AssertionError: .facet_counts.facet_heatmaps.srpt_quad.counts_png:[B@69e98509!=[B@40ae590c
Stack Trace:
java.lang.AssertionError: .facet_counts.facet_heatmaps.srpt_quad.counts_png:[B@69e98509!=[B@40ae590c
at __randomizedtesting.SeedInfo.seed([63A8B31DA4680360:7169422E432F8095]:0)
at org.junit.Assert.fail(Assert.java:89)
at org.apache.solr.BaseDistributedSearchTestCase.compareSolrResponses(BaseDistributedSearchTestCase.java:981)
at org.apache.solr.BaseDistributedSearchTestCase.compareResponses(BaseDistributedSearchTestCase.java:1011)
at org.apache.solr.BaseDistributedSearchTestCase.query(BaseDistributedSearchTestCase.java:646)
at org.apache.solr.BaseDistributedSearchTestCase.query(BaseDistributedSearchTestCase.java:617)
at org.apache.solr.search.facet.SpatialHeatmapFacetsTest.testClassicFacets(SpatialHeatmapFacetsTest.java:258)
at java.base/jdk.internal.reflect.NativeMethodAccessorImpl.invoke0(Native Method)
at java.base/jdk.internal.reflect.NativeMethodAccessorImpl.invoke(NativeMethodAccessorImpl.java:62)
at java.base/jdk.internal.reflect.DelegatingMethodAccessorImpl.invoke(DelegatingMethodAccessorImpl.java:43)
at java.base/java.lang.reflect.Method.invoke(Method.java:566)
at com.carrotsearch.randomizedtesting.RandomizedRunner.invoke(RandomizedRunner.java:1758)
at com.carrotsearch.randomizedtesting.RandomizedRunner$8.evaluate(RandomizedRunner.java:946)
at com.carrotsearch.randomizedtesting.RandomizedRunner$9.evaluate(RandomizedRunner.java:982)
at com.carrotsearch.randomizedtesting.RandomizedRunner$10.evaluate(RandomizedRunner.java:996)
at org.apache.solr.BaseDistributedSearchTestCase$ShardsRepeatRule$ShardsFixedStatement.callStatement(BaseDistributedSearchTestCase.java:1069)
at org.apache.solr.BaseDistributedSearchTestCase$ShardsRepeatRule$ShardsStatement.evaluate(BaseDistributedSearchTestCase.java:1040)
at com.carrotsearch.randomizedtesting.rules.SystemPropertiesRestoreRule$1.evaluate(SystemPropertiesRestoreRule.java:80)
at org.junit.rules.RunRules.evaluate(RunRules.java:20)
at org.apache.lucene.tests.util.TestRuleSetupTeardownChained$1.evaluate(TestRuleSetupTeardownChained.java:48)
at org.apache.lucene.tests.util.AbstractBeforeAfterRule$1.evaluate(AbstractBeforeAfterRule.java:43)
at org.apache.lucene.tests.util.TestRuleThreadAndTestName$1.evaluate(TestRuleThreadAndTestName.java:45)
at org.apache.lucene.tests.util.TestRuleIgnoreAfterMaxFailures$1.evaluate(TestRuleIgnoreAfterMaxFailures.java:60)
at org.apache.lucene.tests.util.TestRuleMarkFailure$1.evaluate(TestRuleMarkFailure.java:44)
at org.junit.rules.RunRules.evaluate(RunRules.java:20)
at com.carrotsearch.randomizedtesting.rules.StatementAdapter.evaluate(StatementAdapter.java:36)
at com.carrotsearch.randomizedtesting.ThreadLeakControl$StatementRunner.run(ThreadLeakControl.java:390)
at com.carrotsearch.randomizedtesting.ThreadLeakControl.forkTimeoutingTask(ThreadLeakControl.java:843)
at com.carrotsearch.randomizedtesting.ThreadLeakControl$3.evaluate(ThreadLeakControl.java:490)
at com.carrotsearch.randomizedtesting.RandomizedRunner.runSingleTest(RandomizedRunner.java:955)
at com.carrotsearch.randomizedtesting.RandomizedRunner$5.evaluate(RandomizedRunner.java:840)
at com.carrotsearch.randomizedtesting.RandomizedRunner$6.evaluate(RandomizedRunner.java:891)
at com.carrotsearch.randomizedtesting.RandomizedRunner$7.evaluate(RandomizedRunner.java:902)
at com.carrotsearch.randomizedtesting.rules.StatementAdapter.evaluate(StatementAdapter.java:36)
at com.carrotsearch.randomizedtesting.rules.StatementAdapter.evaluate(StatementAdapter.java:36)
at org.apache.lucene.tests.util.AbstractBeforeAfterRule$1.evaluate(AbstractBeforeAfterRule.java:43)
at com.carrotsearch.randomizedtesting.rules.SystemPropertiesRestoreRule$1.evaluate(SystemPropertiesRestoreRule.java:80)
at org.junit.rules.RunRules.evaluate(RunRules.java:20)
at org.apache.lucene.tests.util.AbstractBeforeAfterRule$1.evaluate(AbstractBeforeAfterRule.java:43)
at com.carrotsearch.randomizedtesting.rules.StatementAdapter.evaluate(StatementAdapter.java:36)
at org.apache.lucene.tests.util.TestRuleStoreClassName$1.evaluate(TestRuleStoreClassName.java:38)
at com.carrotsearch.randomizedtesting.rules.NoShadowingOrOverridesOnMethodsRule$1.evaluate(NoShadowingOrOverridesOnMethodsRule.java:40)
at com.carrotsearch.randomizedtesting.rules.NoShadowingOrOverridesOnMethodsRule$1.evaluate(NoShadowingOrOverridesOnMethodsRule.java:40)
at com.carrotsearch.randomizedtesting.rules.StatementAdapter.evaluate(StatementAdapter.java:36)
at com.carrotsearch.randomizedtesting.rules.StatementAdapter.evaluate(StatementAdapter.java:36)
at org.apache.lucene.tests.util.TestRuleAssertionsRequired$1.evaluate(TestRuleAssertionsRequired.java:53)
at org.apache.lucene.tests.util.AbstractBeforeAfterRule$1.evaluate(AbstractBeforeAfterRule.java:43)
at org.apache.lucene.tests.util.TestRuleMarkFailure$1.evaluate(TestRuleMarkFailure.java:44)
at org.apache.lucene.tests.util.TestRuleIgnoreAfterMaxFailures$1.evaluate(TestRuleIgnoreAfterMaxFailures.java:60)
at org.apache.lucene.tests.util.TestRuleIgnoreTestSuites$1.evaluate(TestRuleIgnoreTestSuites.java:47)
at org.junit.rules.RunRules.evaluate(RunRules.java:20)
at com.carrotsearch.randomizedtesting.rules.StatementAdapter.evaluate(StatementAdapter.java:36)
at com.carrotsearch.randomizedtesting.ThreadLeakControl$StatementRunner.run(ThreadLeakControl.java:390)
at com.carrotsearch.randomizedtesting.ThreadLeakControl.lambda$forkTimeoutingTask$0(ThreadLeakControl.java:850)
at java.base/java.lang.Thread.run(Thread.java:829)
Build Log:
[...truncated 1055 lines...]
2> ERROR: KeeperErrorCode = NoNode for /getFileNotExistsNode
2>
2> 194571 WARN (ZkTestServer Run Thread) [n: c: s: r: x: t:] o.a.z.s.ServerCnxnFactory maxCnxns is not configured, using default value 0.
2> 194677 WARN (TEST-ZkSubcommandsTest.testInvalidZKAddress-seed#[63A8B31DA4680360]) [n: c: s: r: x: t:] o.a.s.c.c.SolrZkClient Using default ZkCredentialsInjector. ZkCredentialsInjector is not secure, it creates an empty list of credentials which leads to 'OPEN_ACL_UNSAFE' ACLs to Zookeeper nodes
2> 194738 WARN (TEST-ZkSubcommandsTest.testInvalidZKAddress-seed#[63A8B31DA4680360]) [n: c: s: r: x: t:] o.a.s.c.c.SolrZkClient Using default ZkACLProvider. DefaultZkACLProvider is not secure, it creates 'OPEN_ACL_UNSAFE' ACLs to Zookeeper nodes
2> 194781 WARN (TEST-ZkSubcommandsTest.testInvalidZKAddress-seed#[63A8B31DA4680360]) [n: c: s: r: x: t:] o.a.s.c.c.SolrZkClient Using default ZkCredentialsInjector. ZkCredentialsInjector is not secure, it creates an empty list of credentials which leads to 'OPEN_ACL_UNSAFE' ACLs to Zookeeper nodes
2> 194830 WARN (TEST-ZkSubcommandsTest.testInvalidZKAddress-seed#[63A8B31DA4680360]) [n: c: s: r: x: t:] o.a.s.c.c.SolrZkClient Using default ZkACLProvider. DefaultZkACLProvider is not secure, it creates 'OPEN_ACL_UNSAFE' ACLs to Zookeeper nodes
2> 194830 WARN (TEST-ZkSubcommandsTest.testInvalidZKAddress-seed#[63A8B31DA4680360]) [n: c: s: r: x: t:] o.a.s.c.c.SolrZkClient Using default ZkCredentialsInjector. ZkCredentialsInjector is not secure, it creates an empty list of credentials which leads to 'OPEN_ACL_UNSAFE' ACLs to Zookeeper nodes
2> 194840 WARN (TEST-ZkSubcommandsTest.testInvalidZKAddress-seed#[63A8B31DA4680360]) [n: c: s: r: x: t:] o.a.s.c.c.SolrZkClient Using default ZkACLProvider. DefaultZkACLProvider is not secure, it creates 'OPEN_ACL_UNSAFE' ACLs to Zookeeper nodes
2> 194869 WARN (TEST-ZkSubcommandsTest.testInvalidZKAddress-seed#[63A8B31DA4680360]) [n: c: s: r: x: t:] o.a.s.c.c.SolrZkClient Using default ZkCredentialsInjector. ZkCredentialsInjector is not secure, it creates an empty list of credentials which leads to 'OPEN_ACL_UNSAFE' ACLs to Zookeeper nodes
2> 194881 WARN (TEST-ZkSubcommandsTest.testInvalidZKAddress-seed#[63A8B31DA4680360]-SendThread()) [n: c: s: r: x: t:] o.a.z.ClientCnxn Session 0x0 for server null, Closing socket connection. Attempting reconnect except it is a SessionExpiredException.
2> => java.security.AccessControlException: access denied ("java.net.SocketPermission" "----------" "resolve")
2> at java.base/java.security.AccessControlContext.checkPermission(AccessControlContext.java:472)
2> java.security.AccessControlException: access denied ("java.net.SocketPermission" "----------" "resolve")
2> at java.base/java.security.AccessControlContext.checkPermission(AccessControlContext.java:472) ~[?:?]
2> at java.base/java.security.AccessController.checkPermission(AccessController.java:897) ~[?:?]
2> at java.base/java.lang.SecurityManager.checkPermission(SecurityManager.java:322) ~[?:?]
2> at java.base/java.lang.SecurityManager.checkConnect(SecurityManager.java:821) ~[?:?]
2> at java.base/java.net.InetAddress.getAllByName0(InetAddress.java:1467) ~[?:?]
2> at java.base/java.net.InetAddress.getAllByName(InetAddress.java:1378) ~[?:?]
2> at java.base/java.net.InetAddress.getAllByName(InetAddress.java:1306) ~[?:?]
2> at org.apache.zookeeper.client.StaticHostProvider$1.getAllByName(StaticHostProvider.java:88) ~[zookeeper-3.9.2.jar:3.9.2]
2> at org.apache.zookeeper.client.StaticHostProvider.resolve(StaticHostProvider.java:141) ~[zookeeper-3.9.2.jar:3.9.2]
2> at org.apache.zookeeper.client.StaticHostProvider.next(StaticHostProvider.java:368) ~[zookeeper-3.9.2.jar:3.9.2]
2> at org.apache.zookeeper.ClientCnxn$SendThread.run(ClientCnxn.java:1189) [zookeeper-3.9.2.jar:3.9.2]
2> 195986 WARN (TEST-ZkSubcommandsTest.testInvalidZKAddress-seed#[63A8B31DA4680360]-SendThread()) [n: c: s: r: x: t:] o.a.z.ClientCnxn Session 0x0 for server null, Closing socket connection. Attempting reconnect except it is a SessionExpiredException.
2> => java.security.AccessControlException: access denied ("java.net.SocketPermission" "----------" "resolve")
2> at java.base/java.security.AccessControlContext.checkPermission(AccessControlContext.java:472)
2> java.security.AccessControlException: access denied ("java.net.SocketPermission" "----------" "resolve")
2> at java.base/java.security.AccessControlContext.checkPermission(AccessControlContext.java:472) ~[?:?]
2> at java.base/java.security.AccessController.checkPermission(AccessController.java:897) ~[?:?]
2> at java.base/java.lang.SecurityManager.checkPermission(SecurityManager.java:322) ~[?:?]
2> at java.base/java.lang.SecurityManager.checkConnect(SecurityManager.java:821) ~[?:?]
2> at java.base/java.net.InetAddress.getAllByName0(InetAddress.java:1467) ~[?:?]
2> at java.base/java.net.InetAddress.getAllByName(InetAddress.java:1378) ~[?:?]
2> at java.base/java.net.InetAddress.getAllByName(InetAddress.java:1306) ~[?:?]
2> at org.apache.zookeeper.client.StaticHostProvider$1.getAllByName(StaticHostProvider.java:88) ~[zookeeper-3.9.2.jar:3.9.2]
2> at org.apache.zookeeper.client.StaticHostProvider.resolve(StaticHostProvider.java:141) ~[zookeeper-3.9.2.jar:3.9.2]
2> at org.apache.zookeeper.client.StaticHostProvider.next(StaticHostProvider.java:368) ~[zookeeper-3.9.2.jar:3.9.2]
2> at org.apache.zookeeper.ClientCnxn$SendThread.run(ClientCnxn.java:1189) [zookeeper-3.9.2.jar:3.9.2]
2> 197090 WARN (TEST-ZkSubcommandsTest.testInvalidZKAddress-seed#[63A8B31DA4680360]-SendThread()) [n: c: s: r: x: t:] o.a.z.ClientCnxn Session 0x0 for server null, Closing socket connection. Attempting reconnect except it is a SessionExpiredException.
2> => java.security.AccessControlException: access denied ("java.net.SocketPermission" "----------" "resolve")
2> at java.base/java.security.AccessControlContext.checkPermission(AccessControlContext.java:472)
2> java.security.AccessControlException: access denied ("java.net.SocketPermission" "----------" "resolve")
2> at java.base/java.security.AccessControlContext.checkPermission(AccessControlContext.java:472) ~[?:?]
2> at java.base/java.security.AccessController.checkPermission(AccessController.java:897) ~[?:?]
2> at java.base/java.lang.SecurityManager.checkPermission(SecurityManager.java:322) ~[?:?]
2> at java.base/java.lang.SecurityManager.checkConnect(SecurityManager.java:821) ~[?:?]
2> at java.base/java.net.InetAddress.getAllByName0(InetAddress.java:1467) ~[?:?]
2> at java.base/java.net.InetAddress.getAllByName(InetAddress.java:1378) ~[?:?]
2> at java.base/java.net.InetAddress.getAllByName(InetAddress.java:1306) ~[?:?]
2> at org.apache.zookeeper.client.StaticHostProvider$1.getAllByName(StaticHostProvider.java:88) ~[zookeeper-3.9.2.jar:3.9.2]
2> at org.apache.zookeeper.client.StaticHostProvider.resolve(StaticHostProvider.java:141) ~[zookeeper-3.9.2.jar:3.9.2]
2> at org.apache.zookeeper.client.StaticHostProvider.next(StaticHostProvider.java:368) ~[zookeeper-3.9.2.jar:3.9.2]
2> at org.apache.zookeeper.ClientCnxn$SendThread.run(ClientCnxn.java:1189) [zookeeper-3.9.2.jar:3.9.2]
2> 198195 WARN (TEST-ZkSubcommandsTest.testInvalidZKAddress-seed#[63A8B31DA4680360]-SendThread()) [n: c: s: r: x: t:] o.a.z.ClientCnxn Session 0x0 for server null, Closing socket connection. Attempting reconnect except it is a SessionExpiredException.
2> => java.security.AccessControlException: access denied ("java.net.SocketPermission" "----------" "resolve")
2> at java.base/java.security.AccessControlContext.checkPermission(AccessControlContext.java:472)
2> java.security.AccessControlException: access denied ("java.net.SocketPermission" "----------" "resolve")
2> at java.base/java.security.AccessControlContext.checkPermission(AccessControlContext.java:472) ~[?:?]
2> at java.base/java.security.AccessController.checkPermission(AccessController.java:897) ~[?:?]
2> at java.base/java.lang.SecurityManager.checkPermission(SecurityManager.java:322) ~[?:?]
2> at java.base/java.lang.SecurityManager.checkConnect(SecurityManager.java:821) ~[?:?]
2> at java.base/java.net.InetAddress.getAllByName0(InetAddress.java:1467) ~[?:?]
2> at java.base/java.net.InetAddress.getAllByName(InetAddress.java:1378) ~[?:?]
2> at java.base/java.net.InetAddress.getAllByName(InetAddress.java:1306) ~[?:?]
2> at org.apache.zookeeper.client.StaticHostProvider$1.getAllByName(StaticHostProvider.java:88) ~[zookeeper-3.9.2.jar:3.9.2]
2> at org.apache.zookeeper.client.StaticHostProvider.resolve(StaticHostProvider.java:141) ~[zookeeper-3.9.2.jar:3.9.2]
2> at org.apache.zookeeper.client.StaticHostProvider.next(StaticHostProvider.java:368) ~[zookeeper-3.9.2.jar:3.9.2]
2> at org.apache.zookeeper.ClientCnxn$SendThread.run(ClientCnxn.java:1189) [zookeeper-3.9.2.jar:3.9.2]
2> 199334 WARN (TEST-ZkSubcommandsTest.testInvalidZKAddress-seed#[63A8B31DA4680360]-SendThread()) [n: c: s: r: x: t:] o.a.z.ClientCnxn Session 0x0 for server null, Closing socket connection. Attempting reconnect except it is a SessionExpiredException.
2> => java.security.AccessControlException: access denied ("java.net.SocketPermission" "----------" "resolve")
2> at java.base/java.security.AccessControlContext.checkPermission(AccessControlContext.java:472)
2> java.security.AccessControlException: access denied ("java.net.SocketPermission" "----------" "resolve")
2> at java.base/java.security.AccessControlContext.checkPermission(AccessControlContext.java:472) ~[?:?]
2> at java.base/java.security.AccessController.checkPermission(AccessController.java:897) ~[?:?]
2> at java.base/java.lang.SecurityManager.checkPermission(SecurityManager.java:322) ~[?:?]
2> at java.base/java.lang.SecurityManager.checkConnect(SecurityManager.java:821) ~[?:?]
2> at java.base/java.net.InetAddress.getAllByName0(InetAddress.java:1467) ~[?:?]
2> at java.base/java.net.InetAddress.getAllByName(InetAddress.java:1378) ~[?:?]
2> at java.base/java.net.InetAddress.getAllByName(InetAddress.java:1306) ~[?:?]
2> at org.apache.zookeeper.client.StaticHostProvider$1.getAllByName(StaticHostProvider.java:88) ~[zookeeper-3.9.2.jar:3.9.2]
2> at org.apache.zookeeper.client.StaticHostProvider.resolve(StaticHostProvider.java:141) ~[zookeeper-3.9.2.jar:3.9.2]
2> at org.apache.zookeeper.client.StaticHostProvider.next(StaticHostProvider.java:368) ~[zookeeper-3.9.2.jar:3.9.2]
2> at org.apache.zookeeper.ClientCnxn$SendThread.run(ClientCnxn.java:1189) [zookeeper-3.9.2.jar:3.9.2]
2> 200435 WARN (TEST-ZkSubcommandsTest.testInvalidZKAddress-seed#[63A8B31DA4680360]-SendThread()) [n: c: s: r: x: t:] o.a.z.ClientCnxn Session 0x0 for server null, Closing socket connection. Attempting reconnect except it is a SessionExpiredException.
2> => java.security.AccessControlException: access denied ("java.net.SocketPermission" "----------" "resolve")
2> at java.base/java.security.AccessControlContext.checkPermission(AccessControlContext.java:472)
2> java.security.AccessControlException: access denied ("java.net.SocketPermission" "----------" "resolve")
2> at java.base/java.security.AccessControlContext.checkPermission(AccessControlContext.java:472) ~[?:?]
2> at java.base/java.security.AccessController.checkPermission(AccessController.java:897) ~[?:?]
2> at java.base/java.lang.SecurityManager.checkPermission(SecurityManager.java:322) ~[?:?]
2> at java.base/java.lang.SecurityManager.checkConnect(SecurityManager.java:821) ~[?:?]
2> at java.base/java.net.InetAddress.getAllByName0(InetAddress.java:1467) ~[?:?]
2> at java.base/java.net.InetAddress.getAllByName(InetAddress.java:1378) ~[?:?]
2> at java.base/java.net.InetAddress.getAllByName(InetAddress.java:1306) ~[?:?]
2> at org.apache.zookeeper.client.StaticHostProvider$1.getAllByName(StaticHostProvider.java:88) ~[zookeeper-3.9.2.jar:3.9.2]
2> at org.apache.zookeeper.client.StaticHostProvider.resolve(StaticHostProvider.java:141) ~[zookeeper-3.9.2.jar:3.9.2]
2> at org.apache.zookeeper.client.StaticHostProvider.next(StaticHostProvider.java:368) ~[zookeeper-3.9.2.jar:3.9.2]
2> at org.apache.zookeeper.ClientCnxn$SendThread.run(ClientCnxn.java:1189) [zookeeper-3.9.2.jar:3.9.2]
2> 201538 WARN (TEST-ZkSubcommandsTest.testInvalidZKAddress-seed#[63A8B31DA4680360]-SendThread()) [n: c: s: r: x: t:] o.a.z.ClientCnxn Session 0x0 for server null, Closing socket connection. Attempting reconnect except it is a SessionExpiredException.
2> => java.security.AccessControlException: access denied ("java.net.SocketPermission" "----------" "resolve")
2> at java.base/java.security.AccessControlContext.checkPermission(AccessControlContext.java:472)
2> java.security.AccessControlException: access denied ("java.net.SocketPermission" "----------" "resolve")
2> at java.base/java.security.AccessControlContext.checkPermission(AccessControlContext.java:472) ~[?:?]
2> at java.base/java.security.AccessController.checkPermission(AccessController.java:897) ~[?:?]
2> at java.base/java.lang.SecurityManager.checkPermission(SecurityManager.java:322) ~[?:?]
2> at java.base/java.lang.SecurityManager.checkConnect(SecurityManager.java:821) ~[?:?]
2> at java.base/java.net.InetAddress.getAllByName0(InetAddress.java:1467) ~[?:?]
2> at java.base/java.net.InetAddress.getAllByName(InetAddress.java:1378) ~[?:?]
2> at java.base/java.net.InetAddress.getAllByName(InetAddress.java:1306) ~[?:?]
2> at org.apache.zookeeper.client.StaticHostProvider$1.getAllByName(StaticHostProvider.java:88) ~[zookeeper-3.9.2.jar:3.9.2]
2> at org.apache.zookeeper.client.StaticHostProvider.resolve(StaticHostProvider.java:141) ~[zookeeper-3.9.2.jar:3.9.2]
2> at org.apache.zookeeper.client.StaticHostProvider.next(StaticHostProvider.java:368) ~[zookeeper-3.9.2.jar:3.9.2]
2> at org.apache.zookeeper.ClientCnxn$SendThread.run(ClientCnxn.java:1189) [zookeeper-3.9.2.jar:3.9.2]
2> 202683 WARN (TEST-ZkSubcommandsTest.testInvalidZKAddress-seed#[63A8B31DA4680360]-SendThread()) [n: c: s: r: x: t:] o.a.z.ClientCnxn Session 0x0 for server null, Closing socket connection. Attempting reconnect except it is a SessionExpiredException.
2> => java.security.AccessControlException: access denied ("java.net.SocketPermission" "----------" "resolve")
2> at java.base/java.security.AccessControlContext.checkPermission(AccessControlContext.java:472)
2> java.security.AccessControlException: access denied ("java.net.SocketPermission" "----------" "resolve")
2> at java.base/java.security.AccessControlContext.checkPermission(AccessControlContext.java:472) ~[?:?]
2> at java.base/java.security.AccessController.checkPermission(AccessController.java:897) ~[?:?]
2> at java.base/java.lang.SecurityManager.checkPermission(SecurityManager.java:322) ~[?:?]
2> at java.base/java.lang.SecurityManager.checkConnect(SecurityManager.java:821) ~[?:?]
2> at java.base/java.net.InetAddress.getAllByName0(InetAddress.java:1467) ~[?:?]
2> at java.base/java.net.InetAddress.getAllByName(InetAddress.java:1378) ~[?:?]
2> at java.base/java.net.InetAddress.getAllByName(InetAddress.java:1306) ~[?:?]
2> at org.apache.zookeeper.client.StaticHostProvider$1.getAllByName(StaticHostProvider.java:88) ~[zookeeper-3.9.2.jar:3.9.2]
2> at org.apache.zookeeper.client.StaticHostProvider.resolve(StaticHostProvider.java:141) ~[zookeeper-3.9.2.jar:3.9.2]
2> at org.apache.zookeeper.client.StaticHostProvider.next(StaticHostProvider.java:368) ~[zookeeper-3.9.2.jar:3.9.2]
2> at org.apache.zookeeper.ClientCnxn$SendThread.run(ClientCnxn.java:1189) [zookeeper-3.9.2.jar:3.9.2]
2> 203784 WARN (TEST-ZkSubcommandsTest.testInvalidZKAddress-seed#[63A8B31DA4680360]-SendThread()) [n: c: s: r: x: t:] o.a.z.ClientCnxn Session 0x0 for server null, Closing socket connection. Attempting reconnect except it is a SessionExpiredException.
2> => java.security.AccessControlException: access denied ("java.net.SocketPermission" "----------" "resolve")
2> at java.base/java.security.AccessControlContext.checkPermission(AccessControlContext.java:472)
2> java.security.AccessControlException: access denied ("java.net.SocketPermission" "----------" "resolve")
2> at java.base/java.security.AccessControlContext.checkPermission(AccessControlContext.java:472) ~[?:?]
2> at java.base/java.security.AccessController.checkPermission(AccessController.java:897) ~[?:?]
2> at java.base/java.lang.SecurityManager.checkPermission(SecurityManager.java:322) ~[?:?]
2> at java.base/java.lang.SecurityManager.checkConnect(SecurityManager.java:821) ~[?:?]
2> at java.base/java.net.InetAddress.getAllByName0(InetAddress.java:1467) ~[?:?]
2> at java.base/java.net.InetAddress.getAllByName(InetAddress.java:1378) ~[?:?]
2> at java.base/java.net.InetAddress.getAllByName(InetAddress.java:1306) ~[?:?]
2> at org.apache.zookeeper.client.StaticHostProvider$1.getAllByName(StaticHostProvider.java:88) ~[zookeeper-3.9.2.jar:3.9.2]
2> at org.apache.zookeeper.client.StaticHostProvider.resolve(StaticHostProvider.java:141) ~[zookeeper-3.9.2.jar:3.9.2]
2> at org.apache.zookeeper.client.StaticHostProvider.next(StaticHostProvider.java:368) ~[zookeeper-3.9.2.jar:3.9.2]
2> at org.apache.zookeeper.ClientCnxn$SendThread.run(ClientCnxn.java:1189) [zookeeper-3.9.2.jar:3.9.2]
2> 204887 WARN (TEST-ZkSubcommandsTest.testInvalidZKAddress-seed#[63A8B31DA4680360]-SendThread()) [n: c: s: r: x: t:] o.a.z.ClientCnxn Session 0x0 for server null, Closing socket connection. Attempting reconnect except it is a SessionExpiredException.
2> => java.security.AccessControlException: access denied ("java.net.SocketPermission" "----------" "resolve")
2> at java.base/java.security.AccessControlContext.checkPermission(AccessControlContext.java:472)
2> java.security.AccessControlException: access denied ("java.net.SocketPermission" "----------" "resolve")
2> at java.base/java.security.AccessControlContext.checkPermission(AccessControlContext.java:472) ~[?:?]
2> at java.base/java.security.AccessController.checkPermission(AccessController.java:897) ~[?:?]
2> at java.base/java.lang.SecurityManager.checkPermission(SecurityManager.java:322) ~[?:?]
2> at java.base/java.lang.SecurityManager.checkConnect(SecurityManager.java:821) ~[?:?]
2> at java.base/java.net.InetAddress.getAllByName0(InetAddress.java:1467) ~[?:?]
2> at java.base/java.net.InetAddress.getAllByName(InetAddress.java:1378) ~[?:?]
2> at java.base/java.net.InetAddress.getAllByName(InetAddress.java:1306) ~[?:?]
2> at org.apache.zookeeper.client.StaticHostProvider$1.getAllByName(StaticHostProvider.java:88) ~[zookeeper-3.9.2.jar:3.9.2]
2> at org.apache.zookeeper.client.StaticHostProvider.resolve(StaticHostProvider.java:141) ~[zookeeper-3.9.2.jar:3.9.2]
2> at org.apache.zookeeper.client.StaticHostProvider.next(StaticHostProvider.java:368) ~[zookeeper-3.9.2.jar:3.9.2]
2> at org.apache.zookeeper.ClientCnxn$SendThread.run(ClientCnxn.java:1189) [zookeeper-3.9.2.jar:3.9.2]
2> 205992 WARN (TEST-ZkSubcommandsTest.testInvalidZKAddress-seed#[63A8B31DA4680360]-SendThread()) [n: c: s: r: x: t:] o.a.z.ClientCnxn Session 0x0 for server null, Closing socket connection. Attempting reconnect except it is a SessionExpiredException.
2> => java.security.AccessControlException: access denied ("java.net.SocketPermission" "----------" "resolve")
2> at java.base/java.security.AccessControlContext.checkPermission(AccessControlContext.java:472)
2> java.security.AccessControlException: access denied ("java.net.SocketPermission" "----------" "resolve")
2> at java.base/java.security.AccessControlContext.checkPermission(AccessControlContext.java:472) ~[?:?]
2> at java.base/java.security.AccessController.checkPermission(AccessController.java:897) ~[?:?]
2> at java.base/java.lang.SecurityManager.checkPermission(SecurityManager.java:322) ~[?:?]
2> at java.base/java.lang.SecurityManager.checkConnect(SecurityManager.java:821) ~[?:?]
2> at java.base/java.net.InetAddress.getAllByName0(InetAddress.java:1467) ~[?:?]
2> at java.base/java.net.InetAddress.getAllByName(InetAddress.java:1378) ~[?:?]
2> at java.base/java.net.InetAddress.getAllByName(InetAddress.java:1306) ~[?:?]
2> at org.apache.zookeeper.client.StaticHostProvider$1.getAllByName(StaticHostProvider.java:88) ~[zookeeper-3.9.2.jar:3.9.2]
2> at org.apache.zookeeper.client.StaticHostProvider.resolve(StaticHostProvider.java:141) ~[zookeeper-3.9.2.jar:3.9.2]
2> at org.apache.zookeeper.client.StaticHostProvider.next(StaticHostProvider.java:368) ~[zookeeper-3.9.2.jar:3.9.2]
2> at org.apache.zookeeper.ClientCnxn$SendThread.run(ClientCnxn.java:1189) [zookeeper-3.9.2.jar:3.9.2]
2> 207094 WARN (TEST-ZkSubcommandsTest.testInvalidZKAddress-seed#[63A8B31DA4680360]-SendThread()) [n: c: s: r: x: t:] o.a.z.ClientCnxn Session 0x0 for server null, Closing socket connection. Attempting reconnect except it is a SessionExpiredException.
2> => java.security.AccessControlException: access denied ("java.net.SocketPermission" "----------" "resolve")
2> at java.base/java.security.AccessControlContext.checkPermission(AccessControlContext.java:472)
2> java.security.AccessControlException: access denied ("java.net.SocketPermission" "----------" "resolve")
2> at java.base/java.security.AccessControlContext.checkPermission(AccessControlContext.java:472) ~[?:?]
2> at java.base/java.security.AccessController.checkPermission(AccessController.java:897) ~[?:?]
2> at java.base/java.lang.SecurityManager.checkPermission(SecurityManager.java:322) ~[?:?]
2> at java.base/java.lang.SecurityManager.checkConnect(SecurityManager.java:821) ~[?:?]
2> at java.base/java.net.InetAddress.getAllByName0(InetAddress.java:1467) ~[?:?]
2> at java.base/java.net.InetAddress.getAllByName(InetAddress.java:1378) ~[?:?]
2> at java.base/java.net.InetAddress.getAllByName(InetAddress.java:1306) ~[?:?]
2> at org.apache.zookeeper.client.StaticHostProvider$1.getAllByName(StaticHostProvider.java:88) ~[zookeeper-3.9.2.jar:3.9.2]
2> at org.apache.zookeeper.client.StaticHostProvider.resolve(StaticHostProvider.java:141) ~[zookeeper-3.9.2.jar:3.9.2]
2> at org.apache.zookeeper.client.StaticHostProvider.next(StaticHostProvider.java:368) ~[zookeeper-3.9.2.jar:3.9.2]
2> at org.apache.zookeeper.ClientCnxn$SendThread.run(ClientCnxn.java:1189) [zookeeper-3.9.2.jar:3.9.2]
2> 208200 WARN (TEST-ZkSubcommandsTest.testInvalidZKAddress-seed#[63A8B31DA4680360]-SendThread()) [n: c: s: r: x: t:] o.a.z.ClientCnxn Session 0x0 for server null, Closing socket connection. Attempting reconnect except it is a SessionExpiredException.
2> => java.security.AccessControlException: access denied ("java.net.SocketPermission" "----------" "resolve")
2> at java.base/java.security.AccessControlContext.checkPermission(AccessControlContext.java:472)
2> java.security.AccessControlException: access denied ("java.net.SocketPermission" "----------" "resolve")
2> at java.base/java.security.AccessControlContext.checkPermission(AccessControlContext.java:472) ~[?:?]
2> at java.base/java.security.AccessController.checkPermission(AccessController.java:897) ~[?:?]
2> at java.base/java.lang.SecurityManager.checkPermission(SecurityManager.java:322) ~[?:?]
2> at java.base/java.lang.SecurityManager.checkConnect(SecurityManager.java:821) ~[?:?]
2> at java.base/java.net.InetAddress.getAllByName0(InetAddress.java:1467) ~[?:?]
2> at java.base/java.net.InetAddress.getAllByName(InetAddress.java:1378) ~[?:?]
2> at java.base/java.net.InetAddress.getAllByName(InetAddress.java:1306) ~[?:?]
2> at org.apache.zookeeper.client.StaticHostProvider$1.getAllByName(StaticHostProvider.java:88) ~[zookeeper-3.9.2.jar:3.9.2]
2> at org.apache.zookeeper.client.StaticHostProvider.resolve(StaticHostProvider.java:141) ~[zookeeper-3.9.2.jar:3.9.2]
2> at org.apache.zookeeper.client.StaticHostProvider.next(StaticHostProvider.java:368) ~[zookeeper-3.9.2.jar:3.9.2]
2> at org.apache.zookeeper.ClientCnxn$SendThread.run(ClientCnxn.java:1189) [zookeeper-3.9.2.jar:3.9.2]
2> 209304 WARN (TEST-ZkSubcommandsTest.testInvalidZKAddress-seed#[63A8B31DA4680360]-SendThread()) [n: c: s: r: x: t:] o.a.z.ClientCnxn Session 0x0 for server null, Closing socket connection. Attempting reconnect except it is a SessionExpiredException.
2> => java.security.AccessControlException: access denied ("java.net.SocketPermission" "----------" "resolve")
2> at java.base/java.security.AccessControlContext.checkPermission(AccessControlContext.java:472)
2> java.security.AccessControlException: access denied ("java.net.SocketPermission" "----------" "resolve")
2> at java.base/java.security.AccessControlContext.checkPermission(AccessControlContext.java:472) ~[?:?]
2> at java.base/java.security.AccessController.checkPermission(AccessController.java:897) ~[?:?]
2> at java.base/java.lang.SecurityManager.checkPermission(SecurityManager.java:322) ~[?:?]
2> at java.base/java.lang.SecurityManager.checkConnect(SecurityManager.java:821) ~[?:?]
2> at java.base/java.net.InetAddress.getAllByName0(InetAddress.java:1467) ~[?:?]
2> at java.base/java.net.InetAddress.getAllByName(InetAddress.java:1378) ~[?:?]
2> at java.base/java.net.InetAddress.getAllByName(InetAddress.java:1306) ~[?:?]
2> at org.apache.zookeeper.client.StaticHostProvider$1.getAllByName(StaticHostProvider.java:88) ~[zookeeper-3.9.2.jar:3.9.2]
2> at org.apache.zookeeper.client.StaticHostProvider.resolve(StaticHostProvider.java:141) ~[zookeeper-3.9.2.jar:3.9.2]
2> at org.apache.zookeeper.client.StaticHostProvider.next(StaticHostProvider.java:368) ~[zookeeper-3.9.2.jar:3.9.2]
2> at org.apache.zookeeper.ClientCnxn$SendThread.run(ClientCnxn.java:1189) [zookeeper-3.9.2.jar:3.9.2]
2> 210531 ERROR (TEST-ZkSubcommandsTest.testInvalidZKAddress-seed#[63A8B31DA4680360]) [n: c: s: r: x: t:] o.a.s.c.ZkLsTool Could not complete ls operation for reason:
2> => org.apache.solr.common.SolrException: java.util.concurrent.TimeoutException: Could not connect to ZooKeeper ----------:33332 within 15000 ms
2> at org.apache.solr.common.cloud.SolrZkClient.<init>(SolrZkClient.java:219)
2> org.apache.solr.common.SolrException: java.util.concurrent.TimeoutException: Could not connect to ZooKeeper ----------:33332 within 15000 ms
2> at org.apache.solr.common.cloud.SolrZkClient.<init>(SolrZkClient.java:219) ~[solr-solrj-zookeeper-10.0.0-SNAPSHOT.jar:10.0.0-SNAPSHOT 49b24d532e777a1e8e79efa5b3b59773d8867ea4 [snapshot build, details omitted]]
2> at org.apache.solr.common.cloud.SolrZkClient.<init>(SolrZkClient.java:112) ~[solr-solrj-zookeeper-10.0.0-SNAPSHOT.jar:10.0.0-SNAPSHOT 49b24d532e777a1e8e79efa5b3b59773d8867ea4 [snapshot build, details omitted]]
2> at org.apache.solr.common.cloud.SolrZkClient$Builder.build(SolrZkClient.java:1261) ~[solr-solrj-zookeeper-10.0.0-SNAPSHOT.jar:10.0.0-SNAPSHOT 49b24d532e777a1e8e79efa5b3b59773d8867ea4 [snapshot build, details omitted]]
2> at org.apache.solr.cli.SolrCLI.getSolrZkClient(SolrCLI.java:696) ~[main/:?]
2> at org.apache.solr.cli.ZkLsTool.runImpl(ZkLsTool.java:69) [main/:?]
2> at org.apache.solr.cli.ToolBase.runTool(ToolBase.java:52) [main/:?]
2> at org.apache.solr.cli.ZkSubcommandsTest.runTool(ZkSubcommandsTest.java:698) [test/:?]
2> at org.apache.solr.cli.ZkSubcommandsTest.testInvalidZKAddress(ZkSubcommandsTest.java:629) [test/:?]
2> at java.base/jdk.internal.reflect.NativeMethodAccessorImpl.invoke0(Native Method) ~[?:?]
2> at java.base/jdk.internal.reflect.NativeMethodAccessorImpl.invoke(NativeMethodAccessorImpl.java:62) ~[?:?]
2> at java.base/jdk.internal.reflect.DelegatingMethodAccessorImpl.invoke(DelegatingMethodAccessorImpl.java:43) ~[?:?]
2> at java.base/java.lang.reflect.Method.invoke(Method.java:566) ~[?:?]
2> at com.carrotsearch.randomizedtesting.RandomizedRunner.invoke(RandomizedRunner.java:1758) [randomizedtesting-runner-2.8.1.jar:?]
2> at com.carrotsearch.randomizedtesting.RandomizedRunner$8.evaluate(RandomizedRunner.java:946) [randomizedtesting-runner-2.8.1.jar:?]
2> at com.carrotsearch.randomizedtesting.RandomizedRunner$9.evaluate(RandomizedRunner.java:982) [randomizedtesting-runner-2.8.1.jar:?]
2> at com.carrotsearch.randomizedtesting.RandomizedRunner$10.evaluate(RandomizedRunner.java:996) [randomizedtesting-runner-2.8.1.jar:?]
2> at com.carrotsearch.randomizedtesting.rules.SystemPropertiesRestoreRule$1.evaluate(SystemPropertiesRestoreRule.java:80) [randomizedtesting-runner-2.8.1.jar:?]
2> at org.junit.rules.RunRules.evaluate(RunRules.java:20) [junit-4.13.2.jar:4.13.2]
2> at org.apache.lucene.tests.util.TestRuleSetupTeardownChained$1.evaluate(TestRuleSetupTeardownChained.java:48) [lucene-test-framework-9.11.1.jar:9.11.1 0c087dfdd10e0f6f3f6faecc6af4415e671a9e69 - 2024-06-23 12:31:02]
2> at org.apache.lucene.tests.util.AbstractBeforeAfterRule$1.evaluate(AbstractBeforeAfterRule.java:43) [lucene-test-framework-9.11.1.jar:9.11.1 0c087dfdd10e0f6f3f6faecc6af4415e671a9e69 - 2024-06-23 12:31:02]
2> at org.apache.lucene.tests.util.TestRuleThreadAndTestName$1.evaluate(TestRuleThreadAndTestName.java:45) [lucene-test-framework-9.11.1.jar:9.11.1 0c087dfdd10e0f6f3f6faecc6af4415e671a9e69 - 2024-06-23 12:31:02]
2> at org.apache.lucene.tests.util.TestRuleIgnoreAfterMaxFailures$1.evaluate(TestRuleIgnoreAfterMaxFailures.java:60) [lucene-test-framework-9.11.1.jar:9.11.1 0c087dfdd10e0f6f3f6faecc6af4415e671a9e69 - 2024-06-23 12:31:02]
2> at org.apache.lucene.tests.util.TestRuleMarkFailure$1.evaluate(TestRuleMarkFailure.java:44) [lucene-test-framework-9.11.1.jar:9.11.1 0c087dfdd10e0f6f3f6faecc6af4415e671a9e69 - 2024-06-23 12:31:02]
2> at org.junit.rules.RunRules.evaluate(RunRules.java:20) [junit-4.13.2.jar:4.13.2]
2> at com.carrotsearch.randomizedtesting.rules.StatementAdapter.evaluate(StatementAdapter.java:36) [randomizedtesting-runner-2.8.1.jar:?]
2> at com.carrotsearch.randomizedtesting.ThreadLeakControl$StatementRunner.run(ThreadLeakControl.java:390) [randomizedtesting-runner-2.8.1.jar:?]
2> at com.carrotsearch.randomizedtesting.ThreadLeakControl.forkTimeoutingTask(ThreadLeakControl.java:843) [randomizedtesting-runner-2.8.1.jar:?]
2> at com.carrotsearch.randomizedtesting.ThreadLeakControl$3.evaluate(ThreadLeakControl.java:490) [randomizedtesting-runner-2.8.1.jar:?]
2> at com.carrotsearch.randomizedtesting.RandomizedRunner.runSingleTest(RandomizedRunner.java:955) [randomizedtesting-runner-2.8.1.jar:?]
2> at com.carrotsearch.randomizedtesting.RandomizedRunner$5.evaluate(RandomizedRunner.java:840) [randomizedtesting-runner-2.8.1.jar:?]
2> at com.carrotsearch.randomizedtesting.RandomizedRunner$6.evaluate(RandomizedRunner.java:891) [randomizedtesting-runner-2.8.1.jar:?]
2> at com.carrotsearch.randomizedtesting.RandomizedRunner$7.evaluate(RandomizedRunner.java:902) [randomizedtesting-runner-2.8.1.jar:?]
2> at com.carrotsearch.randomizedtesting.rules.StatementAdapter.evaluate(StatementAdapter.java:36) [randomizedtesting-runner-2.8.1.jar:?]
2> at com.carrotsearch.randomizedtesting.rules.StatementAdapter.evaluate(StatementAdapter.java:36) [randomizedtesting-runner-2.8.1.jar:?]
2> at org.apache.lucene.tests.util.AbstractBeforeAfterRule$1.evaluate(AbstractBeforeAfterRule.java:43) [lucene-test-framework-9.11.1.jar:9.11.1 0c087dfdd10e0f6f3f6faecc6af4415e671a9e69 - 2024-06-23 12:31:02]
2> at com.carrotsearch.randomizedtesting.rules.SystemPropertiesRestoreRule$1.evaluate(SystemPropertiesRestoreRule.java:80) [randomizedtesting-runner-2.8.1.jar:?]
2> at org.junit.rules.RunRules.evaluate(RunRules.java:20) [junit-4.13.2.jar:4.13.2]
2> at org.apache.lucene.tests.util.AbstractBeforeAfterRule$1.evaluate(AbstractBeforeAfterRule.java:43) [lucene-test-framework-9.11.1.jar:9.11.1 0c087dfdd10e0f6f3f6faecc6af4415e671a9e69 - 2024-06-23 12:31:02]
2> at com.carrotsearch.randomizedtesting.rules.StatementAdapter.evaluate(StatementAdapter.java:36) [randomizedtesting-runner-2.8.1.jar:?]
2> at org.apache.lucene.tests.util.TestRuleStoreClassName$1.evaluate(TestRuleStoreClassName.java:38) [lucene-test-framework-9.11.1.jar:9.11.1 0c087dfdd10e0f6f3f6faecc6af4415e671a9e69 - 2024-06-23 12:31:02]
2> at com.carrotsearch.randomizedtesting.rules.NoShadowingOrOverridesOnMethodsRule$1.evaluate(NoShadowingOrOverridesOnMethodsRule.java:40) [randomizedtesting-runner-2.8.1.jar:?]
2> at com.carrotsearch.randomizedtesting.rules.NoShadowingOrOverridesOnMethodsRule$1.evaluate(NoShadowingOrOverridesOnMethodsRule.java:40) [randomizedtesting-runner-2.8.1.jar:?]
2> at com.carrotsearch.randomizedtesting.rules.StatementAdapter.evaluate(StatementAdapter.java:36) [randomizedtesting-runner-2.8.1.jar:?]
2> at com.carrotsearch.randomizedtesting.rules.StatementAdapter.evaluate(StatementAdapter.java:36) [randomizedtesting-runner-2.8.1.jar:?]
2> at org.apache.lucene.tests.util.TestRuleAssertionsRequired$1.evaluate(TestRuleAssertionsRequired.java:53) [lucene-test-framework-9.11.1.jar:9.11.1 0c087dfdd10e0f6f3f6faecc6af4415e671a9e69 - 2024-06-23 12:31:02]
2> at org.apache.lucene.tests.util.AbstractBeforeAfterRule$1.evaluate(AbstractBeforeAfterRule.java:43) [lucene-test-framework-9.11.1.jar:9.11.1 0c087dfdd10e0f6f3f6faecc6af4415e671a9e69 - 2024-06-23 12:31:02]
2> at org.apache.lucene.tests.util.TestRuleMarkFailure$1.evaluate(TestRuleMarkFailure.java:44) [lucene-test-framework-9.11.1.jar:9.11.1 0c087dfdd10e0f6f3f6faecc6af4415e671a9e69 - 2024-06-23 12:31:02]
2> at org.apache.lucene.tests.util.TestRuleIgnoreAfterMaxFailures$1.evaluate(TestRuleIgnoreAfterMaxFailures.java:60) [lucene-test-framework-9.11.1.jar:9.11.1 0c087dfdd10e0f6f3f6faecc6af4415e671a9e69 - 2024-06-23 12:31:02]
2> at org.apache.lucene.tests.util.TestRuleIgnoreTestSuites$1.evaluate(TestRuleIgnoreTestSuites.java:47) [lucene-test-framework-9.11.1.jar:9.11.1 0c087dfdd10e0f6f3f6faecc6af4415e671a9e69 - 2024-06-23 12:31:02]
2> at org.junit.rules.RunRules.evaluate(RunRules.java:20) [junit-4.13.2.jar:4.13.2]
2> at com.carrotsearch.randomizedtesting.rules.StatementAdapter.evaluate(StatementAdapter.java:36) [randomizedtesting-runner-2.8.1.jar:?]
2> at com.carrotsearch.randomizedtesting.ThreadLeakControl$StatementRunner.run(ThreadLeakControl.java:390) [randomizedtesting-runner-2.8.1.jar:?]
2> at com.carrotsearch.randomizedtesting.ThreadLeakControl.lambda$forkTimeoutingTask$0(ThreadLeakControl.java:850) [randomizedtesting-runner-2.8.1.jar:?]
2> at java.base/java.lang.Thread.run(Thread.java:829) [?:?]
2> Caused by: java.util.concurrent.TimeoutException: Could not connect to ZooKeeper ----------:33332 within 15000 ms
2> at org.apache.solr.common.cloud.ConnectionManager.waitForConnected(ConnectionManager.java:296) ~[solr-solrj-zookeeper-10.0.0-SNAPSHOT.jar:10.0.0-SNAPSHOT 49b24d532e777a1e8e79efa5b3b59773d8867ea4 [snapshot build, details omitted]]
2> at org.apache.solr.common.cloud.SolrZkClient.<init>(SolrZkClient.java:210) ~[solr-solrj-zookeeper-10.0.0-SNAPSHOT.jar:10.0.0-SNAPSHOT 49b24d532e777a1e8e79efa5b3b59773d8867ea4 [snapshot build, details omitted]]
2> ... 53 more
2>
2> ERROR: java.util.concurrent.TimeoutException: Could not connect to ZooKeeper ----------:33332 within 15000 ms
2>
2> 210960 WARN (ZkTestServer Run Thread) [n: c: s: r: x: t:] o.a.z.s.ServerCnxnFactory maxCnxns is not configured, using default value 0.
2> 211077 WARN (TEST-ZkSubcommandsTest.testPut-seed#[63A8B31DA4680360]) [n: c: s: r: x: t:] o.a.s.c.c.SolrZkClient Using default ZkCredentialsInjector. ZkCredentialsInjector is not secure, it creates an empty list of credentials which leads to 'OPEN_ACL_UNSAFE' ACLs to Zookeeper nodes
2> 211132 WARN (TEST-ZkSubcommandsTest.testPut-seed#[63A8B31DA4680360]) [n: c: s: r: x: t:] o.a.s.c.c.SolrZkClient Using default ZkACLProvider. DefaultZkACLProvider is not secure, it creates 'OPEN_ACL_UNSAFE' ACLs to Zookeeper nodes
2> 211190 WARN (TEST-ZkSubcommandsTest.testPut-seed#[63A8B31DA4680360]) [n: c: s: r: x: t:] o.a.s.c.c.SolrZkClient Using default ZkCredentialsInjector. ZkCredentialsInjector is not secure, it creates an empty list of credentials which leads to 'OPEN_ACL_UNSAFE' ACLs to Zookeeper nodes
2> 211231 WARN (TEST-ZkSubcommandsTest.testPut-seed#[63A8B31DA4680360]) [n: c: s: r: x: t:] o.a.s.c.c.SolrZkClient Using default ZkACLProvider. DefaultZkACLProvider is not secure, it creates 'OPEN_ACL_UNSAFE' ACLs to Zookeeper nodes
2> 211231 WARN (TEST-ZkSubcommandsTest.testPut-seed#[63A8B31DA4680360]) [n: c: s: r: x: t:] o.a.s.c.c.SolrZkClient Using default ZkCredentialsInjector. ZkCredentialsInjector is not secure, it creates an empty list of credentials which leads to 'OPEN_ACL_UNSAFE' ACLs to Zookeeper nodes
2> 211243 WARN (TEST-ZkSubcommandsTest.testPut-seed#[63A8B31DA4680360]) [n: c: s: r: x: t:] o.a.s.c.c.SolrZkClient Using default ZkACLProvider. DefaultZkACLProvider is not secure, it creates 'OPEN_ACL_UNSAFE' ACLs to Zookeeper nodes
1> Copying from '/home/jenkins/jenkins-home/712657a4/workspace/Solr/Solr-Check-main-s390x/solr/core/build/tmp/tests-tmp/temp9218897557458433716.data' to 'zk:/data.txt'. ZooKeeper at 127.0.0.1:35473/solr
2> 211261 WARN (TEST-ZkSubcommandsTest.testPut-seed#[63A8B31DA4680360]) [n: c: s: r: x: t:] o.a.s.c.c.SolrZkClient Using default ZkCredentialsInjector. ZkCredentialsInjector is not secure, it creates an empty list of credentials which leads to 'OPEN_ACL_UNSAFE' ACLs to Zookeeper nodes
2> 211301 WARN (TEST-ZkSubcommandsTest.testPut-seed#[63A8B31DA4680360]) [n: c: s: r: x: t:] o.a.s.c.c.SolrZkClient Using default ZkACLProvider. DefaultZkACLProvider is not secure, it creates 'OPEN_ACL_UNSAFE' ACLs to Zookeeper nodes
1> Copying from '/home/jenkins/jenkins-home/712657a4/workspace/Solr/Solr-Check-main-s390x/solr/core/build/tmp/tests-tmp/temp9218897557458433716.data' to 'zk:/data.txt'. ZooKeeper at 127.0.0.1:35473/solr
2> 211518 WARN (TEST-ZkSubcommandsTest.testPut-seed#[63A8B31DA4680360]) [n: c: s: r: x: t:] o.a.s.c.c.SolrZkClient Using default ZkCredentialsInjector. ZkCredentialsInjector is not secure, it creates an empty list of credentials which leads to 'OPEN_ACL_UNSAFE' ACLs to Zookeeper nodes
2> 211567 WARN (TEST-ZkSubcommandsTest.testPut-seed#[63A8B31DA4680360]) [n: c: s: r: x: t:] o.a.s.c.c.SolrZkClient Using default ZkACLProvider. DefaultZkACLProvider is not secure, it creates 'OPEN_ACL_UNSAFE' ACLs to Zookeeper nodes
2> 212403 WARN (ZkTestServer Run Thread) [n: c: s: r: x: t:] o.a.z.s.ServerCnxnFactory maxCnxns is not configured, using default value 0.
2> 212436 WARN (TEST-ZkSubcommandsTest.testGetCompressed-seed#[63A8B31DA4680360]) [n: c: s: r: x: t:] o.a.s.c.c.SolrZkClient Using default ZkCredentialsInjector. ZkCredentialsInjector is not secure, it creates an empty list of credentials which leads to 'OPEN_ACL_UNSAFE' ACLs to Zookeeper nodes
2> 212525 WARN (TEST-ZkSubcommandsTest.testGetCompressed-seed#[63A8B31DA4680360]) [n: c: s: r: x: t:] o.a.s.c.c.SolrZkClient Using default ZkACLProvider. DefaultZkACLProvider is not secure, it creates 'OPEN_ACL_UNSAFE' ACLs to Zookeeper nodes
2> 212550 WARN (TEST-ZkSubcommandsTest.testGetCompressed-seed#[63A8B31DA4680360]) [n: c: s: r: x: t:] o.a.s.c.c.SolrZkClient Using default ZkCredentialsInjector. ZkCredentialsInjector is not secure, it creates an empty list of credentials which leads to 'OPEN_ACL_UNSAFE' ACLs to Zookeeper nodes
2> 212561 WARN (TEST-ZkSubcommandsTest.testGetCompressed-seed#[63A8B31DA4680360]) [n: c: s: r: x: t:] o.a.s.c.c.SolrZkClient Using default ZkACLProvider. DefaultZkACLProvider is not secure, it creates 'OPEN_ACL_UNSAFE' ACLs to Zookeeper nodes
2> 212561 WARN (TEST-ZkSubcommandsTest.testGetCompressed-seed#[63A8B31DA4680360]) [n: c: s: r: x: t:] o.a.s.c.c.SolrZkClient Using default ZkCredentialsInjector. ZkCredentialsInjector is not secure, it creates an empty list of credentials which leads to 'OPEN_ACL_UNSAFE' ACLs to Zookeeper nodes
2> 212583 WARN (TEST-ZkSubcommandsTest.testGetCompressed-seed#[63A8B31DA4680360]) [n: c: s: r: x: t:] o.a.s.c.c.SolrZkClient Using default ZkACLProvider. DefaultZkACLProvider is not secure, it creates 'OPEN_ACL_UNSAFE' ACLs to Zookeeper nodes
1> Copying from 'zk:/getNode' to '/home/jenkins/jenkins-home/712657a4/workspace/Solr/Solr-Check-main-s390x/solr/core/build/tmp/tests-tmp/temp11697383193042685144.data'. ZooKeeper at 127.0.0.1:36417/solr
2> 212617 WARN (TEST-ZkSubcommandsTest.testGetCompressed-seed#[63A8B31DA4680360]) [n: c: s: r: x: t:] o.a.s.c.c.SolrZkClient Using default ZkCredentialsInjector. ZkCredentialsInjector is not secure, it creates an empty list of credentials which leads to 'OPEN_ACL_UNSAFE' ACLs to Zookeeper nodes
2> 212632 WARN (TEST-ZkSubcommandsTest.testGetCompressed-seed#[63A8B31DA4680360]) [n: c: s: r: x: t:] o.a.s.c.c.SolrZkClient Using default ZkACLProvider. DefaultZkACLProvider is not secure, it creates 'OPEN_ACL_UNSAFE' ACLs to Zookeeper nodes
2> 213558 WARN (ZkTestServer Run Thread) [n: c: s: r: x: t:] o.a.z.s.ServerCnxnFactory maxCnxns is not configured, using default value 0.
2> 213758 WARN (TEST-ZkSubcommandsTest.testPutCompressed-seed#[63A8B31DA4680360]) [n: c: s: r: x: t:] o.a.s.c.c.SolrZkClient Using default ZkCredentialsInjector. ZkCredentialsInjector is not secure, it creates an empty list of credentials which leads to 'OPEN_ACL_UNSAFE' ACLs to Zookeeper nodes
2> 213930 WARN (TEST-ZkSubcommandsTest.testPutCompressed-seed#[63A8B31DA4680360]) [n: c: s: r: x: t:] o.a.s.c.c.SolrZkClient Using default ZkACLProvider. DefaultZkACLProvider is not secure, it creates 'OPEN_ACL_UNSAFE' ACLs to Zookeeper nodes
2> 213972 WARN (TEST-ZkSubcommandsTest.testPutCompressed-seed#[63A8B31DA4680360]) [n: c: s: r: x: t:] o.a.s.c.c.SolrZkClient Using default ZkCredentialsInjector. ZkCredentialsInjector is not secure, it creates an empty list of credentials which leads to 'OPEN_ACL_UNSAFE' ACLs to Zookeeper nodes
2> 214102 WARN (TEST-ZkSubcommandsTest.testPutCompressed-seed#[63A8B31DA4680360]) [n: c: s: r: x: t:] o.a.s.c.c.SolrZkClient Using default ZkACLProvider. DefaultZkACLProvider is not secure, it creates 'OPEN_ACL_UNSAFE' ACLs to Zookeeper nodes
2> 214102 WARN (TEST-ZkSubcommandsTest.testPutCompressed-seed#[63A8B31DA4680360]) [n: c: s: r: x: t:] o.a.s.c.c.SolrZkClient Using default ZkCredentialsInjector. ZkCredentialsInjector is not secure, it creates an empty list of credentials which leads to 'OPEN_ACL_UNSAFE' ACLs to Zookeeper nodes
2> 214139 WARN (TEST-ZkSubcommandsTest.testPutCompressed-seed#[63A8B31DA4680360]) [n: c: s: r: x: t:] o.a.s.c.c.SolrZkClient Using default ZkACLProvider. DefaultZkACLProvider is not secure, it creates 'OPEN_ACL_UNSAFE' ACLs to Zookeeper nodes
1> Copying from '/home/jenkins/jenkins-home/712657a4/workspace/Solr/Solr-Check-main-s390x/solr/core/build/tmp/tests-tmp/state15463784291266805621.json' to 'zk:/state.json'. ZooKeeper at 127.0.0.1:36587/solr
2> 214157 WARN (TEST-ZkSubcommandsTest.testPutCompressed-seed#[63A8B31DA4680360]) [n: c: s: r: x: t:] o.a.s.c.c.SolrZkClient Using default ZkCredentialsInjector. ZkCredentialsInjector is not secure, it creates an empty list of credentials which leads to 'OPEN_ACL_UNSAFE' ACLs to Zookeeper nodes
2> 214174 WARN (TEST-ZkSubcommandsTest.testPutCompressed-seed#[63A8B31DA4680360]) [n: c: s: r: x: t:] o.a.s.c.c.SolrZkClient Using default ZkACLProvider. DefaultZkACLProvider is not secure, it creates 'OPEN_ACL_UNSAFE' ACLs to Zookeeper nodes
2> 214423 WARN (TEST-ZkSubcommandsTest.testPutCompressed-seed#[63A8B31DA4680360]) [n: c: s: r: x: t:] o.a.s.c.c.SolrZkClient Using default ZkCredentialsInjector. ZkCredentialsInjector is not secure, it creates an empty list of credentials which leads to 'OPEN_ACL_UNSAFE' ACLs to Zookeeper nodes
2> 214661 WARN (TEST-ZkSubcommandsTest.testPutCompressed-seed#[63A8B31DA4680360]) [n: c: s: r: x: t:] o.a.s.c.c.SolrZkClient Using default ZkACLProvider. DefaultZkACLProvider is not secure, it creates 'OPEN_ACL_UNSAFE' ACLs to Zookeeper nodes
1> Copying from '/home/jenkins/jenkins-home/712657a4/workspace/Solr/Solr-Check-main-s390x/solr/core/build/tmp/tests-tmp/state18029249522741725300.json' to 'zk:/state.json'. ZooKeeper at 127.0.0.1:36587/solr
2> 214822 WARN (TEST-ZkSubcommandsTest.testPutCompressed-seed#[63A8B31DA4680360]) [n: c: s: r: x: t:] o.a.s.c.c.SolrZkClient Using default ZkCredentialsInjector. ZkCredentialsInjector is not secure, it creates an empty list of credentials which leads to 'OPEN_ACL_UNSAFE' ACLs to Zookeeper nodes
2> 214931 WARN (TEST-ZkSubcommandsTest.testPutCompressed-seed#[63A8B31DA4680360]) [n: c: s: r: x: t:] o.a.s.c.c.SolrZkClient Using default ZkACLProvider. DefaultZkACLProvider is not secure, it creates 'OPEN_ACL_UNSAFE' ACLs to Zookeeper nodes
2> 215266 WARN (TEST-ZkSubcommandsTest.testPutCompressed-seed#[63A8B31DA4680360]) [n: c: s: r: x: t:] o.a.s.c.c.SolrZkClient Using default ZkCredentialsInjector. ZkCredentialsInjector is not secure, it creates an empty list of credentials which leads to 'OPEN_ACL_UNSAFE' ACLs to Zookeeper nodes
2> 215417 WARN (TEST-ZkSubcommandsTest.testPutCompressed-seed#[63A8B31DA4680360]) [n: c: s: r: x: t:] o.a.s.c.c.SolrZkClient Using default ZkACLProvider. DefaultZkACLProvider is not secure, it creates 'OPEN_ACL_UNSAFE' ACLs to Zookeeper nodes
2> 216324 WARN (ZkTestServer Run Thread) [n: c: s: r: x: t:] o.a.z.s.ServerCnxnFactory maxCnxns is not configured, using default value 0.
2> 216445 WARN (TEST-ZkSubcommandsTest.testGetFileCompressed-seed#[63A8B31DA4680360]) [n: c: s: r: x: t:] o.a.s.c.c.SolrZkClient Using default ZkCredentialsInjector. ZkCredentialsInjector is not secure, it creates an empty list of credentials which leads to 'OPEN_ACL_UNSAFE' ACLs to Zookeeper nodes
2> 216458 WARN (TEST-ZkSubcommandsTest.testGetFileCompressed-seed#[63A8B31DA4680360]) [n: c: s: r: x: t:] o.a.s.c.c.SolrZkClient Using default ZkACLProvider. DefaultZkACLProvider is not secure, it creates 'OPEN_ACL_UNSAFE' ACLs to Zookeeper nodes
2> 216478 WARN (TEST-ZkSubcommandsTest.testGetFileCompressed-seed#[63A8B31DA4680360]) [n: c: s: r: x: t:] o.a.s.c.c.SolrZkClient Using default ZkCredentialsInjector. ZkCredentialsInjector is not secure, it creates an empty list of credentials which leads to 'OPEN_ACL_UNSAFE' ACLs to Zookeeper nodes
2> 216549 WARN (TEST-ZkSubcommandsTest.testGetFileCompressed-seed#[63A8B31DA4680360]) [n: c: s: r: x: t:] o.a.s.c.c.SolrZkClient Using default ZkACLProvider. DefaultZkACLProvider is not secure, it creates 'OPEN_ACL_UNSAFE' ACLs to Zookeeper nodes
2> 216549 WARN (TEST-ZkSubcommandsTest.testGetFileCompressed-seed#[63A8B31DA4680360]) [n: c: s: r: x: t:] o.a.s.c.c.SolrZkClient Using default ZkCredentialsInjector. ZkCredentialsInjector is not secure, it creates an empty list of credentials which leads to 'OPEN_ACL_UNSAFE' ACLs to Zookeeper nodes
2> 216572 WARN (TEST-ZkSubcommandsTest.testGetFileCompressed-seed#[63A8B31DA4680360]) [n: c: s: r: x: t:] o.a.s.c.c.SolrZkClient Using default ZkACLProvider. DefaultZkACLProvider is not secure, it creates 'OPEN_ACL_UNSAFE' ACLs to Zookeeper nodes
1> Copying from 'zk:/getFileNode' to '/home/jenkins/jenkins-home/712657a4/workspace/Solr/Solr-Check-main-s390x/solr/core/build/tmp/tests-tmp/org.apache.solr.cli.ZkSubcommandsTest_63A8B31DA4680360-001/tempDir-026/solrtest-getfile-org.apache.solr.cli.ZkSubcommandsTest-7802617289732787'. ZooKeeper at 127.0.0.1:42633/solr
2> 216624 WARN (TEST-ZkSubcommandsTest.testGetFileCompressed-seed#[63A8B31DA4680360]) [n: c: s: r: x: t:] o.a.s.c.c.SolrZkClient Using default ZkCredentialsInjector. ZkCredentialsInjector is not secure, it creates an empty list of credentials which leads to 'OPEN_ACL_UNSAFE' ACLs to Zookeeper nodes
2> 216704 WARN (TEST-ZkSubcommandsTest.testGetFileCompressed-seed#[63A8B31DA4680360]) [n: c: s: r: x: t:] o.a.s.c.c.SolrZkClient Using default ZkACLProvider. DefaultZkACLProvider is not secure, it creates 'OPEN_ACL_UNSAFE' ACLs to Zookeeper nodes
2> 217286 WARN (ZkTestServer Run Thread) [n: c: s: r: x: t:] o.a.z.s.ServerCnxnFactory maxCnxns is not configured, using default value 0.
2> 217489 WARN (TEST-ZkSubcommandsTest.testGet-seed#[63A8B31DA4680360]) [n: c: s: r: x: t:] o.a.s.c.c.SolrZkClient Using default ZkCredentialsInjector. ZkCredentialsInjector is not secure, it creates an empty list of credentials which leads to 'OPEN_ACL_UNSAFE' ACLs to Zookeeper nodes
2> 217939 WARN (TEST-ZkSubcommandsTest.testGet-seed#[63A8B31DA4680360]) [n: c: s: r: x: t:] o.a.s.c.c.SolrZkClient Using default ZkACLProvider. DefaultZkACLProvider is not secure, it creates 'OPEN_ACL_UNSAFE' ACLs to Zookeeper nodes
2> 217972 WARN (TEST-ZkSubcommandsTest.testGet-seed#[63A8B31DA4680360]) [n: c: s: r: x: t:] o.a.s.c.c.SolrZkClient Using default ZkCredentialsInjector. ZkCredentialsInjector is not secure, it creates an empty list of credentials which leads to 'OPEN_ACL_UNSAFE' ACLs to Zookeeper nodes
2> 218017 WARN (TEST-ZkSubcommandsTest.testGet-seed#[63A8B31DA4680360]) [n: c: s: r: x: t:] o.a.s.c.c.SolrZkClient Using default ZkACLProvider. DefaultZkACLProvider is not secure, it creates 'OPEN_ACL_UNSAFE' ACLs to Zookeeper nodes
2> 218018 WARN (TEST-ZkSubcommandsTest.testGet-seed#[63A8B31DA4680360]) [n: c: s: r: x: t:] o.a.s.c.c.SolrZkClient Using default ZkCredentialsInjector. ZkCredentialsInjector is not secure, it creates an empty list of credentials which leads to 'OPEN_ACL_UNSAFE' ACLs to Zookeeper nodes
2> 218032 WARN (TEST-ZkSubcommandsTest.testGet-seed#[63A8B31DA4680360]) [n: c: s: r: x: t:] o.a.s.c.c.SolrZkClient Using default ZkACLProvider. DefaultZkACLProvider is not secure, it creates 'OPEN_ACL_UNSAFE' ACLs to Zookeeper nodes
2> 218055 WARN (TEST-ZkSubcommandsTest.testGet-seed#[63A8B31DA4680360]) [n: c: s: r: x: t:] o.a.s.c.c.SolrZkClient Using default ZkCredentialsInjector. ZkCredentialsInjector is not secure, it creates an empty list of credentials which leads to 'OPEN_ACL_UNSAFE' ACLs to Zookeeper nodes
2> 218096 WARN (TEST-ZkSubcommandsTest.testGet-seed#[63A8B31DA4680360]) [n: c: s: r: x: t:] o.a.s.c.c.SolrZkClient Using default ZkACLProvider. DefaultZkACLProvider is not secure, it creates 'OPEN_ACL_UNSAFE' ACLs to Zookeeper nodes
2> 219145 WARN (ZkTestServer Run Thread) [n: c: s: r: x: t:] o.a.z.s.ServerCnxnFactory maxCnxns is not configured, using default value 0.
2> 219422 WARN (TEST-ZkSubcommandsTest.testPutFileCompressed-seed#[63A8B31DA4680360]) [n: c: s: r: x: t:] o.a.s.c.c.SolrZkClient Using default ZkCredentialsInjector. ZkCredentialsInjector is not secure, it creates an empty list of credentials which leads to 'OPEN_ACL_UNSAFE' ACLs to Zookeeper nodes
2> 219538 WARN (TEST-ZkSubcommandsTest.testPutFileCompressed-seed#[63A8B31DA4680360]) [n: c: s: r: x: t:] o.a.s.c.c.SolrZkClient Using default ZkACLProvider. DefaultZkACLProvider is not secure, it creates 'OPEN_ACL_UNSAFE' ACLs to Zookeeper nodes
2> 219663 WARN (TEST-ZkSubcommandsTest.testPutFileCompressed-seed#[63A8B31DA4680360]) [n: c: s: r: x: t:] o.a.s.c.c.SolrZkClient Using default ZkCredentialsInjector. ZkCredentialsInjector is not secure, it creates an empty list of credentials which leads to 'OPEN_ACL_UNSAFE' ACLs to Zookeeper nodes
2> 219766 WARN (TEST-ZkSubcommandsTest.testPutFileCompressed-seed#[63A8B31DA4680360]) [n: c: s: r: x: t:] o.a.s.c.c.SolrZkClient Using default ZkACLProvider. DefaultZkACLProvider is not secure, it creates 'OPEN_ACL_UNSAFE' ACLs to Zookeeper nodes
2> 219766 WARN (TEST-ZkSubcommandsTest.testPutFileCompressed-seed#[63A8B31DA4680360]) [n: c: s: r: x: t:] o.a.s.c.c.SolrZkClient Using default ZkCredentialsInjector. ZkCredentialsInjector is not secure, it creates an empty list of credentials which leads to 'OPEN_ACL_UNSAFE' ACLs to Zookeeper nodes
2> 219953 WARN (TEST-ZkSubcommandsTest.testPutFileCompressed-seed#[63A8B31DA4680360]) [n: c: s: r: x: t:] o.a.s.c.c.SolrZkClient Using default ZkACLProvider. DefaultZkACLProvider is not secure, it creates 'OPEN_ACL_UNSAFE' ACLs to Zookeeper nodes
1> Copying from '/home/jenkins/jenkins-home/712657a4/workspace/Solr/Solr-Check-main-s390x/solr/core/build/resources/test/solr/solr-stress-new.xml' to 'zk:/state.json'. ZooKeeper at 127.0.0.1:43267/solr
2> 220052 WARN (TEST-ZkSubcommandsTest.testPutFileCompressed-seed#[63A8B31DA4680360]) [n: c: s: r: x: t:] o.a.s.c.c.SolrZkClient Using default ZkCredentialsInjector. ZkCredentialsInjector is not secure, it creates an empty list of credentials which leads to 'OPEN_ACL_UNSAFE' ACLs to Zookeeper nodes
2> 220623 WARN (TEST-ZkSubcommandsTest.testPutFileCompressed-seed#[63A8B31DA4680360]) [n: c: s: r: x: t:] o.a.s.c.c.SolrZkClient Using default ZkACLProvider. DefaultZkACLProvider is not secure, it creates 'OPEN_ACL_UNSAFE' ACLs to Zookeeper nodes
2> 220833 WARN (TEST-ZkSubcommandsTest.testPutFileCompressed-seed#[63A8B31DA4680360]) [n: c: s: r: x: t:] o.a.s.c.c.SolrZkClient Using default ZkCredentialsInjector. ZkCredentialsInjector is not secure, it creates an empty list of credentials which leads to 'OPEN_ACL_UNSAFE' ACLs to Zookeeper nodes
2> 221074 WARN (TEST-ZkSubcommandsTest.testPutFileCompressed-seed#[63A8B31DA4680360]) [n: c: s: r: x: t:] o.a.s.c.c.SolrZkClient Using default ZkACLProvider. DefaultZkACLProvider is not secure, it creates 'OPEN_ACL_UNSAFE' ACLs to Zookeeper nodes
> Should get back what we put in ZK: array lengths differed, expected.length=858 actual.length=859; arrays first differed at element [324]; expected:<64> but was:<-103>
> at __randomizedtesting.SeedInfo.seed([63A8B31DA4680360:F765C7E82DD0D628]:0)
> at org.junit.internal.ComparisonCriteria.arrayEquals(ComparisonCriteria.java:78)
> at org.junit.internal.ComparisonCriteria.arrayEquals(ComparisonCriteria.java:28)
> at org.junit.Assert.internalArrayEquals(Assert.java:534)
> at org.junit.Assert.assertArrayEquals(Assert.java:343)
> at org.apache.solr.cli.ZkSubcommandsTest.testPutFileCompressed(ZkSubcommandsTest.java:302)
> at java.base/jdk.internal.reflect.NativeMethodAccessorImpl.invoke0(Native Method)
> at java.base/jdk.internal.reflect.NativeMethodAccessorImpl.invoke(NativeMethodAccessorImpl.java:62)
> at java.base/jdk.internal.reflect.DelegatingMethodAccessorImpl.invoke(DelegatingMethodAccessorImpl.java:43)
> at java.base/java.lang.reflect.Method.invoke(Method.java:566)
> at com.carrotsearch.randomizedtesting.RandomizedRunner.invoke(RandomizedRunner.java:1758)
> at com.carrotsearch.randomizedtesting.RandomizedRunner$8.evaluate(RandomizedRunner.java:946)
> at com.carrotsearch.randomizedtesting.RandomizedRunner$9.evaluate(RandomizedRunner.java:982)
> at com.carrotsearch.randomizedtesting.RandomizedRunner$10.evaluate(RandomizedRunner.java:996)
> at com.carrotsearch.randomizedtesting.rules.SystemPropertiesRestoreRule$1.evaluate(SystemPropertiesRestoreRule.java:80)
> at org.junit.rules.RunRules.evaluate(RunRules.java:20)
> at org.apache.lucene.tests.util.TestRuleSetupTeardownChained$1.evaluate(TestRuleSetupTeardownChained.java:48)
> at org.apache.lucene.tests.util.AbstractBeforeAfterRule$1.evaluate(AbstractBeforeAfterRule.java:43)
> at org.apache.lucene.tests.util.TestRuleThreadAndTestName$1.evaluate(TestRuleThreadAndTestName.java:45)
> at org.apache.lucene.tests.util.TestRuleIgnoreAfterMaxFailures$1.evaluate(TestRuleIgnoreAfterMaxFailures.java:60)
> at org.apache.lucene.tests.util.TestRuleMarkFailure$1.evaluate(TestRuleMarkFailure.java:44)
> at org.junit.rules.RunRules.evaluate(RunRules.java:20)
> at com.carrotsearch.randomizedtesting.rules.StatementAdapter.evaluate(StatementAdapter.java:36)
> at com.carrotsearch.randomizedtesting.ThreadLeakControl$StatementRunner.run(ThreadLeakControl.java:390)
> at com.carrotsearch.randomizedtesting.ThreadLeakControl.forkTimeoutingTask(ThreadLeakControl.java:843)
> at com.carrotsearch.randomizedtesting.ThreadLeakControl$3.evaluate(ThreadLeakControl.java:490)
> at com.carrotsearch.randomizedtesting.RandomizedRunner.runSingleTest(RandomizedRunner.java:955)
> at com.carrotsearch.randomizedtesting.RandomizedRunner$5.evaluate(RandomizedRunner.java:840)
> at com.carrotsearch.randomizedtesting.RandomizedRunner$6.evaluate(RandomizedRunner.java:891)
> at com.carrotsearch.randomizedtesting.RandomizedRunner$7.evaluate(RandomizedRunner.java:902)
> at com.carrotsearch.randomizedtesting.rules.StatementAdapter.evaluate(StatementAdapter.java:36)
> at com.carrotsearch.randomizedtesting.rules.StatementAdapter.evaluate(StatementAdapter.java:36)
> at org.apache.lucene.tests.util.AbstractBeforeAfterRule$1.evaluate(AbstractBeforeAfterRule.java:43)
> at com.carrotsearch.randomizedtesting.rules.SystemPropertiesRestoreRule$1.evaluate(SystemPropertiesRestoreRule.java:80)
> at org.junit.rules.RunRules.evaluate(RunRules.java:20)
> at org.apache.lucene.tests.util.AbstractBeforeAfterRule$1.evaluate(AbstractBeforeAfterRule.java:43)
> at com.carrotsearch.randomizedtesting.rules.StatementAdapter.evaluate(StatementAdapter.java:36)
> at org.apache.lucene.tests.util.TestRuleStoreClassName$1.evaluate(TestRuleStoreClassName.java:38)
> at com.carrotsearch.randomizedtesting.rules.NoShadowingOrOverridesOnMethodsRule$1.evaluate(NoShadowingOrOverridesOnMethodsRule.java:40)
> at com.carrotsearch.randomizedtesting.rules.NoShadowingOrOverridesOnMethodsRule$1.evaluate(NoShadowingOrOverridesOnMethodsRule.java:40)
> at com.carrotsearch.randomizedtesting.rules.StatementAdapter.evaluate(StatementAdapter.java:36)
> at com.carrotsearch.randomizedtesting.rules.StatementAdapter.evaluate(StatementAdapter.java:36)
> at org.apache.lucene.tests.util.TestRuleAssertionsRequired$1.evaluate(TestRuleAssertionsRequired.java:53)
> at org.apache.lucene.tests.util.AbstractBeforeAfterRule$1.evaluate(AbstractBeforeAfterRule.java:43)
> at org.apache.lucene.tests.util.TestRuleMarkFailure$1.evaluate(TestRuleMarkFailure.java:44)
> at org.apache.lucene.tests.util.TestRuleIgnoreAfterMaxFailures$1.evaluate(TestRuleIgnoreAfterMaxFailures.java:60)
> at org.apache.lucene.tests.util.TestRuleIgnoreTestSuites$1.evaluate(TestRuleIgnoreTestSuites.java:47)
> at org.junit.rules.RunRules.evaluate(RunRules.java:20)
> at com.carrotsearch.randomizedtesting.rules.StatementAdapter.evaluate(StatementAdapter.java:36)
> at com.carrotsearch.randomizedtesting.ThreadLeakControl$StatementRunner.run(ThreadLeakControl.java:390)
> at com.carrotsearch.randomizedtesting.ThreadLeakControl.lambda$forkTimeoutingTask$0(ThreadLeakControl.java:850)
> at java.base/java.lang.Thread.run(Thread.java:829)
>
> Caused by:
> java.lang.AssertionError: expected:<64> but was:<-103>
> at org.junit.Assert.fail(Assert.java:89)
> at org.junit.Assert.failNotEquals(Assert.java:835)
> at org.junit.Assert.assertEquals(Assert.java:120)
> at org.junit.Assert.assertEquals(Assert.java:146)
> at org.junit.internal.ExactComparisonCriteria.assertElementsEqual(ExactComparisonCriteria.java:8)
> at org.junit.internal.ComparisonCriteria.arrayEquals(ComparisonCriteria.java:76)
> ... 50 more
2> NOTE: reproduce with: gradlew test --tests ZkSubcommandsTest.testPutFileCompressed -Dtests.seed=63A8B31DA4680360 -Dtests.multiplier=2 -Dtests.locale=ar-QA -Dtests.timezone=America/Fortaleza -Dtests.asserts=true -Dtests.file.encoding=UTF-8
2> 221956 WARN (ZkTestServer Run Thread) [n: c: s: r: x: t:] o.a.z.s.ServerCnxnFactory maxCnxns is not configured, using default value 0.
2> 222101 WARN (TEST-ZkSubcommandsTest.testPutFileNotExists-seed#[63A8B31DA4680360]) [n: c: s: r: x: t:] o.a.s.c.c.SolrZkClient Using default ZkCredentialsInjector. ZkCredentialsInjector is not secure, it creates an empty list of credentials which leads to 'OPEN_ACL_UNSAFE' ACLs to Zookeeper nodes
2> 222123 WARN (TEST-ZkSubcommandsTest.testPutFileNotExists-seed#[63A8B31DA4680360]) [n: c: s: r: x: t:] o.a.s.c.c.SolrZkClient Using default ZkACLProvider. DefaultZkACLProvider is not secure, it creates 'OPEN_ACL_UNSAFE' ACLs to Zookeeper nodes
2> 222130 WARN (TEST-ZkSubcommandsTest.testPutFileNotExists-seed#[63A8B31DA4680360]) [n: c: s: r: x: t:] o.a.s.c.c.SolrZkClient Using default ZkCredentialsInjector. ZkCredentialsInjector is not secure, it creates an empty list of credentials which leads to 'OPEN_ACL_UNSAFE' ACLs to Zookeeper nodes
2> 222147 WARN (TEST-ZkSubcommandsTest.testPutFileNotExists-seed#[63A8B31DA4680360]) [n: c: s: r: x: t:] o.a.s.c.c.SolrZkClient Using default ZkACLProvider. DefaultZkACLProvider is not secure, it creates 'OPEN_ACL_UNSAFE' ACLs to Zookeeper nodes
2> 222148 WARN (TEST-ZkSubcommandsTest.testPutFileNotExists-seed#[63A8B31DA4680360]) [n: c: s: r: x: t:] o.a.s.c.c.SolrZkClient Using default ZkCredentialsInjector. ZkCredentialsInjector is not secure, it creates an empty list of credentials which leads to 'OPEN_ACL_UNSAFE' ACLs to Zookeeper nodes
2> 222166 WARN (TEST-ZkSubcommandsTest.testPutFileNotExists-seed#[63A8B31DA4680360]) [n: c: s: r: x: t:] o.a.s.c.c.SolrZkClient Using default ZkACLProvider. DefaultZkACLProvider is not secure, it creates 'OPEN_ACL_UNSAFE' ACLs to Zookeeper nodes
1> Copying from '/home/jenkins/jenkins-home/712657a4/workspace/Solr/Solr-Check-main-s390x/solr/core/build/resources/test/solr/not-there.xml' to 'zk:/foo.xml'. ZooKeeper at 127.0.0.1:43379/solr
2> 222185 WARN (TEST-ZkSubcommandsTest.testPutFileNotExists-seed#[63A8B31DA4680360]) [n: c: s: r: x: t:] o.a.s.c.c.SolrZkClient Using default ZkCredentialsInjector. ZkCredentialsInjector is not secure, it creates an empty list of credentials which leads to 'OPEN_ACL_UNSAFE' ACLs to Zookeeper nodes
2> 222203 WARN (TEST-ZkSubcommandsTest.testPutFileNotExists-seed#[63A8B31DA4680360]) [n: c: s: r: x: t:] o.a.s.c.c.SolrZkClient Using default ZkACLProvider. DefaultZkACLProvider is not secure, it creates 'OPEN_ACL_UNSAFE' ACLs to Zookeeper nodes
2> 222319 ERROR (TEST-ZkSubcommandsTest.testPutFileNotExists-seed#[63A8B31DA4680360]) [n: c: s: r: x: t:] o.a.s.c.ZkCpTool Could not complete the zk operation for reason:
2> => java.io.IOException: Path /home/jenkins/jenkins-home/712657a4/workspace/Solr/Solr-Check-main-s390x/solr/core/build/resources/test/solr/not-there.xml does not exist
2> at org.apache.solr.common.cloud.ZkMaintenanceUtils.uploadToZK(ZkMaintenanceUtils.java:329)
2> java.io.IOException: Path /home/jenkins/jenkins-home/712657a4/workspace/Solr/Solr-Check-main-s390x/solr/core/build/resources/test/solr/not-there.xml does not exist
2> at org.apache.solr.common.cloud.ZkMaintenanceUtils.uploadToZK(ZkMaintenanceUtils.java:329) ~[solr-solrj-zookeeper-10.0.0-SNAPSHOT.jar:10.0.0-SNAPSHOT 49b24d532e777a1e8e79efa5b3b59773d8867ea4 [snapshot build, details omitted]]
2> at org.apache.solr.common.cloud.ZkMaintenanceUtils.zkTransfer(ZkMaintenanceUtils.java:168) ~[solr-solrj-zookeeper-10.0.0-SNAPSHOT.jar:10.0.0-SNAPSHOT 49b24d532e777a1e8e79efa5b3b59773d8867ea4 [snapshot build, details omitted]]
2> at org.apache.solr.common.cloud.SolrZkClient.zkTransfer(SolrZkClient.java:1041) ~[solr-solrj-zookeeper-10.0.0-SNAPSHOT.jar:10.0.0-SNAPSHOT 49b24d532e777a1e8e79efa5b3b59773d8867ea4 [snapshot build, details omitted]]
2> at org.apache.solr.cli.ZkCpTool.runImpl(ZkCpTool.java:175) [main/:?]
2> at org.apache.solr.cli.ToolBase.runTool(ToolBase.java:52) [main/:?]
2> at org.apache.solr.cli.ZkSubcommandsTest.runTool(ZkSubcommandsTest.java:698) [test/:?]
2> at org.apache.solr.cli.ZkSubcommandsTest.testPutFileNotExists(ZkSubcommandsTest.java:328) [test/:?]
2> at java.base/jdk.internal.reflect.NativeMethodAccessorImpl.invoke0(Native Method) ~[?:?]
2> at java.base/jdk.internal.reflect.NativeMethodAccessorImpl.invoke(NativeMethodAccessorImpl.java:62) ~[?:?]
2> at java.base/jdk.internal.reflect.DelegatingMethodAccessorImpl.invoke(DelegatingMethodAccessorImpl.java:43) ~[?:?]
2> at java.base/java.lang.reflect.Method.invoke(Method.java:566) ~[?:?]
2> at com.carrotsearch.randomizedtesting.RandomizedRunner.invoke(RandomizedRunner.java:1758) [randomizedtesting-runner-2.8.1.jar:?]
2> at com.carrotsearch.randomizedtesting.RandomizedRunner$8.evaluate(RandomizedRunner.java:946) [randomizedtesting-runner-2.8.1.jar:?]
2> at com.carrotsearch.randomizedtesting.RandomizedRunner$9.evaluate(RandomizedRunner.java:982) [randomizedtesting-runner-2.8.1.jar:?]
2> at com.carrotsearch.randomizedtesting.RandomizedRunner$10.evaluate(RandomizedRunner.java:996) [randomizedtesting-runner-2.8.1.jar:?]
2> at com.carrotsearch.randomizedtesting.rules.SystemPropertiesRestoreRule$1.evaluate(SystemPropertiesRestoreRule.java:80) [randomizedtesting-runner-2.8.1.jar:?]
2> at org.junit.rules.RunRules.evaluate(RunRules.java:20) [junit-4.13.2.jar:4.13.2]
2> at org.apache.lucene.tests.util.TestRuleSetupTeardownChained$1.evaluate(TestRuleSetupTeardownChained.java:48) [lucene-test-framework-9.11.1.jar:9.11.1 0c087dfdd10e0f6f3f6faecc6af4415e671a9e69 - 2024-06-23 12:31:02]
2> at org.apache.lucene.tests.util.AbstractBeforeAfterRule$1.evaluate(AbstractBeforeAfterRule.java:43) [lucene-test-framework-9.11.1.jar:9.11.1 0c087dfdd10e0f6f3f6faecc6af4415e671a9e69 - 2024-06-23 12:31:02]
2> at org.apache.lucene.tests.util.TestRuleThreadAndTestName$1.evaluate(TestRuleThreadAndTestName.java:45) [lucene-test-framework-9.11.1.jar:9.11.1 0c087dfdd10e0f6f3f6faecc6af4415e671a9e69 - 2024-06-23 12:31:02]
2> at org.apache.lucene.tests.util.TestRuleIgnoreAfterMaxFailures$1.evaluate(TestRuleIgnoreAfterMaxFailures.java:60) [lucene-test-framework-9.11.1.jar:9.11.1 0c087dfdd10e0f6f3f6faecc6af4415e671a9e69 - 2024-06-23 12:31:02]
2> at org.apache.lucene.tests.util.TestRuleMarkFailure$1.evaluate(TestRuleMarkFailure.java:44) [lucene-test-framework-9.11.1.jar:9.11.1 0c087dfdd10e0f6f3f6faecc6af4415e671a9e69 - 2024-06-23 12:31:02]
2> at org.junit.rules.RunRules.evaluate(RunRules.java:20) [junit-4.13.2.jar:4.13.2]
2> at com.carrotsearch.randomizedtesting.rules.StatementAdapter.evaluate(StatementAdapter.java:36) [randomizedtesting-runner-2.8.1.jar:?]
2> at com.carrotsearch.randomizedtesting.ThreadLeakControl$StatementRunner.run(ThreadLeakControl.java:390) [randomizedtesting-runner-2.8.1.jar:?]
2> at com.carrotsearch.randomizedtesting.ThreadLeakControl.forkTimeoutingTask(ThreadLeakControl.java:843) [randomizedtesting-runner-2.8.1.jar:?]
2> at com.carrotsearch.randomizedtesting.ThreadLeakControl$3.evaluate(ThreadLeakControl.java:490) [randomizedtesting-runner-2.8.1.jar:?]
2> at com.carrotsearch.randomizedtesting.RandomizedRunner.runSingleTest(RandomizedRunner.java:955) [randomizedtesting-runner-2.8.1.jar:?]
2> at com.carrotsearch.randomizedtesting.RandomizedRunner$5.evaluate(RandomizedRunner.java:840) [randomizedtesting-runner-2.8.1.jar:?]
2> at com.carrotsearch.randomizedtesting.RandomizedRunner$6.evaluate(RandomizedRunner.java:891) [randomizedtesting-runner-2.8.1.jar:?]
2> at com.carrotsearch.randomizedtesting.RandomizedRunner$7.evaluate(RandomizedRunner.java:902) [randomizedtesting-runner-2.8.1.jar:?]
2> at com.carrotsearch.randomizedtesting.rules.StatementAdapter.evaluate(StatementAdapter.java:36) [randomizedtesting-runner-2.8.1.jar:?]
2> at com.carrotsearch.randomizedtesting.rules.StatementAdapter.evaluate(StatementAdapter.java:36) [randomizedtesting-runner-2.8.1.jar:?]
2> at org.apache.lucene.tests.util.AbstractBeforeAfterRule$1.evaluate(AbstractBeforeAfterRule.java:43) [lucene-test-framework-9.11.1.jar:9.11.1 0c087dfdd10e0f6f3f6faecc6af4415e671a9e69 - 2024-06-23 12:31:02]
2> at com.carrotsearch.randomizedtesting.rules.SystemPropertiesRestoreRule$1.evaluate(SystemPropertiesRestoreRule.java:80) [randomizedtesting-runner-2.8.1.jar:?]
2> at org.junit.rules.RunRules.evaluate(RunRules.java:20) [junit-4.13.2.jar:4.13.2]
2> at org.apache.lucene.tests.util.AbstractBeforeAfterRule$1.evaluate(AbstractBeforeAfterRule.java:43) [lucene-test-framework-9.11.1.jar:9.11.1 0c087dfdd10e0f6f3f6faecc6af4415e671a9e69 - 2024-06-23 12:31:02]
2> at com.carrotsearch.randomizedtesting.rules.StatementAdapter.evaluate(StatementAdapter.java:36) [randomizedtesting-runner-2.8.1.jar:?]
2> at org.apache.lucene.tests.util.TestRuleStoreClassName$1.evaluate(TestRuleStoreClassName.java:38) [lucene-test-framework-9.11.1.jar:9.11.1 0c087dfdd10e0f6f3f6faecc6af4415e671a9e69 - 2024-06-23 12:31:02]
2> at com.carrotsearch.randomizedtesting.rules.NoShadowingOrOverridesOnMethodsRule$1.evaluate(NoShadowingOrOverridesOnMethodsRule.java:40) [randomizedtesting-runner-2.8.1.jar:?]
2> at com.carrotsearch.randomizedtesting.rules.NoShadowingOrOverridesOnMethodsRule$1.evaluate(NoShadowingOrOverridesOnMethodsRule.java:40) [randomizedtesting-runner-2.8.1.jar:?]
2> at com.carrotsearch.randomizedtesting.rules.StatementAdapter.evaluate(StatementAdapter.java:36) [randomizedtesting-runner-2.8.1.jar:?]
2> at com.carrotsearch.randomizedtesting.rules.StatementAdapter.evaluate(StatementAdapter.java:36) [randomizedtesting-runner-2.8.1.jar:?]
2> at org.apache.lucene.tests.util.TestRuleAssertionsRequired$1.evaluate(TestRuleAssertionsRequired.java:53) [lucene-test-framework-9.11.1.jar:9.11.1 0c087dfdd10e0f6f3f6faecc6af4415e671a9e69 - 2024-06-23 12:31:02]
2> at org.apache.lucene.tests.util.AbstractBeforeAfterRule$1.evaluate(AbstractBeforeAfterRule.java:43) [lucene-test-framework-9.11.1.jar:9.11.1 0c087dfdd10e0f6f3f6faecc6af4415e671a9e69 - 2024-06-23 12:31:02]
2> at org.apache.lucene.tests.util.TestRuleMarkFailure$1.evaluate(TestRuleMarkFailure.java:44) [lucene-test-framework-9.11.1.jar:9.11.1 0c087dfdd10e0f6f3f6faecc6af4415e671a9e69 - 2024-06-23 12:31:02]
2> at org.apache.lucene.tests.util.TestRuleIgnoreAfterMaxFailures$1.evaluate(TestRuleIgnoreAfterMaxFailures.java:60) [lucene-test-framework-9.11.1.jar:9.11.1 0c087dfdd10e0f6f3f6faecc6af4415e671a9e69 - 2024-06-23 12:31:02]
2> at org.apache.lucene.tests.util.TestRuleIgnoreTestSuites$1.evaluate(TestRuleIgnoreTestSuites.java:47) [lucene-test-framework-9.11.1.jar:9.11.1 0c087dfdd10e0f6f3f6faecc6af4415e671a9e69 - 2024-06-23 12:31:02]
2> at org.junit.rules.RunRules.evaluate(RunRules.java:20) [junit-4.13.2.jar:4.13.2]
2> at com.carrotsearch.randomizedtesting.rules.StatementAdapter.evaluate(StatementAdapter.java:36) [randomizedtesting-runner-2.8.1.jar:?]
2> at com.carrotsearch.randomizedtesting.ThreadLeakControl$StatementRunner.run(ThreadLeakControl.java:390) [randomizedtesting-runner-2.8.1.jar:?]
2> at com.carrotsearch.randomizedtesting.ThreadLeakControl.lambda$forkTimeoutingTask$0(ThreadLeakControl.java:850) [randomizedtesting-runner-2.8.1.jar:?]
2> at java.base/java.lang.Thread.run(Thread.java:829) [?:?]
2>
2> ERROR: Path /home/jenkins/jenkins-home/712657a4/workspace/Solr/Solr-Check-main-s390x/solr/core/build/resources/test/solr/not-there.xml does not exist
2>
2> 222695 WARN (ZkTestServer Run Thread) [n: c: s: r: x: t:] o.a.z.s.ServerCnxnFactory maxCnxns is not configured, using default value 0.
2> 222707 WARN (TEST-ZkSubcommandsTest.testUpConfigLinkConfigClearZk-seed#[63A8B31DA4680360]) [n: c: s: r: x: t:] o.a.s.c.c.SolrZkClient Using default ZkCredentialsInjector. ZkCredentialsInjector is not secure, it creates an empty list of credentials which leads to 'OPEN_ACL_UNSAFE' ACLs to Zookeeper nodes
2> 222753 WARN (TEST-ZkSubcommandsTest.testUpConfigLinkConfigClearZk-seed#[63A8B31DA4680360]) [n: c: s: r: x: t:] o.a.s.c.c.SolrZkClient Using default ZkACLProvider. DefaultZkACLProvider is not secure, it creates 'OPEN_ACL_UNSAFE' ACLs to Zookeeper nodes
2> 222760 WARN (TEST-ZkSubcommandsTest.testUpConfigLinkConfigClearZk-seed#[63A8B31DA4680360]) [n: c: s: r: x: t:] o.a.s.c.c.SolrZkClient Using default ZkCredentialsInjector. ZkCredentialsInjector is not secure, it creates an empty list of credentials which leads to 'OPEN_ACL_UNSAFE' ACLs to Zookeeper nodes
2> 222767 WARN (TEST-ZkSubcommandsTest.testUpConfigLinkConfigClearZk-seed#[63A8B31DA4680360]) [n: c: s: r: x: t:] o.a.s.c.c.SolrZkClient Using default ZkACLProvider. DefaultZkACLProvider is not secure, it creates 'OPEN_ACL_UNSAFE' ACLs to Zookeeper nodes
2> 222767 WARN (TEST-ZkSubcommandsTest.testUpConfigLinkConfigClearZk-seed#[63A8B31DA4680360]) [n: c: s: r: x: t:] o.a.s.c.c.SolrZkClient Using default ZkCredentialsInjector. ZkCredentialsInjector is not secure, it creates an empty list of credentials which leads to 'OPEN_ACL_UNSAFE' ACLs to Zookeeper nodes
2> 222781 WARN (TEST-ZkSubcommandsTest.testUpConfigLinkConfigClearZk-seed#[63A8B31DA4680360]) [n: c: s: r: x: t:] o.a.s.c.c.SolrZkClient Using default ZkACLProvider. DefaultZkACLProvider is not secure, it creates 'OPEN_ACL_UNSAFE' ACLs to Zookeeper nodes
2> 222814 WARN (TEST-ZkSubcommandsTest.testUpConfigLinkConfigClearZk-seed#[63A8B31DA4680360]) [n: c: s: r: x: t:] o.a.s.c.c.SolrZkClient Using default ZkCredentialsInjector. ZkCredentialsInjector is not secure, it creates an empty list of credentials which leads to 'OPEN_ACL_UNSAFE' ACLs to Zookeeper nodes
2> 222829 WARN (TEST-ZkSubcommandsTest.testUpConfigLinkConfigClearZk-seed#[63A8B31DA4680360]) [n: c: s: r: x: t:] o.a.s.c.c.SolrZkClient Using default ZkACLProvider. DefaultZkACLProvider is not secure, it creates 'OPEN_ACL_UNSAFE' ACLs to Zookeeper nodes
1> Uploading /home/jenkins/jenkins-home/712657a4/workspace/Solr/Solr-Check-main-s390x/solr/server/solr/configsets/sample_techproducts_configs/conf for config confsetone to ZooKeeper at 127.0.0.1:34165/solr
2> 223545 WARN (TEST-ZkSubcommandsTest.testUpConfigLinkConfigClearZk-seed#[63A8B31DA4680360]) [n: c: s: r: x: t:] o.a.s.c.c.SolrZkClient Using default ZkCredentialsInjector. ZkCredentialsInjector is not secure, it creates an empty list of credentials which leads to 'OPEN_ACL_UNSAFE' ACLs to Zookeeper nodes
2> 223570 WARN (TEST-ZkSubcommandsTest.testUpConfigLinkConfigClearZk-seed#[63A8B31DA4680360]) [n: c: s: r: x: t:] o.a.s.c.c.SolrZkClient Using default ZkACLProvider. DefaultZkACLProvider is not secure, it creates 'OPEN_ACL_UNSAFE' ACLs to Zookeeper nodes
2> 223746 WARN (TEST-ZkSubcommandsTest.testUpConfigLinkConfigClearZk-seed#[63A8B31DA4680360]) [n: c: s: r: x: t:] o.a.s.c.c.SolrZkClient Using default ZkCredentialsInjector. ZkCredentialsInjector is not secure, it creates an empty list of credentials which leads to 'OPEN_ACL_UNSAFE' ACLs to Zookeeper nodes
2> 223788 WARN (TEST-ZkSubcommandsTest.testUpConfigLinkConfigClearZk-seed#[63A8B31DA4680360]) [n: c: s: r: x: t:] o.a.s.c.c.SolrZkClient Using default ZkACLProvider. DefaultZkACLProvider is not secure, it creates 'OPEN_ACL_UNSAFE' ACLs to Zookeeper nodes
1> Downloading configset confsetone from ZooKeeper at 127.0.0.1:34165/solr to directory /home/jenkins/jenkins-home/712657a4/workspace/Solr/Solr-Check-main-s390x/solr/core/build/tmp/tests-tmp/org.apache.solr.cli.ZkSubcommandsTest_63A8B31DA4680360-001/tempDir-035/solrtest-confdropspot-org.apache.solr.cli.ZkSubcommandsTest-7802624410973970/conf
2> 227491 WARN (TEST-ZkSubcommandsTest.testUpConfigLinkConfigClearZk-seed#[63A8B31DA4680360]) [n: c: s: r: x: t:] o.a.s.c.c.SolrZkClient Using default ZkCredentialsInjector. ZkCredentialsInjector is not secure, it creates an empty list of credentials which leads to 'OPEN_ACL_UNSAFE' ACLs to Zookeeper nodes
2> 227612 WARN (TEST-ZkSubcommandsTest.testUpConfigLinkConfigClearZk-seed#[63A8B31DA4680360]) [n: c: s: r: x: t:] o.a.s.c.c.SolrZkClient Using default ZkACLProvider. DefaultZkACLProvider is not secure, it creates 'OPEN_ACL_UNSAFE' ACLs to Zookeeper nodes
1> Removing ZooKeeper node /configs/confsetone from ZooKeeper at 127.0.0.1:34165/solr recurse: true
2> NOTE: leaving temporary files on disk at: /home/jenkins/jenkins-home/712657a4/workspace/Solr/Solr-Check-main-s390x/solr/core/build/tmp/tests-tmp/org.apache.solr.cli.ZkSubcommandsTest_63A8B31DA4680360-001
2> NOTE: test params are: codec=Asserting(Lucene99): {}, docValues:{}, maxPointsInLeafNode=1197, maxMBSortInHeap=6.252564564786234, sim=Asserting(RandomSimilarity(queryNorm=false): {}), locale=ar-QA, timezone=America/Fortaleza
2> NOTE: Linux 5.15.0-106-generic s390x/Eclipse Adoptium 11.0.16.1 (64-bit)/cpus=1,threads=2,free=198585416,total=343932928
2> NOTE: All tests run in this JVM: [BasicFunctionalityTest, DistributedIntervalFacetingTest, OutputWriterTest, SolrTestCaseJ4Test, TestDistributedGrouping, TestGroupingSearch, TestRandomFaceting, TestTrie, TestCharFilters, TestWordDelimiterFilterFactory, ApiToolTest, HealthcheckToolTest, SolrCLITest, ZkSubcommandsTest]
WARNING: Test org.apache.solr.cloud.TestRandomFlRTGCloud wrote 15,289,536 bytes of output.
WARNING: Test org.apache.solr.cloud.TestStressCloudBlindAtomicUpdates wrote 14,723,851 bytes of output.
WARNING: Test org.apache.solr.search.TestRangeQuery wrote 17,709,770 bytes of output.
WARNING: Test org.apache.solr.search.TestRandomCollapseQParserPlugin wrote 19,491,135 bytes of output.
WARNING: Test org.apache.solr.schema.TestCloudSchemaless wrote 20,975,147 bytes of output.
org.apache.solr.search.facet.SpatialHeatmapFacetsTest > testClassicFacets FAILED
java.lang.AssertionError: .facet_counts.facet_heatmaps.srpt_quad.counts_png:[B@69e98509!=[B@40ae590c
at __randomizedtesting.SeedInfo.seed([63A8B31DA4680360:7169422E432F8095]:0)
at org.junit.Assert.fail(Assert.java:89)
at org.apache.solr.BaseDistributedSearchTestCase.compareSolrResponses(BaseDistributedSearchTestCase.java:981)
at org.apache.solr.BaseDistributedSearchTestCase.compareResponses(BaseDistributedSearchTestCase.java:1011)
at org.apache.solr.BaseDistributedSea
[...truncated too long message...]
ing:analyzeClassesDependencies
> Task :solr:solrj-streaming:analyzeTestClassesDependencies
> Task :solr:solrj-streaming:analyzeDependencies
> Task :solr:solrj-streaming:test
:solr:solrj-streaming:test (SUCCESS): 609 test(s), 7 skipped
> Task :solr:solrj-streaming:wipeTaskTemp
> Task :solr:solrj-streaming:check
> Task :solr:solrj-zookeeper:analyzeClassesDependencies
> Task :solr:solrj-zookeeper:analyzeTestClassesDependencies
> Task :solr:solrj-zookeeper:analyzeDependencies
> Task :solr:solrj-zookeeper:test
:solr:solrj-zookeeper:test (SUCCESS): 19 test(s)
> Task :solr:solrj-zookeeper:wipeTaskTemp
> Task :solr:solrj-zookeeper:check
> Task :solr:test-framework:analyzeClassesDependencies
> Task :solr:test-framework:analyzeTestClassesDependencies
> Task :solr:test-framework:analyzeDependencies
> Task :solr:test-framework:test
:solr:test-framework:test (SUCCESS): 18 test(s)
> Task :solr:test-framework:wipeTaskTemp
> Task :solr:test-framework:check
> Task :solr:webapp:analyzeClassesDependencies
> Task :solr:webapp:analyzeTestClassesDependencies
> Task :solr:webapp:analyzeDependencies
> Task :solr:webapp:test NO-SOURCE
> Task :solr:webapp:wipeTaskTemp
> Task :solr:webapp:check
> Task :solr:modules:analysis-extras:analyzeClassesDependencies
> Task :solr:modules:analysis-extras:analyzeTestClassesDependencies
> Task :solr:modules:analysis-extras:analyzeDependencies
> Task :solr:modules:analysis-extras:test
:solr:modules:analysis-extras:test (SUCCESS): 31 test(s)
> Task :solr:modules:analysis-extras:wipeTaskTemp
> Task :solr:modules:analysis-extras:check
> Task :solr:modules:clustering:analyzeClassesDependencies
> Task :solr:modules:clustering:analyzeTestClassesDependencies
> Task :solr:modules:clustering:analyzeDependencies
> Task :solr:modules:clustering:test
:solr:modules:clustering:test (SUCCESS): 15 test(s)
> Task :solr:modules:clustering:wipeTaskTemp
> Task :solr:modules:clustering:check
> Task :solr:modules:extraction:analyzeClassesDependencies
> Task :solr:modules:extraction:analyzeTestClassesDependencies
> Task :solr:modules:extraction:analyzeDependencies
> Task :solr:modules:extraction:test
:solr:modules:extraction:test (SUCCESS): 20 test(s)
> Task :solr:modules:extraction:wipeTaskTemp
> Task :solr:modules:extraction:check
> Task :solr:modules:gcs-repository:analyzeClassesDependencies
> Task :solr:modules:gcs-repository:analyzeTestClassesDependencies
> Task :solr:modules:gcs-repository:analyzeDependencies
> Task :solr:modules:gcs-repository:test
:solr:modules:gcs-repository:test (SUCCESS): 22 test(s), 1 skipped
> Task :solr:modules:gcs-repository:wipeTaskTemp
> Task :solr:modules:gcs-repository:check
> Task :solr:modules:hadoop-auth:analyzeClassesDependencies
> Task :solr:modules:hadoop-auth:analyzeTestClassesDependencies
> Task :solr:modules:hadoop-auth:analyzeDependencies
> Task :solr:modules:hadoop-auth:test
:solr:modules:hadoop-auth:test (SUCCESS): 54 test(s), 3 skipped
> Task :solr:modules:hadoop-auth:wipeTaskTemp
> Task :solr:modules:hadoop-auth:check
> Task :solr:modules:hdfs:analyzeClassesDependencies
> Task :solr:modules:hdfs:analyzeTestClassesDependencies
> Task :solr:modules:hdfs:analyzeDependencies
> Task :solr:modules:hdfs:test
WARNING: Test org.apache.solr.hdfs.store.HdfsDirectoryTest wrote 14,181,815 bytes of output.
:solr:modules:hdfs:test (SUCCESS): 104 test(s), 41 skipped
> Task :solr:modules:hdfs:wipeTaskTemp
> Task :solr:modules:hdfs:check
> Task :solr:modules:jwt-auth:analyzeClassesDependencies
> Task :solr:modules:jwt-auth:analyzeTestClassesDependencies
> Task :solr:modules:jwt-auth:analyzeDependencies
> Task :solr:modules:jwt-auth:test
:solr:modules:jwt-auth:test (SUCCESS): 63 test(s), 1 skipped
> Task :solr:modules:jwt-auth:wipeTaskTemp
> Task :solr:modules:jwt-auth:check
> Task :solr:modules:langid:analyzeClassesDependencies
> Task :solr:modules:langid:analyzeTestClassesDependencies
> Task :solr:modules:langid:analyzeDependencies
> Task :solr:modules:langid:test
:solr:modules:langid:test (SUCCESS): 43 test(s)
> Task :solr:modules:langid:wipeTaskTemp
> Task :solr:modules:langid:check
> Task :solr:modules:ltr:analyzeClassesDependencies
> Task :solr:modules:ltr:analyzeTestClassesDependencies
> Task :solr:modules:ltr:analyzeDependencies
> Task :solr:modules:ltr:test
:solr:modules:ltr:test (SUCCESS): 209 test(s)
> Task :solr:modules:ltr:wipeTaskTemp
> Task :solr:modules:ltr:check
> Task :solr:modules:opentelemetry:analyzeClassesDependencies
> Task :solr:modules:opentelemetry:analyzeTestClassesDependencies
> Task :solr:modules:opentelemetry:analyzeDependencies
> Task :solr:modules:opentelemetry:test
:solr:modules:opentelemetry:test (SUCCESS): 12 test(s)
> Task :solr:modules:opentelemetry:wipeTaskTemp
> Task :solr:modules:opentelemetry:check
> Task :solr:modules:s3-repository:analyzeClassesDependencies
> Task :solr:modules:s3-repository:analyzeTestClassesDependencies
> Task :solr:modules:s3-repository:analyzeDependencies
> Task :solr:modules:s3-repository:test
:solr:modules:s3-repository:test (SUCCESS): 52 test(s), 1 skipped
> Task :solr:modules:s3-repository:wipeTaskTemp
> Task :solr:modules:s3-repository:check
> Task :solr:modules:scripting:analyzeClassesDependencies
> Task :solr:modules:scripting:analyzeTestClassesDependencies
> Task :solr:modules:scripting:analyzeDependencies
> Task :solr:modules:scripting:test
:solr:modules:scripting:test (SUCCESS): 22 test(s), 1 skipped
> Task :solr:modules:scripting:wipeTaskTemp
> Task :solr:modules:scripting:check
> Task :solr:modules:sql:analyzeClassesDependencies
> Task :solr:modules:sql:analyzeTestClassesDependencies
> Task :solr:modules:sql:analyzeDependencies
> Task :solr:modules:sql:test
:solr:modules:sql:test (SUCCESS): 33 test(s)
> Task :solr:modules:sql:wipeTaskTemp
> Task :solr:modules:sql:check
The slowest tests (exceeding 500 ms) during this run:
254.56s BasicDistributedZkTest.test (:solr:core)
211.04s TestCloudJSONFacetJoinDomain.testRandom (:solr:core)
204.83s TestDistributedSearch.test (:solr:core)
182.40s TestCloudJSONFacetSKG.testRandom (:solr:core)
110.45s TestRandomFlRTGCloud.testRandomizedUpdatesAndRTGs (:solr:core)
106.33s TestCloudSchemaless.test (:solr:core)
96.86s SyncSliceTest.test (:solr:core)
95.72s TestSegmentSorting.testAtomicUpdateOfSegmentSortField (:solr:core)
93.68s UnloadDistributedZkTest.test (:solr:core)
90.37s HdfsDirectoryTest.testRandomAccessWrites (:solr:modules:hdfs)
The slowest suites (exceeding 1s) during this run:
295.19s TestPullReplica (:solr:core)
279.31s TestSchemaDesignerAPI (:solr:core)
266.64s TestCloudJSONFacetJoinDomain (:solr:core)
254.88s BasicDistributedZkTest (:solr:core)
250.55s TestRecoveryHdfs (:solr:modules:hdfs)
205.04s TestDistributedSearch (:solr:core)
202.93s TestCloudJSONFacetSKG (:solr:core)
198.92s CheckHdfsIndexTest (:solr:modules:hdfs)
198.53s TestCoordinatorRole (:solr:core)
193.59s ReindexCollectionTest (:solr:core)
ERROR: The following test(s) have failed:
- org.apache.solr.cli.ZkSubcommandsTest.testPutFileCompressed (:solr:core)
Test history: https://ge.apache.org/scans/tests?search.rootProjectNames=solr-root&tests.container=org.apache.solr.cli.ZkSubcommandsTest&tests.test=testPutFileCompressed http://fucit.org/solr-jenkins-reports/history-trend-of-recent-failures.html#series/org.apache.solr.cli.ZkSubcommandsTest.testPutFileCompressed
Test output: /home/jenkins/jenkins-home/712657a4/workspace/Solr/Solr-Check-main-s390x/solr/core/build/test-results/test/outputs/OUTPUT-org.apache.solr.cli.ZkSubcommandsTest.txt
Reproduce with: ./gradlew :solr:core:test --tests "org.apache.solr.cli.ZkSubcommandsTest.testPutFileCompressed" -Ptests.jvms=4 -Ptests.haltonfailure=false "-Ptests.jvmargs=-XX:TieredStopAtLevel=1 -XX:+UseParallelGC -XX:ActiveProcessorCount=1 -XX:ReservedCodeCacheSize=120m" -Ptests.seed=63A8B31DA4680360 -Ptests.multiplier=2 -Ptests.badapples=false -Ptests.file.encoding=US-ASCII
- org.apache.solr.search.facet.SpatialHeatmapFacetsTest.testClassicFacets (:solr:core)
Test history: https://ge.apache.org/scans/tests?search.rootProjectNames=solr-root&tests.container=org.apache.solr.search.facet.SpatialHeatmapFacetsTest&tests.test=testClassicFacets http://fucit.org/solr-jenkins-reports/history-trend-of-recent-failures.html#series/org.apache.solr.search.facet.SpatialHeatmapFacetsTest.testClassicFacets
Test output: /home/jenkins/jenkins-home/712657a4/workspace/Solr/Solr-Check-main-s390x/solr/core/build/test-results/test/outputs/OUTPUT-org.apache.solr.search.facet.SpatialHeatmapFacetsTest.txt
Reproduce with: ./gradlew :solr:core:test --tests "org.apache.solr.search.facet.SpatialHeatmapFacetsTest.testClassicFacets" -Ptests.jvms=4 -Ptests.haltonfailure=false "-Ptests.jvmargs=-XX:TieredStopAtLevel=1 -XX:+UseParallelGC -XX:ActiveProcessorCount=1 -XX:ReservedCodeCacheSize=120m" -Ptests.seed=63A8B31DA4680360 -Ptests.multiplier=2 -Ptests.badapples=false -Ptests.file.encoding=US-ASCII
Deprecated Gradle features were used in this build, making it incompatible with Gradle 9.0.
You can use '--warning-mode all' to show the individual deprecation warnings and determine if they come from your own scripts or plugins.
For more on this, please refer to https://docs.gradle.org/8.4/userguide/command_line_interface.html#sec:command_line_warnings in the Gradle documentation.
BUILD SUCCESSFUL in 1h 52m 23s
598 actionable tasks: 598 executed
Publishing build scan...
https://ge.apache.org/s/vg3nnb5f64fmu
Build step 'Invoke Gradle script' changed build result to SUCCESS
Archiving artifacts
‘**/*.events’ doesn’t match anything: ‘**’ exists but not ‘**/*.events’
No artifacts found that match the file pattern "**/*.events,heapdumps/**,**/hs_err_pid*". Configuration error?
Recording test results
[Checks API] No suitable checks publisher found.
Build step 'Publish JUnit test result report' changed build result to UNSTABLE
Email was triggered for: Unstable (Test Failures)
Sending email for trigger: Unstable (Test Failures)