You are viewing a plain text version of this content. The canonical link for it is here.
Posted to notifications@maven.apache.org by Apache Jenkins Server <je...@builds.apache.org> on 2018/05/18 21:49:42 UTC
Build failed in Jenkins: Maven TLP » maven » MNG-6410 #1
See https://builds.apache.org/job/maven-box/job/maven/job/MNG-6410/1/
No changes.
All tests passed
Build log:
[...truncated 483.98 KB...]
at sun.reflect.NativeMethodAccessorImpl.invoke0 (Native Method)
at sun.reflect.NativeMethodAccessorImpl.invoke (NativeMethodAccessorImpl.java:57)
at sun.reflect.DelegatingMethodAccessorImpl.invoke (DelegatingMethodAccessorImpl.java:43)
at java.lang.reflect.Method.invoke (Method.java:606)
at org.codehaus.plexus.classworlds.launcher.Launcher.launchEnhanced (Launcher.java:289)
at org.codehaus.plexus.classworlds.launcher.Launcher.launch (Launcher.java:229)
at org.codehaus.plexus.classworlds.launcher.Launcher.mainWithExitCode (Launcher.java:415)
at org.codehaus.plexus.classworlds.launcher.Launcher.main (Launcher.java:356)
Caused by: org.apache.maven.plugin.MojoExecutionException: Error rendering velocity resource.
at org.apache.maven.plugin.resources.remote.ProcessRemoteResourcesMojo.processResourceBundles (ProcessRemoteResourcesMojo.java:1246)
at org.apache.maven.plugin.resources.remote.ProcessRemoteResourcesMojo.execute (ProcessRemoteResourcesMojo.java:520)
at org.apache.maven.plugin.DefaultBuildPluginManager.executeMojo (DefaultBuildPluginManager.java:134)
at org.apache.maven.lifecycle.internal.MojoExecutor.execute (MojoExecutor.java:208)
at org.apache.maven.lifecycle.internal.MojoExecutor.execute (MojoExecutor.java:154)
at org.apache.maven.lifecycle.internal.MojoExecutor.execute (MojoExecutor.java:146)
at org.apache.maven.lifecycle.internal.LifecycleModuleBuilder.buildProject (LifecycleModuleBuilder.java:117)
at org.apache.maven.lifecycle.internal.LifecycleModuleBuilder.buildProject (LifecycleModuleBuilder.java:81)
at org.apache.maven.lifecycle.internal.builder.singlethreaded.SingleThreadedBuilder.build (SingleThreadedBuilder.java:51)
at org.apache.maven.lifecycle.internal.LifecycleStarter.execute (LifecycleStarter.java:128)
at org.apache.maven.DefaultMaven.doExecute (DefaultMaven.java:309)
at org.apache.maven.DefaultMaven.doExecute (DefaultMaven.java:194)
at org.apache.maven.DefaultMaven.execute (DefaultMaven.java:107)
at org.apache.maven.cli.MavenCli.execute (MavenCli.java:955)
at org.apache.maven.cli.MavenCli.doMain (MavenCli.java:290)
at org.apache.maven.cli.MavenCli.main (MavenCli.java:194)
at sun.reflect.NativeMethodAccessorImpl.invoke0 (Native Method)
at sun.reflect.NativeMethodAccessorImpl.invoke (NativeMethodAccessorImpl.java:57)
at sun.reflect.DelegatingMethodAccessorImpl.invoke (DelegatingMethodAccessorImpl.java:43)
at java.lang.reflect.Method.invoke (Method.java:606)
at org.codehaus.plexus.classworlds.launcher.Launcher.launchEnhanced (Launcher.java:289)
at org.codehaus.plexus.classworlds.launcher.Launcher.launch (Launcher.java:229)
at org.codehaus.plexus.classworlds.launcher.Launcher.mainWithExitCode (Launcher.java:415)
at org.codehaus.plexus.classworlds.launcher.Launcher.main (Launcher.java:356)
Caused by: org.apache.velocity.exception.MethodInvocationException: Invocation of method 'getResourceAsFile' in class org.codehaus.plexus.resource.DefaultResourceManager threw exception org.codehaus.plexus.resource.loader.ResourceNotFoundException: Could not find resource 'https://www.apache.org/licenses/LICENSE-2.0.txt'. at remote-resources[line 38, column 26]
at org.apache.velocity.runtime.parser.node.ASTMethod.handleInvocationException (ASTMethod.java:243)
at org.apache.velocity.runtime.parser.node.ASTMethod.execute (ASTMethod.java:187)
at org.apache.velocity.runtime.parser.node.ASTReference.execute (ASTReference.java:280)
at org.apache.velocity.runtime.parser.node.ASTReference.value (ASTReference.java:567)
at org.apache.velocity.runtime.parser.node.ASTExpression.value (ASTExpression.java:71)
at org.apache.velocity.runtime.parser.node.ASTSetDirective.render (ASTSetDirective.java:142)
at org.apache.velocity.runtime.parser.node.ASTBlock.render (ASTBlock.java:72)
at org.apache.velocity.runtime.parser.node.ASTIfStatement.render (ASTIfStatement.java:87)
at org.apache.velocity.runtime.parser.node.ASTBlock.render (ASTBlock.java:72)
at org.apache.velocity.runtime.parser.node.ASTIfStatement.render (ASTIfStatement.java:87)
at org.apache.velocity.runtime.parser.node.ASTBlock.render (ASTBlock.java:72)
at org.apache.velocity.runtime.directive.Foreach.render (Foreach.java:420)
at org.apache.velocity.runtime.parser.node.ASTDirective.render (ASTDirective.java:207)
at org.apache.velocity.runtime.parser.node.ASTBlock.render (ASTBlock.java:72)
at org.apache.velocity.runtime.directive.Foreach.render (Foreach.java:420)
at org.apache.velocity.runtime.parser.node.ASTDirective.render (ASTDirective.java:207)
at org.apache.velocity.runtime.parser.node.SimpleNode.render (SimpleNode.java:342)
at org.apache.velocity.runtime.RuntimeInstance.render (RuntimeInstance.java:1378)
at org.apache.velocity.runtime.RuntimeInstance.evaluate (RuntimeInstance.java:1314)
at org.apache.velocity.app.Velocity.evaluate (Velocity.java:254)
at org.apache.maven.plugin.resources.remote.ProcessRemoteResourcesMojo.processResourceBundles (ProcessRemoteResourcesMojo.java:1218)
at org.apache.maven.plugin.resources.remote.ProcessRemoteResourcesMojo.execute (ProcessRemoteResourcesMojo.java:520)
at org.apache.maven.plugin.DefaultBuildPluginManager.executeMojo (DefaultBuildPluginManager.java:134)
at org.apache.maven.lifecycle.internal.MojoExecutor.execute (MojoExecutor.java:208)
at org.apache.maven.lifecycle.internal.MojoExecutor.execute (MojoExecutor.java:154)
at org.apache.maven.lifecycle.internal.MojoExecutor.execute (MojoExecutor.java:146)
at org.apache.maven.lifecycle.internal.LifecycleModuleBuilder.buildProject (LifecycleModuleBuilder.java:117)
at org.apache.maven.lifecycle.internal.LifecycleModuleBuilder.buildProject (LifecycleModuleBuilder.java:81)
at org.apache.maven.lifecycle.internal.builder.singlethreaded.SingleThreadedBuilder.build (SingleThreadedBuilder.java:51)
at org.apache.maven.lifecycle.internal.LifecycleStarter.execute (LifecycleStarter.java:128)
at org.apache.maven.DefaultMaven.doExecute (DefaultMaven.java:309)
at org.apache.maven.DefaultMaven.doExecute (DefaultMaven.java:194)
at org.apache.maven.DefaultMaven.execute (DefaultMaven.java:107)
at org.apache.maven.cli.MavenCli.execute (MavenCli.java:955)
at org.apache.maven.cli.MavenCli.doMain (MavenCli.java:290)
at org.apache.maven.cli.MavenCli.main (MavenCli.java:194)
at sun.reflect.NativeMethodAccessorImpl.invoke0 (Native Method)
at sun.reflect.NativeMethodAccessorImpl.invoke (NativeMethodAccessorImpl.java:57)
at sun.reflect.DelegatingMethodAccessorImpl.invoke (DelegatingMethodAccessorImpl.java:43)
at java.lang.reflect.Method.invoke (Method.java:606)
at org.codehaus.plexus.classworlds.launcher.Launcher.launchEnhanced (Launcher.java:289)
at org.codehaus.plexus.classworlds.launcher.Launcher.launch (Launcher.java:229)
at org.codehaus.plexus.classworlds.launcher.Launcher.mainWithExitCode (Launcher.java:415)
at org.codehaus.plexus.classworlds.launcher.Launcher.main (Launcher.java:356)
Caused by: org.codehaus.plexus.resource.loader.ResourceNotFoundException: Could not find resource 'https://www.apache.org/licenses/LICENSE-2.0.txt'.
at org.codehaus.plexus.resource.DefaultResourceManager.getResource (DefaultResourceManager.java:173)
at org.codehaus.plexus.resource.DefaultResourceManager.getResourceAsFile (DefaultResourceManager.java:91)
at sun.reflect.NativeMethodAccessorImpl.invoke0 (Native Method)
at sun.reflect.NativeMethodAccessorImpl.invoke (NativeMethodAccessorImpl.java:57)
at sun.reflect.DelegatingMethodAccessorImpl.invoke (DelegatingMethodAccessorImpl.java:43)
at java.lang.reflect.Method.invoke (Method.java:606)
at org.apache.velocity.util.introspection.UberspectImpl$VelMethodImpl.doInvoke (UberspectImpl.java:395)
at org.apache.velocity.util.introspection.UberspectImpl$VelMethodImpl.invoke (UberspectImpl.java:384)
at org.apache.velocity.runtime.parser.node.ASTMethod.execute (ASTMethod.java:173)
at org.apache.velocity.runtime.parser.node.ASTReference.execute (ASTReference.java:280)
at org.apache.velocity.runtime.parser.node.ASTReference.value (ASTReference.java:567)
at org.apache.velocity.runtime.parser.node.ASTExpression.value (ASTExpression.java:71)
at org.apache.velocity.runtime.parser.node.ASTSetDirective.render (ASTSetDirective.java:142)
at org.apache.velocity.runtime.parser.node.ASTBlock.render (ASTBlock.java:72)
at org.apache.velocity.runtime.parser.node.ASTIfStatement.render (ASTIfStatement.java:87)
at org.apache.velocity.runtime.parser.node.ASTBlock.render (ASTBlock.java:72)
at org.apache.velocity.runtime.parser.node.ASTIfStatement.render (ASTIfStatement.java:87)
at org.apache.velocity.runtime.parser.node.ASTBlock.render (ASTBlock.java:72)
at org.apache.velocity.runtime.directive.Foreach.render (Foreach.java:420)
at org.apache.velocity.runtime.parser.node.ASTDirective.render (ASTDirective.java:207)
at org.apache.velocity.runtime.parser.node.ASTBlock.render (ASTBlock.java:72)
at org.apache.velocity.runtime.directive.Foreach.render (Foreach.java:420)
at org.apache.velocity.runtime.parser.node.ASTDirective.render (ASTDirective.java:207)
at org.apache.velocity.runtime.parser.node.SimpleNode.render (SimpleNode.java:342)
at org.apache.velocity.runtime.RuntimeInstance.render (RuntimeInstance.java:1378)
at org.apache.velocity.runtime.RuntimeInstance.evaluate (RuntimeInstance.java:1314)
at org.apache.velocity.app.Velocity.evaluate (Velocity.java:254)
at org.apache.maven.plugin.resources.remote.ProcessRemoteResourcesMojo.processResourceBundles (ProcessRemoteResourcesMojo.java:1218)
at org.apache.maven.plugin.resources.remote.ProcessRemoteResourcesMojo.execute (ProcessRemoteResourcesMojo.java:520)
at org.apache.maven.plugin.DefaultBuildPluginManager.executeMojo (DefaultBuildPluginManager.java:134)
at org.apache.maven.lifecycle.internal.MojoExecutor.execute (MojoExecutor.java:208)
at org.apache.maven.lifecycle.internal.MojoExecutor.execute (MojoExecutor.java:154)
at org.apache.maven.lifecycle.internal.MojoExecutor.execute (MojoExecutor.java:146)
at org.apache.maven.lifecycle.internal.LifecycleModuleBuilder.buildProject (LifecycleModuleBuilder.java:117)
at org.apache.maven.lifecycle.internal.LifecycleModuleBuilder.buildProject (LifecycleModuleBuilder.java:81)
at org.apache.maven.lifecycle.internal.builder.singlethreaded.SingleThreadedBuilder.build (SingleThreadedBuilder.java:51)
at org.apache.maven.lifecycle.internal.LifecycleStarter.execute (LifecycleStarter.java:128)
at org.apache.maven.DefaultMaven.doExecute (DefaultMaven.java:309)
at org.apache.maven.DefaultMaven.doExecute (DefaultMaven.java:194)
at org.apache.maven.DefaultMaven.execute (DefaultMaven.java:107)
at org.apache.maven.cli.MavenCli.execute (MavenCli.java:955)
at org.apache.maven.cli.MavenCli.doMain (MavenCli.java:290)
at org.apache.maven.cli.MavenCli.main (MavenCli.java:194)
at sun.reflect.NativeMethodAccessorImpl.invoke0 (Native Method)
at sun.reflect.NativeMethodAccessorImpl.invoke (NativeMethodAccessorImpl.java:57)
at sun.reflect.DelegatingMethodAccessorImpl.invoke (DelegatingMethodAccessorImpl.java:43)
at java.lang.reflect.Method.invoke (Method.java:606)
at org.codehaus.plexus.classworlds.launcher.Launcher.launchEnhanced (Launcher.java:289)
at org.codehaus.plexus.classworlds.launcher.Launcher.launch (Launcher.java:229)
at org.codehaus.plexus.classworlds.launcher.Launcher.mainWithExitCode (Launcher.java:415)
at org.codehaus.plexus.classworlds.launcher.Launcher.main (Launcher.java:356)
[ERROR]
[ERROR] Re-run Maven using the -X switch to enable full debug logging.
[ERROR]
[ERROR] For more information about the errors and possible solutions, please read the following articles:
[ERROR] [Help 1] http://cwiki.apache.org/confluence/display/MAVEN/MojoExecutionException
[ERROR]
[ERROR] After correcting the problems, you can resume the build with the command
[ERROR] mvn <goals> -rf :apache-maven
[Pipeline] }
[withMaven] artifactsPublisher - Archive artifact pom.xml under org/apache/maven/maven/3.5.4-SNAPSHOT/maven-3.5.4-SNAPSHOT.pom
[withMaven] artifactsPublisher - Archive artifact maven-model/pom.xml under org/apache/maven/maven-model/3.5.4-SNAPSHOT/maven-model-3.5.4-SNAPSHOT.pom
[withMaven] artifactsPublisher - Archive artifact maven-model/target/maven-model-3.5.4-SNAPSHOT.jar under org/apache/maven/maven-model/3.5.4-SNAPSHOT/maven-model-3.5.4-SNAPSHOT.jar
[withMaven] artifactsPublisher - Archive artifact maven-artifact/pom.xml under org/apache/maven/maven-artifact/3.5.4-SNAPSHOT/maven-artifact-3.5.4-SNAPSHOT.pom
[withMaven] artifactsPublisher - Archive artifact maven-artifact/target/maven-artifact-3.5.4-SNAPSHOT.jar under org/apache/maven/maven-artifact/3.5.4-SNAPSHOT/maven-artifact-3.5.4-SNAPSHOT.jar
[withMaven] artifactsPublisher - Archive artifact maven-plugin-api/pom.xml under org/apache/maven/maven-plugin-api/3.5.4-SNAPSHOT/maven-plugin-api-3.5.4-SNAPSHOT.pom
[withMaven] artifactsPublisher - Archive artifact maven-plugin-api/target/maven-plugin-api-3.5.4-SNAPSHOT.jar under org/apache/maven/maven-plugin-api/3.5.4-SNAPSHOT/maven-plugin-api-3.5.4-SNAPSHOT.jar
[withMaven] artifactsPublisher - Archive artifact maven-builder-support/pom.xml under org/apache/maven/maven-builder-support/3.5.4-SNAPSHOT/maven-builder-support-3.5.4-SNAPSHOT.pom
[withMaven] artifactsPublisher - Archive artifact maven-builder-support/target/maven-builder-support-3.5.4-SNAPSHOT.jar under org/apache/maven/maven-builder-support/3.5.4-SNAPSHOT/maven-builder-support-3.5.4-SNAPSHOT.jar
[withMaven] artifactsPublisher - Archive artifact maven-model-builder/pom.xml under org/apache/maven/maven-model-builder/3.5.4-SNAPSHOT/maven-model-builder-3.5.4-SNAPSHOT.pom
[withMaven] artifactsPublisher - Archive artifact maven-model-builder/target/maven-model-builder-3.5.4-SNAPSHOT.jar under org/apache/maven/maven-model-builder/3.5.4-SNAPSHOT/maven-model-builder-3.5.4-SNAPSHOT.jar
[withMaven] artifactsPublisher - Archive artifact maven-settings/pom.xml under org/apache/maven/maven-settings/3.5.4-SNAPSHOT/maven-settings-3.5.4-SNAPSHOT.pom
[withMaven] artifactsPublisher - Archive artifact maven-settings/target/maven-settings-3.5.4-SNAPSHOT.jar under org/apache/maven/maven-settings/3.5.4-SNAPSHOT/maven-settings-3.5.4-SNAPSHOT.jar
[withMaven] artifactsPublisher - Archive artifact maven-settings-builder/pom.xml under org/apache/maven/maven-settings-builder/3.5.4-SNAPSHOT/maven-settings-builder-3.5.4-SNAPSHOT.pom
[withMaven] artifactsPublisher - Archive artifact maven-settings-builder/target/maven-settings-builder-3.5.4-SNAPSHOT.jar under org/apache/maven/maven-settings-builder/3.5.4-SNAPSHOT/maven-settings-builder-3.5.4-SNAPSHOT.jar
[withMaven] artifactsPublisher - Archive artifact maven-repository-metadata/pom.xml under org/apache/maven/maven-repository-metadata/3.5.4-SNAPSHOT/maven-repository-metadata-3.5.4-SNAPSHOT.pom
[withMaven] artifactsPublisher - Archive artifact maven-repository-metadata/target/maven-repository-metadata-3.5.4-SNAPSHOT.jar under org/apache/maven/maven-repository-metadata/3.5.4-SNAPSHOT/maven-repository-metadata-3.5.4-SNAPSHOT.jar
[withMaven] artifactsPublisher - Archive artifact maven-resolver-provider/pom.xml under org/apache/maven/maven-resolver-provider/3.5.4-SNAPSHOT/maven-resolver-provider-3.5.4-SNAPSHOT.pom
[withMaven] artifactsPublisher - Archive artifact maven-resolver-provider/target/maven-resolver-provider-3.5.4-SNAPSHOT.jar under org/apache/maven/maven-resolver-provider/3.5.4-SNAPSHOT/maven-resolver-provider-3.5.4-SNAPSHOT.jar
[withMaven] artifactsPublisher - Archive artifact maven-core/pom.xml under org/apache/maven/maven-core/3.5.4-SNAPSHOT/maven-core-3.5.4-SNAPSHOT.pom
[withMaven] artifactsPublisher - Archive artifact maven-core/target/maven-core-3.5.4-SNAPSHOT.jar under org/apache/maven/maven-core/3.5.4-SNAPSHOT/maven-core-3.5.4-SNAPSHOT.jar
[withMaven] artifactsPublisher - Archive artifact maven-slf4j-provider/pom.xml under org/apache/maven/maven-slf4j-provider/3.5.4-SNAPSHOT/maven-slf4j-provider-3.5.4-SNAPSHOT.pom
[withMaven] artifactsPublisher - Archive artifact maven-slf4j-provider/target/maven-slf4j-provider-3.5.4-SNAPSHOT.jar under org/apache/maven/maven-slf4j-provider/3.5.4-SNAPSHOT/maven-slf4j-provider-3.5.4-SNAPSHOT.jar
[withMaven] artifactsPublisher - Archive artifact maven-embedder/pom.xml under org/apache/maven/maven-embedder/3.5.4-SNAPSHOT/maven-embedder-3.5.4-SNAPSHOT.pom
[withMaven] artifactsPublisher - Archive artifact maven-embedder/target/maven-embedder-3.5.4-SNAPSHOT.jar under org/apache/maven/maven-embedder/3.5.4-SNAPSHOT/maven-embedder-3.5.4-SNAPSHOT.jar
[withMaven] artifactsPublisher - Archive artifact maven-compat/pom.xml under org/apache/maven/maven-compat/3.5.4-SNAPSHOT/maven-compat-3.5.4-SNAPSHOT.pom
[withMaven] artifactsPublisher - Archive artifact maven-compat/target/maven-compat-3.5.4-SNAPSHOT.jar under org/apache/maven/maven-compat/3.5.4-SNAPSHOT/maven-compat-3.5.4-SNAPSHOT.jar
[withMaven] artifactsPublisher - Archive artifact target/maven-3.5.4-SNAPSHOT-site.xml under org/apache/maven/maven/3.5.4-SNAPSHOT/maven-3.5.4-SNAPSHOT-site.xml
[Fast Archiver] No prior successful build to compare, so performing full copy of artifacts
[withMaven] junitPublisher - Archive test results for Maven artifact org.apache.maven:maven-model:3.5.4-SNAPSHOT generated by maven-surefire-plugin:test (default-test): maven-model/target/surefire-reports/*.xml
Recording test results
[withMaven] junitPublisher - Archive test results for Maven artifact org.apache.maven:maven-artifact:3.5.4-SNAPSHOT generated by maven-surefire-plugin:test (default-test): maven-artifact/target/surefire-reports/*.xml
Recording test results
[withMaven] junitPublisher - Archive test results for Maven artifact org.apache.maven:maven-plugin-api:3.5.4-SNAPSHOT generated by maven-surefire-plugin:test (default-test): maven-plugin-api/target/surefire-reports/*.xml
Recording test results
[withMaven] junitPublisher - Archive test results for Maven artifact org.apache.maven:maven-builder-support:3.5.4-SNAPSHOT generated by maven-surefire-plugin:test (default-test): maven-builder-support/target/surefire-reports/*.xml
Recording test results
[withMaven] junitPublisher - Archive test results for Maven artifact org.apache.maven:maven-model-builder:3.5.4-SNAPSHOT generated by maven-surefire-plugin:test (default-test): maven-model-builder/target/surefire-reports/*.xml
Recording test results
[withMaven] junitPublisher - Archive test results for Maven artifact org.apache.maven:maven-settings:3.5.4-SNAPSHOT generated by maven-surefire-plugin:test (default-test): maven-settings/target/surefire-reports/*.xml
Recording test results
None of the test reports contained any result
[withMaven] junitPublisher - Archive test results for Maven artifact org.apache.maven:maven-settings-builder:3.5.4-SNAPSHOT generated by maven-surefire-plugin:test (default-test): maven-settings-builder/target/surefire-reports/*.xml
Recording test results
[withMaven] junitPublisher - Archive test results for Maven artifact org.apache.maven:maven-repository-metadata:3.5.4-SNAPSHOT generated by maven-surefire-plugin:test (default-test): maven-repository-metadata/target/surefire-reports/*.xml
Recording test results
None of the test reports contained any result
[withMaven] junitPublisher - Archive test results for Maven artifact org.apache.maven:maven-resolver-provider:3.5.4-SNAPSHOT generated by maven-surefire-plugin:test (default-test): maven-resolver-provider/target/surefire-reports/*.xml
Recording test results
[withMaven] junitPublisher - Archive test results for Maven artifact org.apache.maven:maven-core:3.5.4-SNAPSHOT generated by maven-surefire-plugin:test (default-test): maven-core/target/surefire-reports/*.xml
Recording test results
[withMaven] junitPublisher - Archive test results for Maven artifact org.apache.maven:maven-slf4j-provider:3.5.4-SNAPSHOT generated by maven-surefire-plugin:test (default-test): maven-slf4j-provider/target/surefire-reports/*.xml
Recording test results
None of the test reports contained any result
[withMaven] junitPublisher - Archive test results for Maven artifact org.apache.maven:maven-embedder:3.5.4-SNAPSHOT generated by maven-surefire-plugin:test (default-test): maven-embedder/target/surefire-reports/*.xml
Recording test results
[withMaven] junitPublisher - Archive test results for Maven artifact org.apache.maven:maven-compat:3.5.4-SNAPSHOT generated by maven-surefire-plugin:test (default-test): maven-compat/target/surefire-reports/*.xml
Recording test results
ERROR: [withMaven] WARNING Exception processing the logs generated by the Jenkins Maven Event Spy /home/jenkins/jenkins-slave/workspace/maven-box_maven_MNG-6410-4QJMCDGJJDP6AQ4Z7SJP3XXDF4MPA6UCOW2CYOHJOQK2FUF3ANHQ/build@tmp/withMavenc5b651ab/maven-spy-20180518-214258-3195579305145422496617.log, ignore file. Please report a bug associated for the component 'pipeline-maven-plugin' at https://issues.jenkins-ci.org
java.lang.InterruptedException
at java.lang.Object.wait(Native Method)
at hudson.remoting.Request.call(Request.java:167)
at hudson.remoting.Channel.call(Channel.java:907)
at hudson.FilePath.act(FilePath.java:986)
at hudson.FilePath.act(FilePath.java:975)
at hudson.FilePath.exists(FilePath.java:1440)
at org.jenkinsci.plugins.pipeline.maven.MavenSpyLogProcessor.processMavenSpyLogs(MavenSpyLogProcessor.java:105)
at org.jenkinsci.plugins.pipeline.maven.WithMavenStepExecution$WorkspaceCleanupCallback.finished(WithMavenStepExecution.java:1015)
at org.jenkinsci.plugins.workflow.steps.BodyExecutionCallback$TailCall.onFailure(BodyExecutionCallback.java:124)
at org.jenkinsci.plugins.workflow.cps.CpsBodyExecution$FailureAdapter.receive(CpsBodyExecution.java:351)
at com.cloudbees.groovy.cps.impl.ThrowBlock$1.receive(ThrowBlock.java:68)
at com.cloudbees.groovy.cps.impl.ConstantBlock.eval(ConstantBlock.java:21)
at com.cloudbees.groovy.cps.Next.step(Next.java:83)
at com.cloudbees.groovy.cps.Continuable$1.call(Continuable.java:174)
at com.cloudbees.groovy.cps.Continuable$1.call(Continuable.java:163)
at org.codehaus.groovy.runtime.GroovyCategorySupport$ThreadCategoryInfo.use(GroovyCategorySupport.java:122)
at org.codehaus.groovy.runtime.GroovyCategorySupport.use(GroovyCategorySupport.java:261)
at com.cloudbees.groovy.cps.Continuable.run0(Continuable.java:163)
at org.jenkinsci.plugins.workflow.cps.SandboxContinuable.access$001(SandboxContinuable.java:19)
at org.jenkinsci.plugins.workflow.cps.SandboxContinuable$1.call(SandboxContinuable.java:35)
at org.jenkinsci.plugins.workflow.cps.SandboxContinuable$1.call(SandboxContinuable.java:32)
at org.jenkinsci.plugins.scriptsecurity.sandbox.groovy.GroovySandbox.runInSandbox(GroovySandbox.java:108)
at org.jenkinsci.plugins.workflow.cps.SandboxContinuable.run0(SandboxContinuable.java:32)
at org.jenkinsci.plugins.workflow.cps.CpsThread.runNextChunk(CpsThread.java:174)
at org.jenkinsci.plugins.workflow.cps.CpsThreadGroup.run(CpsThreadGroup.java:331)
at org.jenkinsci.plugins.workflow.cps.CpsThreadGroup.access$200(CpsThreadGroup.java:82)
at org.jenkinsci.plugins.workflow.cps.CpsThreadGroup$2.call(CpsThreadGroup.java:243)
at org.jenkinsci.plugins.workflow.cps.CpsThreadGroup$2.call(CpsThreadGroup.java:231)
at org.jenkinsci.plugins.workflow.cps.CpsVmExecutorService$2.call(CpsVmExecutorService.java:64)
at java.util.concurrent.FutureTask.run(FutureTask.java:266)
at hudson.remoting.SingleLaneExecutorService$1.run(SingleLaneExecutorService.java:112)
at jenkins.util.ContextResettingExecutorService$1.run(ContextResettingExecutorService.java:28)
at java.util.concurrent.Executors$RunnableAdapter.call(Executors.java:511)
at java.util.concurrent.FutureTask.run(FutureTask.java:266)
at java.util.concurrent.ThreadPoolExecutor.runWorker(ThreadPoolExecutor.java:1149)
at java.util.concurrent.ThreadPoolExecutor$Worker.run(ThreadPoolExecutor.java:624)
at java.lang.Thread.run(Thread.java:748)
[Pipeline] // withMaven
[Pipeline] }
[Pipeline] // stage
[Pipeline] }
[Pipeline] // dir
[Pipeline] }
[Pipeline] // node
[Pipeline] stage
[Pipeline] { (Notifications)
[Pipeline] echo
Build result: FAILURE
[Pipeline] jiraIssueSelector
[Pipeline] emailext
Build failed in Jenkins: Maven TLP » maven » MNG-6410 #3
Posted by Apache Jenkins Server <je...@builds.apache.org>.
See https://builds.apache.org/job/maven-box/job/maven/job/MNG-6410/3/
Changes:
* Rename method name to the option name
All tests passed
Build log:
[...truncated 480.10 KB...]
[INFO] ------------------------------------------------------------------------
[INFO] BUILD FAILURE
[INFO] ------------------------------------------------------------------------
[INFO] Total time: 02:16 min
[INFO] Finished at: 2018-05-20T11:05:53Z
[INFO] Final Memory: 126M/2827M
[INFO] ------------------------------------------------------------------------
[INFO] [jenkins-event-spy] Generated /home/jenkins/jenkins-slave/workspace/maven-box_maven_MNG-6410-4QJMCDGJJDP6AQ4Z7SJP3XXDF4MPA6UCOW2CYOHJOQK2FUF3ANHQ/build@tmp/withMaven859ee293/maven-spy-20180520-110336-846123879397589975185.log
[ERROR] Failed to execute goal org.apache.maven.plugins:maven-remote-resources-plugin:1.5:process (process-resource-bundles) on project apache-maven: Error rendering velocity resource. Invocation of method 'getResourceAsFile' in class org.codehaus.plexus.resource.DefaultResourceManager threw exception org.codehaus.plexus.resource.loader.ResourceNotFoundException: Could not find resource 'https://www.apache.org/licenses/LICENSE-2.0.txt'. at remote-resources[line 38, column 26] -> [Help 1]
org.apache.maven.lifecycle.LifecycleExecutionException: Failed to execute goal org.apache.maven.plugins:maven-remote-resources-plugin:1.5:process (process-resource-bundles) on project apache-maven: Error rendering velocity resource.
at org.apache.maven.lifecycle.internal.MojoExecutor.execute (MojoExecutor.java:213)
at org.apache.maven.lifecycle.internal.MojoExecutor.execute (MojoExecutor.java:154)
at org.apache.maven.lifecycle.internal.MojoExecutor.execute (MojoExecutor.java:146)
at org.apache.maven.lifecycle.internal.LifecycleModuleBuilder.buildProject (LifecycleModuleBuilder.java:117)
at org.apache.maven.lifecycle.internal.LifecycleModuleBuilder.buildProject (LifecycleModuleBuilder.java:81)
at org.apache.maven.lifecycle.internal.builder.singlethreaded.SingleThreadedBuilder.build (SingleThreadedBuilder.java:51)
at org.apache.maven.lifecycle.internal.LifecycleStarter.execute (LifecycleStarter.java:128)
at org.apache.maven.DefaultMaven.doExecute (DefaultMaven.java:309)
at org.apache.maven.DefaultMaven.doExecute (DefaultMaven.java:194)
at org.apache.maven.DefaultMaven.execute (DefaultMaven.java:107)
at org.apache.maven.cli.MavenCli.execute (MavenCli.java:955)
at org.apache.maven.cli.MavenCli.doMain (MavenCli.java:290)
at org.apache.maven.cli.MavenCli.main (MavenCli.java:194)
at sun.reflect.NativeMethodAccessorImpl.invoke0 (Native Method)
at sun.reflect.NativeMethodAccessorImpl.invoke (NativeMethodAccessorImpl.java:57)
at sun.reflect.DelegatingMethodAccessorImpl.invoke (DelegatingMethodAccessorImpl.java:43)
at java.lang.reflect.Method.invoke (Method.java:606)
at org.codehaus.plexus.classworlds.launcher.Launcher.launchEnhanced (Launcher.java:289)
at org.codehaus.plexus.classworlds.launcher.Launcher.launch (Launcher.java:229)
at org.codehaus.plexus.classworlds.launcher.Launcher.mainWithExitCode (Launcher.java:415)
at org.codehaus.plexus.classworlds.launcher.Launcher.main (Launcher.java:356)
Caused by: org.apache.maven.plugin.MojoExecutionException: Error rendering velocity resource.
at org.apache.maven.plugin.resources.remote.ProcessRemoteResourcesMojo.processResourceBundles (ProcessRemoteResourcesMojo.java:1246)
at org.apache.maven.plugin.resources.remote.ProcessRemoteResourcesMojo.execute (ProcessRemoteResourcesMojo.java:520)
at org.apache.maven.plugin.DefaultBuildPluginManager.executeMojo (DefaultBuildPluginManager.java:134)
at org.apache.maven.lifecycle.internal.MojoExecutor.execute (MojoExecutor.java:208)
at org.apache.maven.lifecycle.internal.MojoExecutor.execute (MojoExecutor.java:154)
at org.apache.maven.lifecycle.internal.MojoExecutor.execute (MojoExecutor.java:146)
at org.apache.maven.lifecycle.internal.LifecycleModuleBuilder.buildProject (LifecycleModuleBuilder.java:117)
at org.apache.maven.lifecycle.internal.LifecycleModuleBuilder.buildProject (LifecycleModuleBuilder.java:81)
at org.apache.maven.lifecycle.internal.builder.singlethreaded.SingleThreadedBuilder.build (SingleThreadedBuilder.java:51)
at org.apache.maven.lifecycle.internal.LifecycleStarter.execute (LifecycleStarter.java:128)
at org.apache.maven.DefaultMaven.doExecute (DefaultMaven.java:309)
at org.apache.maven.DefaultMaven.doExecute (DefaultMaven.java:194)
at org.apache.maven.DefaultMaven.execute (DefaultMaven.java:107)
at org.apache.maven.cli.MavenCli.execute (MavenCli.java:955)
at org.apache.maven.cli.MavenCli.doMain (MavenCli.java:290)
at org.apache.maven.cli.MavenCli.main (MavenCli.java:194)
at sun.reflect.NativeMethodAccessorImpl.invoke0 (Native Method)
at sun.reflect.NativeMethodAccessorImpl.invoke (NativeMethodAccessorImpl.java:57)
at sun.reflect.DelegatingMethodAccessorImpl.invoke (DelegatingMethodAccessorImpl.java:43)
at java.lang.reflect.Method.invoke (Method.java:606)
at org.codehaus.plexus.classworlds.launcher.Launcher.launchEnhanced (Launcher.java:289)
at org.codehaus.plexus.classworlds.launcher.Launcher.launch (Launcher.java:229)
at org.codehaus.plexus.classworlds.launcher.Launcher.mainWithExitCode (Launcher.java:415)
at org.codehaus.plexus.classworlds.launcher.Launcher.main (Launcher.java:356)
Caused by: org.apache.velocity.exception.MethodInvocationException: Invocation of method 'getResourceAsFile' in class org.codehaus.plexus.resource.DefaultResourceManager threw exception org.codehaus.plexus.resource.loader.ResourceNotFoundException: Could not find resource 'https://www.apache.org/licenses/LICENSE-2.0.txt'. at remote-resources[line 38, column 26]
at org.apache.velocity.runtime.parser.node.ASTMethod.handleInvocationException (ASTMethod.java:243)
at org.apache.velocity.runtime.parser.node.ASTMethod.execute (ASTMethod.java:187)
at org.apache.velocity.runtime.parser.node.ASTReference.execute (ASTReference.java:280)
at org.apache.velocity.runtime.parser.node.ASTReference.value (ASTReference.java:567)
at org.apache.velocity.runtime.parser.node.ASTExpression.value (ASTExpression.java:71)
at org.apache.velocity.runtime.parser.node.ASTSetDirective.render (ASTSetDirective.java:142)
at org.apache.velocity.runtime.parser.node.ASTBlock.render (ASTBlock.java:72)
at org.apache.velocity.runtime.parser.node.ASTIfStatement.render (ASTIfStatement.java:87)
at org.apache.velocity.runtime.parser.node.ASTBlock.render (ASTBlock.java:72)
at org.apache.velocity.runtime.parser.node.ASTIfStatement.render (ASTIfStatement.java:87)
at org.apache.velocity.runtime.parser.node.ASTBlock.render (ASTBlock.java:72)
at org.apache.velocity.runtime.directive.Foreach.render (Foreach.java:420)
at org.apache.velocity.runtime.parser.node.ASTDirective.render (ASTDirective.java:207)
at org.apache.velocity.runtime.parser.node.ASTBlock.render (ASTBlock.java:72)
at org.apache.velocity.runtime.directive.Foreach.render (Foreach.java:420)
at org.apache.velocity.runtime.parser.node.ASTDirective.render (ASTDirective.java:207)
at org.apache.velocity.runtime.parser.node.SimpleNode.render (SimpleNode.java:342)
at org.apache.velocity.runtime.RuntimeInstance.render (RuntimeInstance.java:1378)
at org.apache.velocity.runtime.RuntimeInstance.evaluate (RuntimeInstance.java:1314)
at org.apache.velocity.app.Velocity.evaluate (Velocity.java:254)
at org.apache.maven.plugin.resources.remote.ProcessRemoteResourcesMojo.processResourceBundles (ProcessRemoteResourcesMojo.java:1218)
at org.apache.maven.plugin.resources.remote.ProcessRemoteResourcesMojo.execute (ProcessRemoteResourcesMojo.java:520)
at org.apache.maven.plugin.DefaultBuildPluginManager.executeMojo (DefaultBuildPluginManager.java:134)
at org.apache.maven.lifecycle.internal.MojoExecutor.execute (MojoExecutor.java:208)
at org.apache.maven.lifecycle.internal.MojoExecutor.execute (MojoExecutor.java:154)
at org.apache.maven.lifecycle.internal.MojoExecutor.execute (MojoExecutor.java:146)
at org.apache.maven.lifecycle.internal.LifecycleModuleBuilder.buildProject (LifecycleModuleBuilder.java:117)
at org.apache.maven.lifecycle.internal.LifecycleModuleBuilder.buildProject (LifecycleModuleBuilder.java:81)
at org.apache.maven.lifecycle.internal.builder.singlethreaded.SingleThreadedBuilder.build (SingleThreadedBuilder.java:51)
at org.apache.maven.lifecycle.internal.LifecycleStarter.execute (LifecycleStarter.java:128)
at org.apache.maven.DefaultMaven.doExecute (DefaultMaven.java:309)
at org.apache.maven.DefaultMaven.doExecute (DefaultMaven.java:194)
at org.apache.maven.DefaultMaven.execute (DefaultMaven.java:107)
at org.apache.maven.cli.MavenCli.execute (MavenCli.java:955)
at org.apache.maven.cli.MavenCli.doMain (MavenCli.java:290)
at org.apache.maven.cli.MavenCli.main (MavenCli.java:194)
at sun.reflect.NativeMethodAccessorImpl.invoke0 (Native Method)
at sun.reflect.NativeMethodAccessorImpl.invoke (NativeMethodAccessorImpl.java:57)
at sun.reflect.DelegatingMethodAccessorImpl.invoke (DelegatingMethodAccessorImpl.java:43)
at java.lang.reflect.Method.invoke (Method.java:606)
at org.codehaus.plexus.classworlds.launcher.Launcher.launchEnhanced (Launcher.java:289)
at org.codehaus.plexus.classworlds.launcher.Launcher.launch (Launcher.java:229)
at org.codehaus.plexus.classworlds.launcher.Launcher.mainWithExitCode (Launcher.java:415)
at org.codehaus.plexus.classworlds.launcher.Launcher.main (Launcher.java:356)
Caused by: org.codehaus.plexus.resource.loader.ResourceNotFoundException: Could not find resource 'https://www.apache.org/licenses/LICENSE-2.0.txt'.
at org.codehaus.plexus.resource.DefaultResourceManager.getResource (DefaultResourceManager.java:173)
at org.codehaus.plexus.resource.DefaultResourceManager.getResourceAsFile (DefaultResourceManager.java:91)
at sun.reflect.NativeMethodAccessorImpl.invoke0 (Native Method)
at sun.reflect.NativeMethodAccessorImpl.invoke (NativeMethodAccessorImpl.java:57)
at sun.reflect.DelegatingMethodAccessorImpl.invoke (DelegatingMethodAccessorImpl.java:43)
at java.lang.reflect.Method.invoke (Method.java:606)
at org.apache.velocity.util.introspection.UberspectImpl$VelMethodImpl.doInvoke (UberspectImpl.java:395)
at org.apache.velocity.util.introspection.UberspectImpl$VelMethodImpl.invoke (UberspectImpl.java:384)
at org.apache.velocity.runtime.parser.node.ASTMethod.execute (ASTMethod.java:173)
at org.apache.velocity.runtime.parser.node.ASTReference.execute (ASTReference.java:280)
at org.apache.velocity.runtime.parser.node.ASTReference.value (ASTReference.java:567)
at org.apache.velocity.runtime.parser.node.ASTExpression.value (ASTExpression.java:71)
at org.apache.velocity.runtime.parser.node.ASTSetDirective.render (ASTSetDirective.java:142)
at org.apache.velocity.runtime.parser.node.ASTBlock.render (ASTBlock.java:72)
at org.apache.velocity.runtime.parser.node.ASTIfStatement.render (ASTIfStatement.java:87)
at org.apache.velocity.runtime.parser.node.ASTBlock.render (ASTBlock.java:72)
at org.apache.velocity.runtime.parser.node.ASTIfStatement.render (ASTIfStatement.java:87)
at org.apache.velocity.runtime.parser.node.ASTBlock.render (ASTBlock.java:72)
at org.apache.velocity.runtime.directive.Foreach.render (Foreach.java:420)
at org.apache.velocity.runtime.parser.node.ASTDirective.render (ASTDirective.java:207)
at org.apache.velocity.runtime.parser.node.ASTBlock.render (ASTBlock.java:72)
at org.apache.velocity.runtime.directive.Foreach.render (Foreach.java:420)
at org.apache.velocity.runtime.parser.node.ASTDirective.render (ASTDirective.java:207)
at org.apache.velocity.runtime.parser.node.SimpleNode.render (SimpleNode.java:342)
at org.apache.velocity.runtime.RuntimeInstance.render (RuntimeInstance.java:1378)
at org.apache.velocity.runtime.RuntimeInstance.evaluate (RuntimeInstance.java:1314)
at org.apache.velocity.app.Velocity.evaluate (Velocity.java:254)
at org.apache.maven.plugin.resources.remote.ProcessRemoteResourcesMojo.processResourceBundles (ProcessRemoteResourcesMojo.java:1218)
at org.apache.maven.plugin.resources.remote.ProcessRemoteResourcesMojo.execute (ProcessRemoteResourcesMojo.java:520)
at org.apache.maven.plugin.DefaultBuildPluginManager.executeMojo (DefaultBuildPluginManager.java:134)
at org.apache.maven.lifecycle.internal.MojoExecutor.execute (MojoExecutor.java:208)
at org.apache.maven.lifecycle.internal.MojoExecutor.execute (MojoExecutor.java:154)
at org.apache.maven.lifecycle.internal.MojoExecutor.execute (MojoExecutor.java:146)
at org.apache.maven.lifecycle.internal.LifecycleModuleBuilder.buildProject (LifecycleModuleBuilder.java:117)
at org.apache.maven.lifecycle.internal.LifecycleModuleBuilder.buildProject (LifecycleModuleBuilder.java:81)
at org.apache.maven.lifecycle.internal.builder.singlethreaded.SingleThreadedBuilder.build (SingleThreadedBuilder.java:51)
at org.apache.maven.lifecycle.internal.LifecycleStarter.execute (LifecycleStarter.java:128)
at org.apache.maven.DefaultMaven.doExecute (DefaultMaven.java:309)
at org.apache.maven.DefaultMaven.doExecute (DefaultMaven.java:194)
at org.apache.maven.DefaultMaven.execute (DefaultMaven.java:107)
at org.apache.maven.cli.MavenCli.execute (MavenCli.java:955)
at org.apache.maven.cli.MavenCli.doMain (MavenCli.java:290)
at org.apache.maven.cli.MavenCli.main (MavenCli.java:194)
at sun.reflect.NativeMethodAccessorImpl.invoke0 (Native Method)
at sun.reflect.NativeMethodAccessorImpl.invoke (NativeMethodAccessorImpl.java:57)
at sun.reflect.DelegatingMethodAccessorImpl.invoke (DelegatingMethodAccessorImpl.java:43)
at java.lang.reflect.Method.invoke (Method.java:606)
at org.codehaus.plexus.classworlds.launcher.Launcher.launchEnhanced (Launcher.java:289)
at org.codehaus.plexus.classworlds.launcher.Launcher.launch (Launcher.java:229)
at org.codehaus.plexus.classworlds.launcher.Launcher.mainWithExitCode (Launcher.java:415)
at org.codehaus.plexus.classworlds.launcher.Launcher.main (Launcher.java:356)
[ERROR]
[ERROR] Re-run Maven using the -X switch to enable full debug logging.
[ERROR]
[ERROR] For more information about the errors and possible solutions, please read the following articles:
[ERROR] [Help 1] http://cwiki.apache.org/confluence/display/MAVEN/MojoExecutionException
[ERROR]
[ERROR] After correcting the problems, you can resume the build with the command
[ERROR] mvn <goals> -rf :apache-maven
[Pipeline] }
[withMaven] artifactsPublisher - Archive artifact pom.xml under org/apache/maven/maven/3.5.4-SNAPSHOT/maven-3.5.4-SNAPSHOT.pom
[withMaven] artifactsPublisher - Archive artifact maven-model/pom.xml under org/apache/maven/maven-model/3.5.4-SNAPSHOT/maven-model-3.5.4-SNAPSHOT.pom
[withMaven] artifactsPublisher - Archive artifact maven-model/target/maven-model-3.5.4-SNAPSHOT.jar under org/apache/maven/maven-model/3.5.4-SNAPSHOT/maven-model-3.5.4-SNAPSHOT.jar
[withMaven] artifactsPublisher - Archive artifact maven-artifact/pom.xml under org/apache/maven/maven-artifact/3.5.4-SNAPSHOT/maven-artifact-3.5.4-SNAPSHOT.pom
[withMaven] artifactsPublisher - Archive artifact maven-artifact/target/maven-artifact-3.5.4-SNAPSHOT.jar under org/apache/maven/maven-artifact/3.5.4-SNAPSHOT/maven-artifact-3.5.4-SNAPSHOT.jar
[withMaven] artifactsPublisher - Archive artifact maven-plugin-api/pom.xml under org/apache/maven/maven-plugin-api/3.5.4-SNAPSHOT/maven-plugin-api-3.5.4-SNAPSHOT.pom
[withMaven] artifactsPublisher - Archive artifact maven-plugin-api/target/maven-plugin-api-3.5.4-SNAPSHOT.jar under org/apache/maven/maven-plugin-api/3.5.4-SNAPSHOT/maven-plugin-api-3.5.4-SNAPSHOT.jar
[withMaven] artifactsPublisher - Archive artifact maven-builder-support/pom.xml under org/apache/maven/maven-builder-support/3.5.4-SNAPSHOT/maven-builder-support-3.5.4-SNAPSHOT.pom
[withMaven] artifactsPublisher - Archive artifact maven-builder-support/target/maven-builder-support-3.5.4-SNAPSHOT.jar under org/apache/maven/maven-builder-support/3.5.4-SNAPSHOT/maven-builder-support-3.5.4-SNAPSHOT.jar
[withMaven] artifactsPublisher - Archive artifact maven-model-builder/pom.xml under org/apache/maven/maven-model-builder/3.5.4-SNAPSHOT/maven-model-builder-3.5.4-SNAPSHOT.pom
[withMaven] artifactsPublisher - Archive artifact maven-model-builder/target/maven-model-builder-3.5.4-SNAPSHOT.jar under org/apache/maven/maven-model-builder/3.5.4-SNAPSHOT/maven-model-builder-3.5.4-SNAPSHOT.jar
[withMaven] artifactsPublisher - Archive artifact maven-settings/pom.xml under org/apache/maven/maven-settings/3.5.4-SNAPSHOT/maven-settings-3.5.4-SNAPSHOT.pom
[withMaven] artifactsPublisher - Archive artifact maven-settings/target/maven-settings-3.5.4-SNAPSHOT.jar under org/apache/maven/maven-settings/3.5.4-SNAPSHOT/maven-settings-3.5.4-SNAPSHOT.jar
[withMaven] artifactsPublisher - Archive artifact maven-settings-builder/pom.xml under org/apache/maven/maven-settings-builder/3.5.4-SNAPSHOT/maven-settings-builder-3.5.4-SNAPSHOT.pom
[withMaven] artifactsPublisher - Archive artifact maven-settings-builder/target/maven-settings-builder-3.5.4-SNAPSHOT.jar under org/apache/maven/maven-settings-builder/3.5.4-SNAPSHOT/maven-settings-builder-3.5.4-SNAPSHOT.jar
[withMaven] artifactsPublisher - Archive artifact maven-repository-metadata/pom.xml under org/apache/maven/maven-repository-metadata/3.5.4-SNAPSHOT/maven-repository-metadata-3.5.4-SNAPSHOT.pom
[withMaven] artifactsPublisher - Archive artifact maven-repository-metadata/target/maven-repository-metadata-3.5.4-SNAPSHOT.jar under org/apache/maven/maven-repository-metadata/3.5.4-SNAPSHOT/maven-repository-metadata-3.5.4-SNAPSHOT.jar
[withMaven] artifactsPublisher - Archive artifact maven-resolver-provider/pom.xml under org/apache/maven/maven-resolver-provider/3.5.4-SNAPSHOT/maven-resolver-provider-3.5.4-SNAPSHOT.pom
[withMaven] artifactsPublisher - Archive artifact maven-resolver-provider/target/maven-resolver-provider-3.5.4-SNAPSHOT.jar under org/apache/maven/maven-resolver-provider/3.5.4-SNAPSHOT/maven-resolver-provider-3.5.4-SNAPSHOT.jar
[withMaven] artifactsPublisher - Archive artifact maven-core/pom.xml under org/apache/maven/maven-core/3.5.4-SNAPSHOT/maven-core-3.5.4-SNAPSHOT.pom
[withMaven] artifactsPublisher - Archive artifact maven-core/target/maven-core-3.5.4-SNAPSHOT.jar under org/apache/maven/maven-core/3.5.4-SNAPSHOT/maven-core-3.5.4-SNAPSHOT.jar
[withMaven] artifactsPublisher - Archive artifact maven-slf4j-provider/pom.xml under org/apache/maven/maven-slf4j-provider/3.5.4-SNAPSHOT/maven-slf4j-provider-3.5.4-SNAPSHOT.pom
[withMaven] artifactsPublisher - Archive artifact maven-slf4j-provider/target/maven-slf4j-provider-3.5.4-SNAPSHOT.jar under org/apache/maven/maven-slf4j-provider/3.5.4-SNAPSHOT/maven-slf4j-provider-3.5.4-SNAPSHOT.jar
[withMaven] artifactsPublisher - Archive artifact maven-embedder/pom.xml under org/apache/maven/maven-embedder/3.5.4-SNAPSHOT/maven-embedder-3.5.4-SNAPSHOT.pom
[withMaven] artifactsPublisher - Archive artifact maven-embedder/target/maven-embedder-3.5.4-SNAPSHOT.jar under org/apache/maven/maven-embedder/3.5.4-SNAPSHOT/maven-embedder-3.5.4-SNAPSHOT.jar
[withMaven] artifactsPublisher - Archive artifact maven-compat/pom.xml under org/apache/maven/maven-compat/3.5.4-SNAPSHOT/maven-compat-3.5.4-SNAPSHOT.pom
[withMaven] artifactsPublisher - Archive artifact maven-compat/target/maven-compat-3.5.4-SNAPSHOT.jar under org/apache/maven/maven-compat/3.5.4-SNAPSHOT/maven-compat-3.5.4-SNAPSHOT.jar
[withMaven] artifactsPublisher - Archive artifact target/maven-3.5.4-SNAPSHOT-site.xml under org/apache/maven/maven/3.5.4-SNAPSHOT/maven-3.5.4-SNAPSHOT-site.xml
[Fast Archiver] No prior successful build to compare, so performing full copy of artifacts
[withMaven] junitPublisher - Archive test results for Maven artifact org.apache.maven:maven-model:3.5.4-SNAPSHOT generated by maven-surefire-plugin:test (default-test): maven-model/target/surefire-reports/*.xml
Recording test results
[withMaven] junitPublisher - Archive test results for Maven artifact org.apache.maven:maven-artifact:3.5.4-SNAPSHOT generated by maven-surefire-plugin:test (default-test): maven-artifact/target/surefire-reports/*.xml
Recording test results
[withMaven] junitPublisher - Archive test results for Maven artifact org.apache.maven:maven-plugin-api:3.5.4-SNAPSHOT generated by maven-surefire-plugin:test (default-test): maven-plugin-api/target/surefire-reports/*.xml
Recording test results
[withMaven] junitPublisher - Archive test results for Maven artifact org.apache.maven:maven-builder-support:3.5.4-SNAPSHOT generated by maven-surefire-plugin:test (default-test): maven-builder-support/target/surefire-reports/*.xml
Recording test results
[withMaven] junitPublisher - Archive test results for Maven artifact org.apache.maven:maven-model-builder:3.5.4-SNAPSHOT generated by maven-surefire-plugin:test (default-test): maven-model-builder/target/surefire-reports/*.xml
Recording test results
[withMaven] junitPublisher - Archive test results for Maven artifact org.apache.maven:maven-settings:3.5.4-SNAPSHOT generated by maven-surefire-plugin:test (default-test): maven-settings/target/surefire-reports/*.xml
Recording test results
None of the test reports contained any result
[withMaven] junitPublisher - Archive test results for Maven artifact org.apache.maven:maven-settings-builder:3.5.4-SNAPSHOT generated by maven-surefire-plugin:test (default-test): maven-settings-builder/target/surefire-reports/*.xml
Recording test results
[withMaven] junitPublisher - Archive test results for Maven artifact org.apache.maven:maven-repository-metadata:3.5.4-SNAPSHOT generated by maven-surefire-plugin:test (default-test): maven-repository-metadata/target/surefire-reports/*.xml
Recording test results
None of the test reports contained any result
[withMaven] junitPublisher - Archive test results for Maven artifact org.apache.maven:maven-resolver-provider:3.5.4-SNAPSHOT generated by maven-surefire-plugin:test (default-test): maven-resolver-provider/target/surefire-reports/*.xml
Recording test results
[withMaven] junitPublisher - Archive test results for Maven artifact org.apache.maven:maven-core:3.5.4-SNAPSHOT generated by maven-surefire-plugin:test (default-test): maven-core/target/surefire-reports/*.xml
Recording test results
[withMaven] junitPublisher - Archive test results for Maven artifact org.apache.maven:maven-slf4j-provider:3.5.4-SNAPSHOT generated by maven-surefire-plugin:test (default-test): maven-slf4j-provider/target/surefire-reports/*.xml
Recording test results
None of the test reports contained any result
[withMaven] junitPublisher - Archive test results for Maven artifact org.apache.maven:maven-embedder:3.5.4-SNAPSHOT generated by maven-surefire-plugin:test (default-test): maven-embedder/target/surefire-reports/*.xml
Recording test results
[withMaven] junitPublisher - Archive test results for Maven artifact org.apache.maven:maven-compat:3.5.4-SNAPSHOT generated by maven-surefire-plugin:test (default-test): maven-compat/target/surefire-reports/*.xml
Recording test results
[withMaven] openTasksPublisher - Scan Tasks for Maven artifact org.apache.maven:maven-model:3.5.4-SNAPSHOT in source directory maven-model/src/main/java
[withMaven] openTasksPublisher - Scan Tasks for Maven artifact org.apache.maven:maven-artifact:3.5.4-SNAPSHOT in source directory maven-artifact/src/main/java
[withMaven] openTasksPublisher - Scan Tasks for Maven artifact org.apache.maven:maven-plugin-api:3.5.4-SNAPSHOT in source directory maven-plugin-api/src/main/java
[withMaven] openTasksPublisher - Scan Tasks for Maven artifact org.apache.maven:maven-builder-support:3.5.4-SNAPSHOT in source directory maven-builder-support/src/main/java
[withMaven] openTasksPublisher - Scan Tasks for Maven artifact org.apache.maven:maven-model-builder:3.5.4-SNAPSHOT in source directory maven-model-builder/src/main/java
[withMaven] openTasksPublisher - Scan Tasks for Maven artifact org.apache.maven:maven-settings:3.5.4-SNAPSHOT in source directory maven-settings/src/main/java
[withMaven] openTasksPublisher - Scan Tasks for Maven artifact org.apache.maven:maven-settings-builder:3.5.4-SNAPSHOT in source directory maven-settings-builder/src/main/java
[withMaven] openTasksPublisher - Scan Tasks for Maven artifact org.apache.maven:maven-resolver-provider:3.5.4-SNAPSHOT in source directory maven-resolver-provider/src/main/java
[withMaven] openTasksPublisher - Scan Tasks for Maven artifact org.apache.maven:maven-core:3.5.4-SNAPSHOT in source directory maven-core/src/main/java
[withMaven] openTasksPublisher - Scan Tasks for Maven artifact org.apache.maven:maven-slf4j-provider:3.5.4-SNAPSHOT in source directory maven-slf4j-provider/src/main/java
[withMaven] openTasksPublisher - Scan Tasks for Maven artifact org.apache.maven:maven-embedder:3.5.4-SNAPSHOT in source directory maven-embedder/src/main/java
[withMaven] openTasksPublisher - Scan Tasks for Maven artifact org.apache.maven:maven-compat:3.5.4-SNAPSHOT in source directory maven-compat/src/main/java
[TASKS] Scanning folder '/home/jenkins/jenkins-slave/workspace/maven-box_maven_MNG-6410-4QJMCDGJJDP6AQ4Z7SJP3XXDF4MPA6UCOW2CYOHJOQK2FUF3ANHQ/build' for files matching the pattern 'maven-model/src/main/java/**/*,maven-artifact/src/main/java/**/*,maven-plugin-api/src/main/java/**/*,maven-builder-support/src/main/java/**/*,maven-model-builder/src/main/java/**/*,maven-settings/src/main/java/**/*,maven-settings-builder/src/main/java/**/*,maven-resolver-provider/src/main/java/**/*,maven-core/src/main/java/**/*,maven-slf4j-provider/src/main/java/**/*,maven-embedder/src/main/java/**/*,maven-compat/src/main/java/**/*' - excludes: null
[TASKS] Found 700 files to scan for tasks
[TASKS] Found 164 open tasks.
Skipping warnings blame since pipelines do not have an SCM link.%n
[Pipeline] // withMaven
[Pipeline] }
[Pipeline] // stage
[Pipeline] }
[Pipeline] // dir
[Pipeline] }
[Pipeline] // node
[Pipeline] stage
[Pipeline] { (Notifications)
[Pipeline] echo
Build result: FAILURE
[Pipeline] jiraIssueSelector
[Pipeline] emailext
Build failed in Jenkins: Maven TLP » maven » MNG-6410 #2
Posted by Apache Jenkins Server <je...@builds.apache.org>.
See https://builds.apache.org/job/maven-box/job/maven/job/MNG-6410/2/
Changes:
* improved javadoc and method name
All tests passed
Build log:
[...truncated 480.10 KB...]
[INFO] ------------------------------------------------------------------------
[INFO] BUILD FAILURE
[INFO] ------------------------------------------------------------------------
[INFO] Total time: 02:07 min
[INFO] Finished at: 2018-05-19T01:23:44Z
[INFO] Final Memory: 73M/1694M
[INFO] ------------------------------------------------------------------------
[INFO] [jenkins-event-spy] Generated /home/jenkins/jenkins-slave/workspace/maven-box_maven_MNG-6410-4QJMCDGJJDP6AQ4Z7SJP3XXDF4MPA6UCOW2CYOHJOQK2FUF3ANHQ/build@tmp/withMaven22150af3/maven-spy-20180519-012136-5057229691363643119116.log
[ERROR] Failed to execute goal org.apache.maven.plugins:maven-remote-resources-plugin:1.5:process (process-resource-bundles) on project apache-maven: Error rendering velocity resource. Invocation of method 'getResourceAsFile' in class org.codehaus.plexus.resource.DefaultResourceManager threw exception org.codehaus.plexus.resource.loader.ResourceNotFoundException: Could not find resource 'https://www.apache.org/licenses/LICENSE-2.0.txt'. at remote-resources[line 38, column 26] -> [Help 1]
org.apache.maven.lifecycle.LifecycleExecutionException: Failed to execute goal org.apache.maven.plugins:maven-remote-resources-plugin:1.5:process (process-resource-bundles) on project apache-maven: Error rendering velocity resource.
at org.apache.maven.lifecycle.internal.MojoExecutor.execute (MojoExecutor.java:213)
at org.apache.maven.lifecycle.internal.MojoExecutor.execute (MojoExecutor.java:154)
at org.apache.maven.lifecycle.internal.MojoExecutor.execute (MojoExecutor.java:146)
at org.apache.maven.lifecycle.internal.LifecycleModuleBuilder.buildProject (LifecycleModuleBuilder.java:117)
at org.apache.maven.lifecycle.internal.LifecycleModuleBuilder.buildProject (LifecycleModuleBuilder.java:81)
at org.apache.maven.lifecycle.internal.builder.singlethreaded.SingleThreadedBuilder.build (SingleThreadedBuilder.java:51)
at org.apache.maven.lifecycle.internal.LifecycleStarter.execute (LifecycleStarter.java:128)
at org.apache.maven.DefaultMaven.doExecute (DefaultMaven.java:309)
at org.apache.maven.DefaultMaven.doExecute (DefaultMaven.java:194)
at org.apache.maven.DefaultMaven.execute (DefaultMaven.java:107)
at org.apache.maven.cli.MavenCli.execute (MavenCli.java:955)
at org.apache.maven.cli.MavenCli.doMain (MavenCli.java:290)
at org.apache.maven.cli.MavenCli.main (MavenCli.java:194)
at sun.reflect.NativeMethodAccessorImpl.invoke0 (Native Method)
at sun.reflect.NativeMethodAccessorImpl.invoke (NativeMethodAccessorImpl.java:57)
at sun.reflect.DelegatingMethodAccessorImpl.invoke (DelegatingMethodAccessorImpl.java:43)
at java.lang.reflect.Method.invoke (Method.java:606)
at org.codehaus.plexus.classworlds.launcher.Launcher.launchEnhanced (Launcher.java:289)
at org.codehaus.plexus.classworlds.launcher.Launcher.launch (Launcher.java:229)
at org.codehaus.plexus.classworlds.launcher.Launcher.mainWithExitCode (Launcher.java:415)
at org.codehaus.plexus.classworlds.launcher.Launcher.main (Launcher.java:356)
Caused by: org.apache.maven.plugin.MojoExecutionException: Error rendering velocity resource.
at org.apache.maven.plugin.resources.remote.ProcessRemoteResourcesMojo.processResourceBundles (ProcessRemoteResourcesMojo.java:1246)
at org.apache.maven.plugin.resources.remote.ProcessRemoteResourcesMojo.execute (ProcessRemoteResourcesMojo.java:520)
at org.apache.maven.plugin.DefaultBuildPluginManager.executeMojo (DefaultBuildPluginManager.java:134)
at org.apache.maven.lifecycle.internal.MojoExecutor.execute (MojoExecutor.java:208)
at org.apache.maven.lifecycle.internal.MojoExecutor.execute (MojoExecutor.java:154)
at org.apache.maven.lifecycle.internal.MojoExecutor.execute (MojoExecutor.java:146)
at org.apache.maven.lifecycle.internal.LifecycleModuleBuilder.buildProject (LifecycleModuleBuilder.java:117)
at org.apache.maven.lifecycle.internal.LifecycleModuleBuilder.buildProject (LifecycleModuleBuilder.java:81)
at org.apache.maven.lifecycle.internal.builder.singlethreaded.SingleThreadedBuilder.build (SingleThreadedBuilder.java:51)
at org.apache.maven.lifecycle.internal.LifecycleStarter.execute (LifecycleStarter.java:128)
at org.apache.maven.DefaultMaven.doExecute (DefaultMaven.java:309)
at org.apache.maven.DefaultMaven.doExecute (DefaultMaven.java:194)
at org.apache.maven.DefaultMaven.execute (DefaultMaven.java:107)
at org.apache.maven.cli.MavenCli.execute (MavenCli.java:955)
at org.apache.maven.cli.MavenCli.doMain (MavenCli.java:290)
at org.apache.maven.cli.MavenCli.main (MavenCli.java:194)
at sun.reflect.NativeMethodAccessorImpl.invoke0 (Native Method)
at sun.reflect.NativeMethodAccessorImpl.invoke (NativeMethodAccessorImpl.java:57)
at sun.reflect.DelegatingMethodAccessorImpl.invoke (DelegatingMethodAccessorImpl.java:43)
at java.lang.reflect.Method.invoke (Method.java:606)
at org.codehaus.plexus.classworlds.launcher.Launcher.launchEnhanced (Launcher.java:289)
at org.codehaus.plexus.classworlds.launcher.Launcher.launch (Launcher.java:229)
at org.codehaus.plexus.classworlds.launcher.Launcher.mainWithExitCode (Launcher.java:415)
at org.codehaus.plexus.classworlds.launcher.Launcher.main (Launcher.java:356)
Caused by: org.apache.velocity.exception.MethodInvocationException: Invocation of method 'getResourceAsFile' in class org.codehaus.plexus.resource.DefaultResourceManager threw exception org.codehaus.plexus.resource.loader.ResourceNotFoundException: Could not find resource 'https://www.apache.org/licenses/LICENSE-2.0.txt'. at remote-resources[line 38, column 26]
at org.apache.velocity.runtime.parser.node.ASTMethod.handleInvocationException (ASTMethod.java:243)
at org.apache.velocity.runtime.parser.node.ASTMethod.execute (ASTMethod.java:187)
at org.apache.velocity.runtime.parser.node.ASTReference.execute (ASTReference.java:280)
at org.apache.velocity.runtime.parser.node.ASTReference.value (ASTReference.java:567)
at org.apache.velocity.runtime.parser.node.ASTExpression.value (ASTExpression.java:71)
at org.apache.velocity.runtime.parser.node.ASTSetDirective.render (ASTSetDirective.java:142)
at org.apache.velocity.runtime.parser.node.ASTBlock.render (ASTBlock.java:72)
at org.apache.velocity.runtime.parser.node.ASTIfStatement.render (ASTIfStatement.java:87)
at org.apache.velocity.runtime.parser.node.ASTBlock.render (ASTBlock.java:72)
at org.apache.velocity.runtime.parser.node.ASTIfStatement.render (ASTIfStatement.java:87)
at org.apache.velocity.runtime.parser.node.ASTBlock.render (ASTBlock.java:72)
at org.apache.velocity.runtime.directive.Foreach.render (Foreach.java:420)
at org.apache.velocity.runtime.parser.node.ASTDirective.render (ASTDirective.java:207)
at org.apache.velocity.runtime.parser.node.ASTBlock.render (ASTBlock.java:72)
at org.apache.velocity.runtime.directive.Foreach.render (Foreach.java:420)
at org.apache.velocity.runtime.parser.node.ASTDirective.render (ASTDirective.java:207)
at org.apache.velocity.runtime.parser.node.SimpleNode.render (SimpleNode.java:342)
at org.apache.velocity.runtime.RuntimeInstance.render (RuntimeInstance.java:1378)
at org.apache.velocity.runtime.RuntimeInstance.evaluate (RuntimeInstance.java:1314)
at org.apache.velocity.app.Velocity.evaluate (Velocity.java:254)
at org.apache.maven.plugin.resources.remote.ProcessRemoteResourcesMojo.processResourceBundles (ProcessRemoteResourcesMojo.java:1218)
at org.apache.maven.plugin.resources.remote.ProcessRemoteResourcesMojo.execute (ProcessRemoteResourcesMojo.java:520)
at org.apache.maven.plugin.DefaultBuildPluginManager.executeMojo (DefaultBuildPluginManager.java:134)
at org.apache.maven.lifecycle.internal.MojoExecutor.execute (MojoExecutor.java:208)
at org.apache.maven.lifecycle.internal.MojoExecutor.execute (MojoExecutor.java:154)
at org.apache.maven.lifecycle.internal.MojoExecutor.execute (MojoExecutor.java:146)
at org.apache.maven.lifecycle.internal.LifecycleModuleBuilder.buildProject (LifecycleModuleBuilder.java:117)
at org.apache.maven.lifecycle.internal.LifecycleModuleBuilder.buildProject (LifecycleModuleBuilder.java:81)
at org.apache.maven.lifecycle.internal.builder.singlethreaded.SingleThreadedBuilder.build (SingleThreadedBuilder.java:51)
at org.apache.maven.lifecycle.internal.LifecycleStarter.execute (LifecycleStarter.java:128)
at org.apache.maven.DefaultMaven.doExecute (DefaultMaven.java:309)
at org.apache.maven.DefaultMaven.doExecute (DefaultMaven.java:194)
at org.apache.maven.DefaultMaven.execute (DefaultMaven.java:107)
at org.apache.maven.cli.MavenCli.execute (MavenCli.java:955)
at org.apache.maven.cli.MavenCli.doMain (MavenCli.java:290)
at org.apache.maven.cli.MavenCli.main (MavenCli.java:194)
at sun.reflect.NativeMethodAccessorImpl.invoke0 (Native Method)
at sun.reflect.NativeMethodAccessorImpl.invoke (NativeMethodAccessorImpl.java:57)
at sun.reflect.DelegatingMethodAccessorImpl.invoke (DelegatingMethodAccessorImpl.java:43)
at java.lang.reflect.Method.invoke (Method.java:606)
at org.codehaus.plexus.classworlds.launcher.Launcher.launchEnhanced (Launcher.java:289)
at org.codehaus.plexus.classworlds.launcher.Launcher.launch (Launcher.java:229)
at org.codehaus.plexus.classworlds.launcher.Launcher.mainWithExitCode (Launcher.java:415)
at org.codehaus.plexus.classworlds.launcher.Launcher.main (Launcher.java:356)
Caused by: org.codehaus.plexus.resource.loader.ResourceNotFoundException: Could not find resource 'https://www.apache.org/licenses/LICENSE-2.0.txt'.
at org.codehaus.plexus.resource.DefaultResourceManager.getResource (DefaultResourceManager.java:173)
at org.codehaus.plexus.resource.DefaultResourceManager.getResourceAsFile (DefaultResourceManager.java:91)
at sun.reflect.NativeMethodAccessorImpl.invoke0 (Native Method)
at sun.reflect.NativeMethodAccessorImpl.invoke (NativeMethodAccessorImpl.java:57)
at sun.reflect.DelegatingMethodAccessorImpl.invoke (DelegatingMethodAccessorImpl.java:43)
at java.lang.reflect.Method.invoke (Method.java:606)
at org.apache.velocity.util.introspection.UberspectImpl$VelMethodImpl.doInvoke (UberspectImpl.java:395)
at org.apache.velocity.util.introspection.UberspectImpl$VelMethodImpl.invoke (UberspectImpl.java:384)
at org.apache.velocity.runtime.parser.node.ASTMethod.execute (ASTMethod.java:173)
at org.apache.velocity.runtime.parser.node.ASTReference.execute (ASTReference.java:280)
at org.apache.velocity.runtime.parser.node.ASTReference.value (ASTReference.java:567)
at org.apache.velocity.runtime.parser.node.ASTExpression.value (ASTExpression.java:71)
at org.apache.velocity.runtime.parser.node.ASTSetDirective.render (ASTSetDirective.java:142)
at org.apache.velocity.runtime.parser.node.ASTBlock.render (ASTBlock.java:72)
at org.apache.velocity.runtime.parser.node.ASTIfStatement.render (ASTIfStatement.java:87)
at org.apache.velocity.runtime.parser.node.ASTBlock.render (ASTBlock.java:72)
at org.apache.velocity.runtime.parser.node.ASTIfStatement.render (ASTIfStatement.java:87)
at org.apache.velocity.runtime.parser.node.ASTBlock.render (ASTBlock.java:72)
at org.apache.velocity.runtime.directive.Foreach.render (Foreach.java:420)
at org.apache.velocity.runtime.parser.node.ASTDirective.render (ASTDirective.java:207)
at org.apache.velocity.runtime.parser.node.ASTBlock.render (ASTBlock.java:72)
at org.apache.velocity.runtime.directive.Foreach.render (Foreach.java:420)
at org.apache.velocity.runtime.parser.node.ASTDirective.render (ASTDirective.java:207)
at org.apache.velocity.runtime.parser.node.SimpleNode.render (SimpleNode.java:342)
at org.apache.velocity.runtime.RuntimeInstance.render (RuntimeInstance.java:1378)
at org.apache.velocity.runtime.RuntimeInstance.evaluate (RuntimeInstance.java:1314)
at org.apache.velocity.app.Velocity.evaluate (Velocity.java:254)
at org.apache.maven.plugin.resources.remote.ProcessRemoteResourcesMojo.processResourceBundles (ProcessRemoteResourcesMojo.java:1218)
at org.apache.maven.plugin.resources.remote.ProcessRemoteResourcesMojo.execute (ProcessRemoteResourcesMojo.java:520)
at org.apache.maven.plugin.DefaultBuildPluginManager.executeMojo (DefaultBuildPluginManager.java:134)
at org.apache.maven.lifecycle.internal.MojoExecutor.execute (MojoExecutor.java:208)
at org.apache.maven.lifecycle.internal.MojoExecutor.execute (MojoExecutor.java:154)
at org.apache.maven.lifecycle.internal.MojoExecutor.execute (MojoExecutor.java:146)
at org.apache.maven.lifecycle.internal.LifecycleModuleBuilder.buildProject (LifecycleModuleBuilder.java:117)
at org.apache.maven.lifecycle.internal.LifecycleModuleBuilder.buildProject (LifecycleModuleBuilder.java:81)
at org.apache.maven.lifecycle.internal.builder.singlethreaded.SingleThreadedBuilder.build (SingleThreadedBuilder.java:51)
at org.apache.maven.lifecycle.internal.LifecycleStarter.execute (LifecycleStarter.java:128)
at org.apache.maven.DefaultMaven.doExecute (DefaultMaven.java:309)
at org.apache.maven.DefaultMaven.doExecute (DefaultMaven.java:194)
at org.apache.maven.DefaultMaven.execute (DefaultMaven.java:107)
at org.apache.maven.cli.MavenCli.execute (MavenCli.java:955)
at org.apache.maven.cli.MavenCli.doMain (MavenCli.java:290)
at org.apache.maven.cli.MavenCli.main (MavenCli.java:194)
at sun.reflect.NativeMethodAccessorImpl.invoke0 (Native Method)
at sun.reflect.NativeMethodAccessorImpl.invoke (NativeMethodAccessorImpl.java:57)
at sun.reflect.DelegatingMethodAccessorImpl.invoke (DelegatingMethodAccessorImpl.java:43)
at java.lang.reflect.Method.invoke (Method.java:606)
at org.codehaus.plexus.classworlds.launcher.Launcher.launchEnhanced (Launcher.java:289)
at org.codehaus.plexus.classworlds.launcher.Launcher.launch (Launcher.java:229)
at org.codehaus.plexus.classworlds.launcher.Launcher.mainWithExitCode (Launcher.java:415)
at org.codehaus.plexus.classworlds.launcher.Launcher.main (Launcher.java:356)
[ERROR]
[ERROR] Re-run Maven using the -X switch to enable full debug logging.
[ERROR]
[ERROR] For more information about the errors and possible solutions, please read the following articles:
[ERROR] [Help 1] http://cwiki.apache.org/confluence/display/MAVEN/MojoExecutionException
[ERROR]
[ERROR] After correcting the problems, you can resume the build with the command
[ERROR] mvn <goals> -rf :apache-maven
[Pipeline] }
[withMaven] artifactsPublisher - Archive artifact pom.xml under org/apache/maven/maven/3.5.4-SNAPSHOT/maven-3.5.4-SNAPSHOT.pom
[withMaven] artifactsPublisher - Archive artifact maven-model/pom.xml under org/apache/maven/maven-model/3.5.4-SNAPSHOT/maven-model-3.5.4-SNAPSHOT.pom
[withMaven] artifactsPublisher - Archive artifact maven-model/target/maven-model-3.5.4-SNAPSHOT.jar under org/apache/maven/maven-model/3.5.4-SNAPSHOT/maven-model-3.5.4-SNAPSHOT.jar
[withMaven] artifactsPublisher - Archive artifact maven-artifact/pom.xml under org/apache/maven/maven-artifact/3.5.4-SNAPSHOT/maven-artifact-3.5.4-SNAPSHOT.pom
[withMaven] artifactsPublisher - Archive artifact maven-artifact/target/maven-artifact-3.5.4-SNAPSHOT.jar under org/apache/maven/maven-artifact/3.5.4-SNAPSHOT/maven-artifact-3.5.4-SNAPSHOT.jar
[withMaven] artifactsPublisher - Archive artifact maven-plugin-api/pom.xml under org/apache/maven/maven-plugin-api/3.5.4-SNAPSHOT/maven-plugin-api-3.5.4-SNAPSHOT.pom
[withMaven] artifactsPublisher - Archive artifact maven-plugin-api/target/maven-plugin-api-3.5.4-SNAPSHOT.jar under org/apache/maven/maven-plugin-api/3.5.4-SNAPSHOT/maven-plugin-api-3.5.4-SNAPSHOT.jar
[withMaven] artifactsPublisher - Archive artifact maven-builder-support/pom.xml under org/apache/maven/maven-builder-support/3.5.4-SNAPSHOT/maven-builder-support-3.5.4-SNAPSHOT.pom
[withMaven] artifactsPublisher - Archive artifact maven-builder-support/target/maven-builder-support-3.5.4-SNAPSHOT.jar under org/apache/maven/maven-builder-support/3.5.4-SNAPSHOT/maven-builder-support-3.5.4-SNAPSHOT.jar
[withMaven] artifactsPublisher - Archive artifact maven-model-builder/pom.xml under org/apache/maven/maven-model-builder/3.5.4-SNAPSHOT/maven-model-builder-3.5.4-SNAPSHOT.pom
[withMaven] artifactsPublisher - Archive artifact maven-model-builder/target/maven-model-builder-3.5.4-SNAPSHOT.jar under org/apache/maven/maven-model-builder/3.5.4-SNAPSHOT/maven-model-builder-3.5.4-SNAPSHOT.jar
[withMaven] artifactsPublisher - Archive artifact maven-settings/pom.xml under org/apache/maven/maven-settings/3.5.4-SNAPSHOT/maven-settings-3.5.4-SNAPSHOT.pom
[withMaven] artifactsPublisher - Archive artifact maven-settings/target/maven-settings-3.5.4-SNAPSHOT.jar under org/apache/maven/maven-settings/3.5.4-SNAPSHOT/maven-settings-3.5.4-SNAPSHOT.jar
[withMaven] artifactsPublisher - Archive artifact maven-settings-builder/pom.xml under org/apache/maven/maven-settings-builder/3.5.4-SNAPSHOT/maven-settings-builder-3.5.4-SNAPSHOT.pom
[withMaven] artifactsPublisher - Archive artifact maven-settings-builder/target/maven-settings-builder-3.5.4-SNAPSHOT.jar under org/apache/maven/maven-settings-builder/3.5.4-SNAPSHOT/maven-settings-builder-3.5.4-SNAPSHOT.jar
[withMaven] artifactsPublisher - Archive artifact maven-repository-metadata/pom.xml under org/apache/maven/maven-repository-metadata/3.5.4-SNAPSHOT/maven-repository-metadata-3.5.4-SNAPSHOT.pom
[withMaven] artifactsPublisher - Archive artifact maven-repository-metadata/target/maven-repository-metadata-3.5.4-SNAPSHOT.jar under org/apache/maven/maven-repository-metadata/3.5.4-SNAPSHOT/maven-repository-metadata-3.5.4-SNAPSHOT.jar
[withMaven] artifactsPublisher - Archive artifact maven-resolver-provider/pom.xml under org/apache/maven/maven-resolver-provider/3.5.4-SNAPSHOT/maven-resolver-provider-3.5.4-SNAPSHOT.pom
[withMaven] artifactsPublisher - Archive artifact maven-resolver-provider/target/maven-resolver-provider-3.5.4-SNAPSHOT.jar under org/apache/maven/maven-resolver-provider/3.5.4-SNAPSHOT/maven-resolver-provider-3.5.4-SNAPSHOT.jar
[withMaven] artifactsPublisher - Archive artifact maven-core/pom.xml under org/apache/maven/maven-core/3.5.4-SNAPSHOT/maven-core-3.5.4-SNAPSHOT.pom
[withMaven] artifactsPublisher - Archive artifact maven-core/target/maven-core-3.5.4-SNAPSHOT.jar under org/apache/maven/maven-core/3.5.4-SNAPSHOT/maven-core-3.5.4-SNAPSHOT.jar
[withMaven] artifactsPublisher - Archive artifact maven-slf4j-provider/pom.xml under org/apache/maven/maven-slf4j-provider/3.5.4-SNAPSHOT/maven-slf4j-provider-3.5.4-SNAPSHOT.pom
[withMaven] artifactsPublisher - Archive artifact maven-slf4j-provider/target/maven-slf4j-provider-3.5.4-SNAPSHOT.jar under org/apache/maven/maven-slf4j-provider/3.5.4-SNAPSHOT/maven-slf4j-provider-3.5.4-SNAPSHOT.jar
[withMaven] artifactsPublisher - Archive artifact maven-embedder/pom.xml under org/apache/maven/maven-embedder/3.5.4-SNAPSHOT/maven-embedder-3.5.4-SNAPSHOT.pom
[withMaven] artifactsPublisher - Archive artifact maven-embedder/target/maven-embedder-3.5.4-SNAPSHOT.jar under org/apache/maven/maven-embedder/3.5.4-SNAPSHOT/maven-embedder-3.5.4-SNAPSHOT.jar
[withMaven] artifactsPublisher - Archive artifact maven-compat/pom.xml under org/apache/maven/maven-compat/3.5.4-SNAPSHOT/maven-compat-3.5.4-SNAPSHOT.pom
[withMaven] artifactsPublisher - Archive artifact maven-compat/target/maven-compat-3.5.4-SNAPSHOT.jar under org/apache/maven/maven-compat/3.5.4-SNAPSHOT/maven-compat-3.5.4-SNAPSHOT.jar
[withMaven] artifactsPublisher - Archive artifact target/maven-3.5.4-SNAPSHOT-site.xml under org/apache/maven/maven/3.5.4-SNAPSHOT/maven-3.5.4-SNAPSHOT-site.xml
[Fast Archiver] No prior successful build to compare, so performing full copy of artifacts
[withMaven] junitPublisher - Archive test results for Maven artifact org.apache.maven:maven-model:3.5.4-SNAPSHOT generated by maven-surefire-plugin:test (default-test): maven-model/target/surefire-reports/*.xml
Recording test results
[withMaven] junitPublisher - Archive test results for Maven artifact org.apache.maven:maven-artifact:3.5.4-SNAPSHOT generated by maven-surefire-plugin:test (default-test): maven-artifact/target/surefire-reports/*.xml
Recording test results
[withMaven] junitPublisher - Archive test results for Maven artifact org.apache.maven:maven-plugin-api:3.5.4-SNAPSHOT generated by maven-surefire-plugin:test (default-test): maven-plugin-api/target/surefire-reports/*.xml
Recording test results
[withMaven] junitPublisher - Archive test results for Maven artifact org.apache.maven:maven-builder-support:3.5.4-SNAPSHOT generated by maven-surefire-plugin:test (default-test): maven-builder-support/target/surefire-reports/*.xml
Recording test results
[withMaven] junitPublisher - Archive test results for Maven artifact org.apache.maven:maven-model-builder:3.5.4-SNAPSHOT generated by maven-surefire-plugin:test (default-test): maven-model-builder/target/surefire-reports/*.xml
Recording test results
[withMaven] junitPublisher - Archive test results for Maven artifact org.apache.maven:maven-settings:3.5.4-SNAPSHOT generated by maven-surefire-plugin:test (default-test): maven-settings/target/surefire-reports/*.xml
Recording test results
None of the test reports contained any result
[withMaven] junitPublisher - Archive test results for Maven artifact org.apache.maven:maven-settings-builder:3.5.4-SNAPSHOT generated by maven-surefire-plugin:test (default-test): maven-settings-builder/target/surefire-reports/*.xml
Recording test results
[withMaven] junitPublisher - Archive test results for Maven artifact org.apache.maven:maven-repository-metadata:3.5.4-SNAPSHOT generated by maven-surefire-plugin:test (default-test): maven-repository-metadata/target/surefire-reports/*.xml
Recording test results
None of the test reports contained any result
[withMaven] junitPublisher - Archive test results for Maven artifact org.apache.maven:maven-resolver-provider:3.5.4-SNAPSHOT generated by maven-surefire-plugin:test (default-test): maven-resolver-provider/target/surefire-reports/*.xml
Recording test results
[withMaven] junitPublisher - Archive test results for Maven artifact org.apache.maven:maven-core:3.5.4-SNAPSHOT generated by maven-surefire-plugin:test (default-test): maven-core/target/surefire-reports/*.xml
Recording test results
[withMaven] junitPublisher - Archive test results for Maven artifact org.apache.maven:maven-slf4j-provider:3.5.4-SNAPSHOT generated by maven-surefire-plugin:test (default-test): maven-slf4j-provider/target/surefire-reports/*.xml
Recording test results
None of the test reports contained any result
[withMaven] junitPublisher - Archive test results for Maven artifact org.apache.maven:maven-embedder:3.5.4-SNAPSHOT generated by maven-surefire-plugin:test (default-test): maven-embedder/target/surefire-reports/*.xml
Recording test results
[withMaven] junitPublisher - Archive test results for Maven artifact org.apache.maven:maven-compat:3.5.4-SNAPSHOT generated by maven-surefire-plugin:test (default-test): maven-compat/target/surefire-reports/*.xml
Recording test results
[withMaven] openTasksPublisher - Scan Tasks for Maven artifact org.apache.maven:maven-model:3.5.4-SNAPSHOT in source directory maven-model/src/main/java
[withMaven] openTasksPublisher - Scan Tasks for Maven artifact org.apache.maven:maven-artifact:3.5.4-SNAPSHOT in source directory maven-artifact/src/main/java
[withMaven] openTasksPublisher - Scan Tasks for Maven artifact org.apache.maven:maven-plugin-api:3.5.4-SNAPSHOT in source directory maven-plugin-api/src/main/java
[withMaven] openTasksPublisher - Scan Tasks for Maven artifact org.apache.maven:maven-builder-support:3.5.4-SNAPSHOT in source directory maven-builder-support/src/main/java
[withMaven] openTasksPublisher - Scan Tasks for Maven artifact org.apache.maven:maven-model-builder:3.5.4-SNAPSHOT in source directory maven-model-builder/src/main/java
[withMaven] openTasksPublisher - Scan Tasks for Maven artifact org.apache.maven:maven-settings:3.5.4-SNAPSHOT in source directory maven-settings/src/main/java
[withMaven] openTasksPublisher - Scan Tasks for Maven artifact org.apache.maven:maven-settings-builder:3.5.4-SNAPSHOT in source directory maven-settings-builder/src/main/java
[withMaven] openTasksPublisher - Scan Tasks for Maven artifact org.apache.maven:maven-resolver-provider:3.5.4-SNAPSHOT in source directory maven-resolver-provider/src/main/java
[withMaven] openTasksPublisher - Scan Tasks for Maven artifact org.apache.maven:maven-core:3.5.4-SNAPSHOT in source directory maven-core/src/main/java
[withMaven] openTasksPublisher - Scan Tasks for Maven artifact org.apache.maven:maven-slf4j-provider:3.5.4-SNAPSHOT in source directory maven-slf4j-provider/src/main/java
[withMaven] openTasksPublisher - Scan Tasks for Maven artifact org.apache.maven:maven-embedder:3.5.4-SNAPSHOT in source directory maven-embedder/src/main/java
[withMaven] openTasksPublisher - Scan Tasks for Maven artifact org.apache.maven:maven-compat:3.5.4-SNAPSHOT in source directory maven-compat/src/main/java
[TASKS] Scanning folder '/home/jenkins/jenkins-slave/workspace/maven-box_maven_MNG-6410-4QJMCDGJJDP6AQ4Z7SJP3XXDF4MPA6UCOW2CYOHJOQK2FUF3ANHQ/build' for files matching the pattern 'maven-model/src/main/java/**/*,maven-artifact/src/main/java/**/*,maven-plugin-api/src/main/java/**/*,maven-builder-support/src/main/java/**/*,maven-model-builder/src/main/java/**/*,maven-settings/src/main/java/**/*,maven-settings-builder/src/main/java/**/*,maven-resolver-provider/src/main/java/**/*,maven-core/src/main/java/**/*,maven-slf4j-provider/src/main/java/**/*,maven-embedder/src/main/java/**/*,maven-compat/src/main/java/**/*' - excludes: null
[TASKS] Found 700 files to scan for tasks
[TASKS] Found 164 open tasks.
Skipping warnings blame since pipelines do not have an SCM link.%n
[Pipeline] // withMaven
[Pipeline] }
[Pipeline] // stage
[Pipeline] }
[Pipeline] // dir
[Pipeline] }
[Pipeline] // node
[Pipeline] stage
[Pipeline] { (Notifications)
[Pipeline] echo
Build result: FAILURE
[Pipeline] jiraIssueSelector
[Pipeline] emailext