You are viewing a plain text version of this content. The canonical link for it is here.
Posted to dev@kafka.apache.org by Apache Jenkins Server <je...@builds.apache.org> on 2016/03/03 02:43:59 UTC
Build failed in Jenkins: kafka-trunk-jdk7 #1082
See <https://builds.apache.org/job/kafka-trunk-jdk7/1082/changes>
Changes:
[wangguoz] MINOR: Improve JavaDoc for some public classes.
------------------------------------------
[...truncated 1481 lines...]
kafka.api.PlaintextConsumerTest > testInterceptorsWithWrongKeyValue PASSED
kafka.api.PlaintextConsumerTest > testMultiConsumerRoundRobinAssignment PASSED
kafka.api.PlaintextConsumerTest > testPartitionPauseAndResume PASSED
kafka.api.PlaintextConsumerTest > testConsumeMessagesWithLogAppendTime PASSED
kafka.api.PlaintextConsumerTest > testAutoCommitOnCloseAfterWakeup PASSED
kafka.api.PlaintextConsumerTest > testMaxPollRecords PASSED
kafka.api.PlaintextConsumerTest > testAutoOffsetReset PASSED
kafka.api.PlaintextConsumerTest > testFetchInvalidOffset PASSED
kafka.api.PlaintextConsumerTest > testAutoCommitIntercept PASSED
kafka.api.PlaintextConsumerTest > testCommitMetadata PASSED
kafka.api.PlaintextConsumerTest > testRoundRobinAssignment PASSED
kafka.api.PlaintextConsumerTest > testPatternSubscription PASSED
kafka.api.PlaintextConsumerTest > testPauseStateNotPreservedByRebalance PASSED
kafka.api.PlaintextConsumerTest > testUnsubscribeTopic PASSED
kafka.api.PlaintextConsumerTest > testListTopics PASSED
kafka.api.PlaintextConsumerTest > testAutoCommitOnRebalance PASSED
kafka.api.PlaintextConsumerTest > testSimpleConsumption PASSED
kafka.api.PlaintextConsumerTest > testPartitionReassignmentCallback PASSED
kafka.api.PlaintextConsumerTest > testCommitSpecifiedOffsets PASSED
kafka.api.ProducerBounceTest > testBrokerFailure PASSED
kafka.api.ProducerFailureHandlingTest > testCannotSendToInternalTopic PASSED
kafka.api.ProducerFailureHandlingTest > testTooLargeRecordWithAckOne PASSED
kafka.api.ProducerFailureHandlingTest > testWrongBrokerList PASSED
kafka.api.ProducerFailureHandlingTest > testNotEnoughReplicas PASSED
kafka.api.ProducerFailureHandlingTest > testNonExistentTopic PASSED
kafka.api.ProducerFailureHandlingTest > testInvalidPartition PASSED
kafka.api.ProducerFailureHandlingTest > testSendAfterClosed PASSED
kafka.api.ProducerFailureHandlingTest > testTooLargeRecordWithAckZero PASSED
kafka.api.ProducerFailureHandlingTest > testNotEnoughReplicasAfterBrokerShutdown PASSED
kafka.api.SaslPlaintextConsumerTest > testPauseStateNotPreservedByRebalance PASSED
kafka.api.SaslPlaintextConsumerTest > testUnsubscribeTopic PASSED
kafka.api.SaslPlaintextConsumerTest > testListTopics PASSED
kafka.api.SaslPlaintextConsumerTest > testAutoCommitOnRebalance PASSED
kafka.api.SaslPlaintextConsumerTest > testSimpleConsumption PASSED
kafka.api.SaslPlaintextConsumerTest > testPartitionReassignmentCallback PASSED
kafka.api.SaslPlaintextConsumerTest > testCommitSpecifiedOffsets PASSED
kafka.api.SslConsumerTest > testPauseStateNotPreservedByRebalance PASSED
kafka.api.SslConsumerTest > testUnsubscribeTopic PASSED
kafka.api.SslConsumerTest > testListTopics PASSED
kafka.api.SslConsumerTest > testAutoCommitOnRebalance PASSED
kafka.api.SslConsumerTest > testSimpleConsumption PASSED
kafka.api.SslConsumerTest > testPartitionReassignmentCallback PASSED
kafka.api.SslConsumerTest > testCommitSpecifiedOffsets PASSED
kafka.api.ConsumerBounceTest > testSeekAndCommitWithBrokerFailures PASSED
ERROR: Could not install GRADLE_2_4_RC_2_HOME
java.lang.NullPointerException
at hudson.plugins.toolenv.ToolEnvBuildWrapper$1.buildEnvVars(ToolEnvBuildWrapper.java:46)
at hudson.model.AbstractBuild.getEnvironment(AbstractBuild.java:947)
at hudson.plugins.git.GitSCM.getParamExpandedRepos(GitSCM.java:390)
at hudson.plugins.git.GitSCM.compareRemoteRevisionWithImpl(GitSCM.java:577)
at hudson.plugins.git.GitSCM.compareRemoteRevisionWith(GitSCM.java:527)
at hudson.scm.SCM.compareRemoteRevisionWith(SCM.java:381)
at hudson.scm.SCM.poll(SCM.java:398)
at hudson.model.AbstractProject._poll(AbstractProject.java:1453)
at hudson.model.AbstractProject.poll(AbstractProject.java:1356)
at hudson.triggers.SCMTrigger$Runner.runPolling(SCMTrigger.java:526)
at hudson.triggers.SCMTrigger$Runner.run(SCMTrigger.java:555)
at hudson.util.SequentialExecutionQueue$QueueEntry.run(SequentialExecutionQueue.java:119)
at java.util.concurrent.Executors$RunnableAdapter.call(Executors.java:471)
at java.util.concurrent.FutureTask.run(FutureTask.java:262)
at java.util.concurrent.ThreadPoolExecutor.runWorker(ThreadPoolExecutor.java:1145)
at java.util.concurrent.ThreadPoolExecutor$Worker.run(ThreadPoolExecutor.java:615)
at java.lang.Thread.run(Thread.java:745)
ERROR: Could not install JDK_1_7U51_HOME
java.lang.NullPointerException
at hudson.plugins.toolenv.ToolEnvBuildWrapper$1.buildEnvVars(ToolEnvBuildWrapper.java:46)
at hudson.model.AbstractBuild.getEnvironment(AbstractBuild.java:947)
at hudson.plugins.git.GitSCM.getParamExpandedRepos(GitSCM.java:390)
at hudson.plugins.git.GitSCM.compareRemoteRevisionWithImpl(GitSCM.java:577)
at hudson.plugins.git.GitSCM.compareRemoteRevisionWith(GitSCM.java:527)
at hudson.scm.SCM.compareRemoteRevisionWith(SCM.java:381)
at hudson.scm.SCM.poll(SCM.java:398)
at hudson.model.AbstractProject._poll(AbstractProject.java:1453)
at hudson.model.AbstractProject.poll(AbstractProject.java:1356)
at hudson.triggers.SCMTrigger$Runner.runPolling(SCMTrigger.java:526)
at hudson.triggers.SCMTrigger$Runner.run(SCMTrigger.java:555)
at hudson.util.SequentialExecutionQueue$QueueEntry.run(SequentialExecutionQueue.java:119)
at java.util.concurrent.Executors$RunnableAdapter.call(Executors.java:471)
at java.util.concurrent.FutureTask.run(FutureTask.java:262)
at java.util.concurrent.ThreadPoolExecutor.runWorker(ThreadPoolExecutor.java:1145)
at java.util.concurrent.ThreadPoolExecutor$Worker.run(ThreadPoolExecutor.java:615)
at java.lang.Thread.run(Thread.java:745)
kafka.api.ConsumerBounceTest > testConsumptionWithBrokerFailures PASSED
kafka.api.AuthorizerIntegrationTest > testCommitWithTopicWrite PASSED
kafka.api.AuthorizerIntegrationTest > testConsumeWithNoTopicAccess PASSED
kafka.api.AuthorizerIntegrationTest > testCreatePermissionNeededToReadFromNonExistentTopic PASSED
kafka.api.AuthorizerIntegrationTest > testOffsetFetchWithNoAccess PASSED
kafka.api.AuthorizerIntegrationTest > testListOfsetsWithTopicDescribe PASSED
kafka.api.AuthorizerIntegrationTest > testProduceWithTopicRead PASSED
kafka.api.AuthorizerIntegrationTest > testListOffsetsWithNoTopicAccess PASSED
kafka.api.AuthorizerIntegrationTest > testCreatePermissionNeededForWritingToNonExistentTopic PASSED
kafka.api.AuthorizerIntegrationTest > testConsumeWithNoGroupAccess PASSED
kafka.api.AuthorizerIntegrationTest > testConsumeWithTopicDescribe PASSED
kafka.api.AuthorizerIntegrationTest > testOffsetFetchWithNoTopicAccess PASSED
kafka.api.AuthorizerIntegrationTest > testCommitWithNoTopicAccess PASSED
kafka.api.AuthorizerIntegrationTest > testProduceWithNoTopicAccess PASSED
kafka.api.AuthorizerIntegrationTest > testProduceWithTopicWrite PASSED
kafka.api.AuthorizerIntegrationTest > testAuthorization PASSED
kafka.api.AuthorizerIntegrationTest > testConsumeWithTopicAndGroupRead PASSED
kafka.api.AuthorizerIntegrationTest > testConsumeWithTopicWrite PASSED
kafka.api.AuthorizerIntegrationTest > testOffsetFetchWithNoGroupAccess PASSED
kafka.api.AuthorizerIntegrationTest > testCommitWithNoAccess PASSED
kafka.api.AuthorizerIntegrationTest > testCommitWithNoGroupAccess PASSED
kafka.api.AuthorizerIntegrationTest > testConsumeWithNoAccess PASSED
kafka.api.AuthorizerIntegrationTest > testOffsetFetchWithTopicAndGroupRead PASSED
kafka.api.AuthorizerIntegrationTest > testCommitWithTopicDescribe PASSED
kafka.api.AuthorizerIntegrationTest > testProduceWithTopicDescribe PASSED
kafka.api.AuthorizerIntegrationTest > testOffsetFetchTopicDescribe PASSED
kafka.api.AuthorizerIntegrationTest > testCommitWithTopicAndGroupRead PASSED
kafka.api.RequestResponseSerializationTest > testSerializationAndDeserialization PASSED
kafka.api.RequestResponseSerializationTest > testFetchResponseVersion PASSED
kafka.api.RequestResponseSerializationTest > testProduceResponseVersion PASSED
kafka.api.SaslSslConsumerTest > testPauseStateNotPreservedByRebalance PASSED
kafka.api.SaslSslConsumerTest > testUnsubscribeTopic PASSED
kafka.api.SaslSslConsumerTest > testListTopics PASSED
kafka.api.SaslSslConsumerTest > testAutoCommitOnRebalance PASSED
kafka.api.SaslSslConsumerTest > testSimpleConsumption PASSED
kafka.api.SaslSslConsumerTest > testPartitionReassignmentCallback PASSED
kafka.api.SaslSslConsumerTest > testCommitSpecifiedOffsets PASSED
kafka.api.test.ProducerCompressionTest > testCompression[0] PASSED
kafka.api.test.ProducerCompressionTest > testCompression[1] PASSED
kafka.api.test.ProducerCompressionTest > testCompression[2] PASSED
kafka.api.test.ProducerCompressionTest > testCompression[3] PASSED
kafka.controller.ControllerFailoverTest > testMetadataUpdate PASSED
kafka.tools.ConsoleProducerTest > testParseKeyProp PASSED
kafka.tools.ConsoleProducerTest > testValidConfigsOldProducer PASSED
kafka.tools.ConsoleProducerTest > testInvalidConfigs PASSED
kafka.tools.ConsoleProducerTest > testValidConfigsNewProducer PASSED
kafka.tools.ConsoleConsumerTest > shouldLimitReadsToMaxMessageLimit PASSED
kafka.tools.ConsoleConsumerTest > shouldParseValidNewConsumerValidConfig PASSED
kafka.tools.ConsoleConsumerTest > shouldParseConfigsFromFile PASSED
kafka.tools.ConsoleConsumerTest > shouldParseValidOldConsumerValidConfig PASSED
694 tests completed, 1 failed
:kafka-trunk-jdk7:core:test FAILED
:test_core_2_10 FAILED
FAILURE: Build failed with an exception.
* What went wrong:
Execution failed for task ':core:test'.
> There were failing tests. See the report at: file://<https://builds.apache.org/job/kafka-trunk-jdk7/ws/core/build/reports/tests/index.html>
* Try:
Run with --stacktrace option to get the stack trace. Run with --info or --debug option to get more log output.
BUILD FAILED
Total time: 1 hrs 5 mins 4.208 secs
Build step 'Execute shell' marked build as failure
Recording test results
Setting GRADLE_2_4_RC_2_HOME=/home/jenkins/jenkins-slave/tools/hudson.plugins.gradle.GradleInstallation/Gradle_2.4-rc-2
Setting JDK_1_7U51_HOME=/home/jenkins/jenkins-slave/tools/hudson.model.JDK/jdk-1.7u51
Setting GRADLE_2_4_RC_2_HOME=/home/jenkins/jenkins-slave/tools/hudson.plugins.gradle.GradleInstallation/Gradle_2.4-rc-2
Setting JDK_1_7U51_HOME=/home/jenkins/jenkins-slave/tools/hudson.model.JDK/jdk-1.7u51
Jenkins build is back to normal : kafka-trunk-jdk7 #1087
Posted by Apache Jenkins Server <je...@builds.apache.org>.
See <https://builds.apache.org/job/kafka-trunk-jdk7/1087/changes>
Build failed in Jenkins: kafka-trunk-jdk7 #1086
Posted by Apache Jenkins Server <je...@builds.apache.org>.
See <https://builds.apache.org/job/kafka-trunk-jdk7/1086/changes>
Changes:
[me] KAFKA-3324; NullPointerException in StreamPartitionAssignor
------------------------------------------
[...truncated 48 lines...]
Building project 'core' with Scala version 2.10.6
:kafka-trunk-jdk7:clients:compileJavaNote: <https://builds.apache.org/job/kafka-trunk-jdk7/ws/clients/src/main/java/org/apache/kafka/clients/producer/KafkaProducer.java> uses or overrides a deprecated API.
Note: Recompile with -Xlint:deprecation for details.
Note: Some input files use unchecked or unsafe operations.
Note: Recompile with -Xlint:unchecked for details.
:kafka-trunk-jdk7:clients:processResources UP-TO-DATE
:kafka-trunk-jdk7:clients:classes
:kafka-trunk-jdk7:clients:determineCommitId UP-TO-DATE
:kafka-trunk-jdk7:clients:createVersionFile
:kafka-trunk-jdk7:clients:jar
:kafka-trunk-jdk7:core:compileJava UP-TO-DATE
:kafka-trunk-jdk7:core:compileScala
<https://builds.apache.org/job/kafka-trunk-jdk7/ws/core/src/main/scala/kafka/api/OffsetCommitRequest.scala>:79: value DEFAULT_TIMESTAMP in object OffsetCommitRequest is deprecated: see corresponding Javadoc for more information.
org.apache.kafka.common.requests.OffsetCommitRequest.DEFAULT_TIMESTAMP
^
<https://builds.apache.org/job/kafka-trunk-jdk7/ws/core/src/main/scala/kafka/common/OffsetMetadataAndError.scala>:36: value DEFAULT_TIMESTAMP in object OffsetCommitRequest is deprecated: see corresponding Javadoc for more information.
commitTimestamp: Long = org.apache.kafka.common.requests.OffsetCommitRequest.DEFAULT_TIMESTAMP,
^
<https://builds.apache.org/job/kafka-trunk-jdk7/ws/core/src/main/scala/kafka/common/OffsetMetadataAndError.scala>:37: value DEFAULT_TIMESTAMP in object OffsetCommitRequest is deprecated: see corresponding Javadoc for more information.
expireTimestamp: Long = org.apache.kafka.common.requests.OffsetCommitRequest.DEFAULT_TIMESTAMP) {
^
<https://builds.apache.org/job/kafka-trunk-jdk7/ws/core/src/main/scala/kafka/coordinator/GroupMetadataManager.scala>:400: value DEFAULT_TIMESTAMP in object OffsetCommitRequest is deprecated: see corresponding Javadoc for more information.
if (value.expireTimestamp == org.apache.kafka.common.requests.OffsetCommitRequest.DEFAULT_TIMESTAMP)
^
<https://builds.apache.org/job/kafka-trunk-jdk7/ws/core/src/main/scala/kafka/server/KafkaApis.scala>:298: value DEFAULT_TIMESTAMP in object OffsetCommitRequest is deprecated: see corresponding Javadoc for more information.
if (offsetAndMetadata.commitTimestamp == org.apache.kafka.common.requests.OffsetCommitRequest.DEFAULT_TIMESTAMP)
^
<https://builds.apache.org/job/kafka-trunk-jdk7/ws/core/src/main/scala/kafka/server/KafkaServer.scala>:307: a pure expression does nothing in statement position; you may be omitting necessary parentheses
ControllerStats.uncleanLeaderElectionRate
^
<https://builds.apache.org/job/kafka-trunk-jdk7/ws/core/src/main/scala/kafka/server/KafkaServer.scala>:308: a pure expression does nothing in statement position; you may be omitting necessary parentheses
ControllerStats.leaderElectionTimer
^
<https://builds.apache.org/job/kafka-trunk-jdk7/ws/core/src/main/scala/kafka/controller/ControllerChannelManager.scala>:391: constructor UpdateMetadataRequest in class UpdateMetadataRequest is deprecated: see corresponding Javadoc for more information.
new UpdateMetadataRequest(controllerId, controllerEpoch, liveBrokers.asJava, partitionStates.asJava)
^
<https://builds.apache.org/job/kafka-trunk-jdk7/ws/core/src/main/scala/kafka/network/BlockingChannel.scala>:129: method readFromReadableChannel in class NetworkReceive is deprecated: see corresponding Javadoc for more information.
response.readFromReadableChannel(channel)
^
there were 15 feature warning(s); re-run with -feature for details
10 warnings found
:kafka-trunk-jdk7:core:processResources UP-TO-DATE
:kafka-trunk-jdk7:core:classes
:kafka-trunk-jdk7:clients:compileTestJavaNote: <https://builds.apache.org/job/kafka-trunk-jdk7/ws/clients/src/test/java/org/apache/kafka/common/requests/RequestResponseTest.java> uses or overrides a deprecated API.
Note: Recompile with -Xlint:deprecation for details.
:kafka-trunk-jdk7:clients:processTestResources
:kafka-trunk-jdk7:clients:testClasses
:kafka-trunk-jdk7:core:copyDependantLibs
:kafka-trunk-jdk7:core:copyDependantTestLibs
:kafka-trunk-jdk7:core:jar
:jar_core_2_11
Building project 'core' with Scala version 2.11.7
:kafka-trunk-jdk7:clients:compileJava UP-TO-DATE
:kafka-trunk-jdk7:clients:processResources UP-TO-DATE
:kafka-trunk-jdk7:clients:classes UP-TO-DATE
:kafka-trunk-jdk7:clients:determineCommitId UP-TO-DATE
:kafka-trunk-jdk7:clients:createVersionFile
:kafka-trunk-jdk7:clients:jar UP-TO-DATE
:kafka-trunk-jdk7:core:compileJava UP-TO-DATE
:kafka-trunk-jdk7:core:compileScala
<https://builds.apache.org/job/kafka-trunk-jdk7/ws/core/src/main/scala/kafka/api/OffsetCommitRequest.scala>:79: value DEFAULT_TIMESTAMP in object OffsetCommitRequest is deprecated: see corresponding Javadoc for more information.
org.apache.kafka.common.requests.OffsetCommitRequest.DEFAULT_TIMESTAMP
^
<https://builds.apache.org/job/kafka-trunk-jdk7/ws/core/src/main/scala/kafka/common/OffsetMetadataAndError.scala>:36: value DEFAULT_TIMESTAMP in object OffsetCommitRequest is deprecated: see corresponding Javadoc for more information.
commitTimestamp: Long = org.apache.kafka.common.requests.OffsetCommitRequest.DEFAULT_TIMESTAMP,
^
<https://builds.apache.org/job/kafka-trunk-jdk7/ws/core/src/main/scala/kafka/common/OffsetMetadataAndError.scala>:37: value DEFAULT_TIMESTAMP in object OffsetCommitRequest is deprecated: see corresponding Javadoc for more information.
expireTimestamp: Long = org.apache.kafka.common.requests.OffsetCommitRequest.DEFAULT_TIMESTAMP) {
^
<https://builds.apache.org/job/kafka-trunk-jdk7/ws/core/src/main/scala/kafka/coordinator/GroupMetadataManager.scala>:400: value DEFAULT_TIMESTAMP in object OffsetCommitRequest is deprecated: see corresponding Javadoc for more information.
if (value.expireTimestamp == org.apache.kafka.common.requests.OffsetCommitRequest.DEFAULT_TIMESTAMP)
^
<https://builds.apache.org/job/kafka-trunk-jdk7/ws/core/src/main/scala/kafka/server/KafkaApis.scala>:298: value DEFAULT_TIMESTAMP in object OffsetCommitRequest is deprecated: see corresponding Javadoc for more information.
if (offsetAndMetadata.commitTimestamp == org.apache.kafka.common.requests.OffsetCommitRequest.DEFAULT_TIMESTAMP)
^
<https://builds.apache.org/job/kafka-trunk-jdk7/ws/core/src/main/scala/kafka/server/KafkaServer.scala>:307: a pure expression does nothing in statement position; you may be omitting necessary parentheses
ControllerStats.uncleanLeaderElectionRate
^
<https://builds.apache.org/job/kafka-trunk-jdk7/ws/core/src/main/scala/kafka/server/KafkaServer.scala>:308: a pure expression does nothing in statement position; you may be omitting necessary parentheses
ControllerStats.leaderElectionTimer
^
<https://builds.apache.org/job/kafka-trunk-jdk7/ws/core/src/main/scala/kafka/admin/AclCommand.scala>:246: method readLine in class DeprecatedConsole is deprecated: Use the method in scala.io.StdIn
Console.readLine().equalsIgnoreCase("y")
^
<https://builds.apache.org/job/kafka-trunk-jdk7/ws/core/src/main/scala/kafka/admin/TopicCommand.scala>:371: method readLine in class DeprecatedConsole is deprecated: Use the method in scala.io.StdIn
if (!Console.readLine().equalsIgnoreCase("y")) {
^
<https://builds.apache.org/job/kafka-trunk-jdk7/ws/core/src/main/scala/kafka/controller/ControllerChannelManager.scala>:391: constructor UpdateMetadataRequest in class UpdateMetadataRequest is deprecated: see corresponding Javadoc for more information.
new UpdateMetadataRequest(controllerId, controllerEpoch, liveBrokers.asJava, partitionStates.asJava)
^
<https://builds.apache.org/job/kafka-trunk-jdk7/ws/core/src/main/scala/kafka/network/BlockingChannel.scala>:129: method readFromReadableChannel in class NetworkReceive is deprecated: see corresponding Javadoc for more information.
response.readFromReadableChannel(channel)
^
there were 15 feature warnings; re-run with -feature for details
12 warnings found
:kafka-trunk-jdk7:core:processResources UP-TO-DATE
:kafka-trunk-jdk7:core:classes
:kafka-trunk-jdk7:clients:compileTestJava UP-TO-DATE
:kafka-trunk-jdk7:clients:processTestResources UP-TO-DATE
:kafka-trunk-jdk7:clients:testClasses UP-TO-DATE
:kafka-trunk-jdk7:core:copyDependantLibs
:kafka-trunk-jdk7:core:copyDependantTestLibs
:kafka-trunk-jdk7:core:jar
:clients:compileJava UP-TO-DATE
:clients:processResources UP-TO-DATE
:clients:classes UP-TO-DATE
:clients:determineCommitId UP-TO-DATE
:clients:createVersionFile
:clients:jar UP-TO-DATE
:core:compileJava UP-TO-DATE
:core:compileScala
<https://builds.apache.org/job/kafka-trunk-jdk7/ws/core/src/main/scala/kafka/api/OffsetCommitRequest.scala>:79: value DEFAULT_TIMESTAMP in object OffsetCommitRequest is deprecated: see corresponding Javadoc for more information.
org.apache.kafka.common.requests.OffsetCommitRequest.DEFAULT_TIMESTAMP
^
<https://builds.apache.org/job/kafka-trunk-jdk7/ws/core/src/main/scala/kafka/common/OffsetMetadataAndError.scala>:36: value DEFAULT_TIMESTAMP in object OffsetCommitRequest is deprecated: see corresponding Javadoc for more information.
commitTimestamp: Long = org.apache.kafka.common.requests.OffsetCommitRequest.DEFAULT_TIMESTAMP,
^
<https://builds.apache.org/job/kafka-trunk-jdk7/ws/core/src/main/scala/kafka/common/OffsetMetadataAndError.scala>:37: value DEFAULT_TIMESTAMP in object OffsetCommitRequest is deprecated: see corresponding Javadoc for more information.
expireTimestamp: Long = org.apache.kafka.common.requests.OffsetCommitRequest.DEFAULT_TIMESTAMP) {
^
<https://builds.apache.org/job/kafka-trunk-jdk7/ws/core/src/main/scala/kafka/coordinator/GroupMetadataManager.scala>:400: value DEFAULT_TIMESTAMP in object OffsetCommitRequest is deprecated: see corresponding Javadoc for more information.
if (value.expireTimestamp == org.apache.kafka.common.requests.OffsetCommitRequest.DEFAULT_TIMESTAMP)
^
<https://builds.apache.org/job/kafka-trunk-jdk7/ws/core/src/main/scala/kafka/server/KafkaApis.scala>:298: value DEFAULT_TIMESTAMP in object OffsetCommitRequest is deprecated: see corresponding Javadoc for more information.
if (offsetAndMetadata.commitTimestamp == org.apache.kafka.common.requests.OffsetCommitRequest.DEFAULT_TIMESTAMP)
^
<https://builds.apache.org/job/kafka-trunk-jdk7/ws/core/src/main/scala/kafka/server/KafkaServer.scala>:307: a pure expression does nothing in statement position; you may be omitting necessary parentheses
ControllerStats.uncleanLeaderElectionRate
^
<https://builds.apache.org/job/kafka-trunk-jdk7/ws/core/src/main/scala/kafka/server/KafkaServer.scala>:308: a pure expression does nothing in statement position; you may be omitting necessary parentheses
ControllerStats.leaderElectionTimer
^
<https://builds.apache.org/job/kafka-trunk-jdk7/ws/core/src/main/scala/kafka/controller/ControllerChannelManager.scala>:391: constructor UpdateMetadataRequest in class UpdateMetadataRequest is deprecated: see corresponding Javadoc for more information.
new UpdateMetadataRequest(controllerId, controllerEpoch, liveBrokers.asJava, partitionStates.asJava)
^
<https://builds.apache.org/job/kafka-trunk-jdk7/ws/core/src/main/scala/kafka/network/BlockingChannel.scala>:129: method readFromReadableChannel in class NetworkReceive is deprecated: see corresponding Javadoc for more information.
response.readFromReadableChannel(channel)
^
there were 15 feature warning(s); re-run with -feature for details
10 warnings found
:core:processResources UP-TO-DATE
:core:classes
:clients:compileTestJava UP-TO-DATE
:clients:processTestResources UP-TO-DATE
:clients:testClasses UP-TO-DATE
:core:copyDependantLibs UP-TO-DATE
:core:copyDependantTestLibs
:core:jar UP-TO-DATE
:examples:compileJava
:examples:processResources UP-TO-DATE
:examples:classes
:examples:jar
:log4j-appender:compileJava
:log4j-appender:processResources UP-TO-DATE
:log4j-appender:classes
:log4j-appender:jar
:connect:api:compileJavaNote: <https://builds.apache.org/job/kafka-trunk-jdk7/ws/connect/api/src/main/java/org/apache/kafka/connect/data/Struct.java> uses unchecked or unsafe operations.
Note: Recompile with -Xlint:unchecked for details.
:connect:api:processResources UP-TO-DATE
:connect:api:classes
:connect:api:copyDependantLibs
:connect:api:jar
:connect:json:compileJavaNote: <https://builds.apache.org/job/kafka-trunk-jdk7/ws/connect/json/src/main/java/org/apache/kafka/connect/json/JsonConverter.java> uses or overrides a deprecated API.
Note: Recompile with -Xlint:deprecation for details.
:connect:json:processResources UP-TO-DATE
:connect:json:classes
:connect:json:copyDependantLibs
:connect:json:jar
:streams:compileJavaNote: Some input files use unchecked or unsafe operations.
Note: Recompile with -Xlint:unchecked for details.
:streams:processResources UP-TO-DATE
:streams:classes
:streams:copyDependantLibs
:streams:jar
:tools:compileJava
:tools:processResources UP-TO-DATE
:tools:classes
:tools:copyDependantLibs
:tools:jar
:connect:file:compileJava
:connect:file:processResources UP-TO-DATE
:connect:file:classes
:connect:file:copyDependantLibs
:connect:file:jar
:connect:runtime:compileJavaNote: Some input files use unchecked or unsafe operations.
Note: Recompile with -Xlint:unchecked for details.
:connect:runtime:processResources UP-TO-DATE
:connect:runtime:classes
:connect:runtime:copyDependantLibs
:connect:runtime:jar
:streams:examples:compileJava
:streams:examples:processResources UP-TO-DATE
:streams:examples:classes
:streams:examples:copyDependantLibs
:streams:examples:jar
:jarAll
:test_core_2_10
Building project 'core' with Scala version 2.10.6
:kafka-trunk-jdk7:clients:compileJava UP-TO-DATE
:kafka-trunk-jdk7:clients:processResources UP-TO-DATE
:kafka-trunk-jdk7:clients:classes UP-TO-DATE
:kafka-trunk-jdk7:clients:determineCommitId UP-TO-DATE
:kafka-trunk-jdk7:clients:createVersionFile
:kafka-trunk-jdk7:clients:jar UP-TO-DATE
:kafka-trunk-jdk7:clients:compileTestJava UP-TO-DATE
:kafka-trunk-jdk7:clients:processTestResources UP-TO-DATE
:kafka-trunk-jdk7:clients:testClasses UP-TO-DATE
:kafka-trunk-jdk7:core:compileJava UP-TO-DATE
:kafka-trunk-jdk7:core:compileScala UP-TO-DATE
:kafka-trunk-jdk7:core:processResources UP-TO-DATE
:kafka-trunk-jdk7:core:classes UP-TO-DATE
:kafka-trunk-jdk7:core:checkstyleMain
:kafka-trunk-jdk7:core:compileTestJava UP-TO-DATE
:kafka-trunk-jdk7:core:compileTestScala
<https://builds.apache.org/job/kafka-trunk-jdk7/ws/core/src/test/scala/integration/kafka/api/QuotasTest.scala>:74: value BLOCK_ON_BUFFER_FULL_CONFIG in object ProducerConfig is deprecated: see corresponding Javadoc for more information.
producerProps.put(ProducerConfig.BLOCK_ON_BUFFER_FULL_CONFIG, "false")
^
<https://builds.apache.org/job/kafka-trunk-jdk7/ws/core/src/test/scala/kafka/tools/TestLogCleaning.scala>:250: value BLOCK_ON_BUFFER_FULL_CONFIG in object ProducerConfig is deprecated: see corresponding Javadoc for more information.
producerProps.setProperty(ProducerConfig.BLOCK_ON_BUFFER_FULL_CONFIG, "true")
^
there were 4 feature warning(s); re-run with -feature for details
three warnings found
:kafka-trunk-jdk7:core:processTestResources
:test_core_2_10 FAILED
FAILURE: Build failed with an exception.
* What went wrong:
org.gradle.api.internal.changedetection.state.DefaultFileCollectionSnapshotter$FileCollectionSnapshotImpl cannot be cast to org.gradle.api.internal.changedetection.state.OutputFilesCollectionSnapshotter$OutputFilesSnapshot
* Try:
Run with --stacktrace option to get the stack trace. Run with --info or --debug option to get more log output.
BUILD FAILED
Total time: 9 mins 49.697 secs
Build step 'Execute shell' marked build as failure
Recording test results
Setting GRADLE_2_4_RC_2_HOME=/home/jenkins/jenkins-slave/tools/hudson.plugins.gradle.GradleInstallation/Gradle_2.4-rc-2
Setting JDK_1_7U51_HOME=/home/jenkins/jenkins-slave/tools/hudson.model.JDK/jdk-1.7u51
ERROR: Step ?Publish JUnit test result report? failed: No test report files were found. Configuration error?
Setting GRADLE_2_4_RC_2_HOME=/home/jenkins/jenkins-slave/tools/hudson.plugins.gradle.GradleInstallation/Gradle_2.4-rc-2
Setting JDK_1_7U51_HOME=/home/jenkins/jenkins-slave/tools/hudson.model.JDK/jdk-1.7u51
Build failed in Jenkins: kafka-trunk-jdk7 #1085
Posted by Apache Jenkins Server <je...@builds.apache.org>.
See <https://builds.apache.org/job/kafka-trunk-jdk7/1085/changes>
Changes:
[wangguoz] HOTFIX: Fix checkstyle failure in KStreams by providing fully qualified
------------------------------------------
[...truncated 1768 lines...]
kafka.log.BrokerCompressionTest > testBrokerSideCompression[1] PASSED
kafka.log.BrokerCompressionTest > testBrokerSideCompression[2] PASSED
kafka.log.BrokerCompressionTest > testBrokerSideCompression[3] PASSED
kafka.log.BrokerCompressionTest > testBrokerSideCompression[4] PASSED
kafka.log.BrokerCompressionTest > testBrokerSideCompression[5] PASSED
kafka.log.BrokerCompressionTest > testBrokerSideCompression[6] PASSED
kafka.log.BrokerCompressionTest > testBrokerSideCompression[7] PASSED
kafka.log.BrokerCompressionTest > testBrokerSideCompression[8] PASSED
kafka.log.BrokerCompressionTest > testBrokerSideCompression[9] PASSED
kafka.log.BrokerCompressionTest > testBrokerSideCompression[10] PASSED
kafka.log.BrokerCompressionTest > testBrokerSideCompression[11] PASSED
kafka.log.BrokerCompressionTest > testBrokerSideCompression[12] PASSED
kafka.log.BrokerCompressionTest > testBrokerSideCompression[13] PASSED
kafka.log.BrokerCompressionTest > testBrokerSideCompression[14] PASSED
kafka.log.BrokerCompressionTest > testBrokerSideCompression[15] PASSED
kafka.log.BrokerCompressionTest > testBrokerSideCompression[16] PASSED
kafka.log.BrokerCompressionTest > testBrokerSideCompression[17] PASSED
kafka.log.BrokerCompressionTest > testBrokerSideCompression[18] PASSED
kafka.log.BrokerCompressionTest > testBrokerSideCompression[19] PASSED
kafka.log.OffsetMapTest > testClear PASSED
kafka.log.OffsetMapTest > testBasicValidation PASSED
kafka.log.LogManagerTest > testCleanupSegmentsToMaintainSize PASSED
kafka.log.LogManagerTest > testRecoveryDirectoryMappingWithRelativeDirectory PASSED
kafka.log.LogManagerTest > testGetNonExistentLog PASSED
kafka.log.LogManagerTest > testTwoLogManagersUsingSameDirFails PASSED
kafka.log.LogManagerTest > testLeastLoadedAssignment PASSED
kafka.log.LogManagerTest > testCleanupExpiredSegments PASSED
kafka.log.LogManagerTest > testCheckpointRecoveryPoints PASSED
kafka.log.LogManagerTest > testTimeBasedFlush PASSED
kafka.log.LogManagerTest > testCreateLog PASSED
kafka.log.LogManagerTest > testRecoveryDirectoryMappingWithTrailingSlash PASSED
kafka.log.LogSegmentTest > testRecoveryWithCorruptMessage PASSED
kafka.log.LogSegmentTest > testRecoveryFixesCorruptIndex PASSED
kafka.log.LogSegmentTest > testReadFromGap PASSED
kafka.log.LogSegmentTest > testTruncate PASSED
kafka.log.LogSegmentTest > testReadBeforeFirstOffset PASSED
kafka.log.LogSegmentTest > testCreateWithInitFileSizeAppendMessage PASSED
kafka.log.LogSegmentTest > testChangeFileSuffixes PASSED
kafka.log.LogSegmentTest > testMaxOffset PASSED
kafka.log.LogSegmentTest > testNextOffsetCalculation PASSED
kafka.log.LogSegmentTest > testReadOnEmptySegment PASSED
kafka.log.LogSegmentTest > testReadAfterLast PASSED
kafka.log.LogSegmentTest > testCreateWithInitFileSizeClearShutdown PASSED
kafka.log.LogSegmentTest > testTruncateFull PASSED
kafka.log.FileMessageSetTest > testTruncate PASSED
kafka.log.FileMessageSetTest > testIterationOverPartialAndTruncation PASSED
kafka.log.FileMessageSetTest > testRead PASSED
kafka.log.FileMessageSetTest > testFileSize PASSED
kafka.log.FileMessageSetTest > testIteratorWithLimits PASSED
kafka.log.FileMessageSetTest > testPreallocateTrue PASSED
kafka.log.FileMessageSetTest > testIteratorIsConsistent PASSED
kafka.log.FileMessageSetTest > testIterationDoesntChangePosition PASSED
kafka.log.FileMessageSetTest > testWrittenEqualsRead PASSED
kafka.log.FileMessageSetTest > testWriteTo PASSED
kafka.log.FileMessageSetTest > testPreallocateFalse PASSED
kafka.log.FileMessageSetTest > testPreallocateClearShutdown PASSED
kafka.log.FileMessageSetTest > testMessageFormatConversion PASSED
kafka.log.FileMessageSetTest > testSearch PASSED
kafka.log.FileMessageSetTest > testSizeInBytes PASSED
kafka.log.LogCleanerIntegrationTest > cleanerTest[0] PASSED
kafka.log.LogCleanerIntegrationTest > cleanerTest[1] PASSED
kafka.log.LogCleanerIntegrationTest > cleanerTest[2] PASSED
kafka.log.LogCleanerIntegrationTest > cleanerTest[3] PASSED
kafka.log.LogTest > testParseTopicPartitionNameForMissingTopic PASSED
kafka.log.LogTest > testIndexRebuild PASSED
kafka.log.LogTest > testLogRolls PASSED
kafka.log.LogTest > testMessageSizeCheck PASSED
kafka.log.LogTest > testAsyncDelete PASSED
kafka.log.LogTest > testReadOutOfRange PASSED
kafka.log.LogTest > testReadAtLogGap PASSED
kafka.log.LogTest > testTimeBasedLogRoll PASSED
kafka.log.LogTest > testLoadEmptyLog PASSED
kafka.log.LogTest > testMessageSetSizeCheck PASSED
kafka.log.LogTest > testIndexResizingAtTruncation PASSED
kafka.log.LogTest > testCompactedTopicConstraints PASSED
kafka.log.LogTest > testThatGarbageCollectingSegmentsDoesntChangeOffset PASSED
kafka.log.LogTest > testAppendAndReadWithSequentialOffsets PASSED
kafka.log.LogTest > testParseTopicPartitionNameForNull PASSED
kafka.log.LogTest > testAppendAndReadWithNonSequentialOffsets PASSED
kafka.log.LogTest > testParseTopicPartitionNameForMissingSeparator PASSED
kafka.log.LogTest > testCorruptIndexRebuild PASSED
kafka.log.LogTest > testBogusIndexSegmentsAreRemoved PASSED
kafka.log.LogTest > testCompressedMessages PASSED
kafka.log.LogTest > testAppendMessageWithNullPayload PASSED
kafka.log.LogTest > testCorruptLog PASSED
kafka.log.LogTest > testLogRecoversToCorrectOffset PASSED
kafka.log.LogTest > testReopenThenTruncate PASSED
kafka.log.LogTest > testParseTopicPartitionNameForMissingPartition PASSED
kafka.log.LogTest > testParseTopicPartitionNameForEmptyName PASSED
kafka.log.LogTest > testOpenDeletesObsoleteFiles PASSED
kafka.log.LogTest > testSizeBasedLogRoll PASSED
kafka.log.LogTest > testTimeBasedLogRollJitter PASSED
kafka.log.LogTest > testParseTopicPartitionName PASSED
kafka.log.LogTest > testTruncateTo PASSED
kafka.log.LogTest > testCleanShutdownFile PASSED
kafka.log.LogConfigTest > testFromPropsEmpty PASSED
kafka.log.LogConfigTest > testKafkaConfigToProps PASSED
kafka.log.LogConfigTest > testFromPropsInvalid PASSED
kafka.log.CleanerTest > testBuildOffsetMap PASSED
kafka.log.CleanerTest > testSegmentGrouping PASSED
kafka.log.CleanerTest > testCleanSegmentsWithAbort PASSED
kafka.log.CleanerTest > testSegmentGroupingWithSparseOffsets PASSED
kafka.log.CleanerTest > testRecoveryAfterCrash PASSED
kafka.log.CleanerTest > testLogToClean PASSED
kafka.log.CleanerTest > testCleaningWithDeletes PASSED
kafka.log.CleanerTest > testCleanSegments PASSED
kafka.log.CleanerTest > testCleaningWithUnkeyedMessages PASSED
kafka.log.OffsetIndexTest > lookupExtremeCases PASSED
kafka.log.OffsetIndexTest > appendTooMany PASSED
kafka.log.OffsetIndexTest > randomLookupTest PASSED
kafka.log.OffsetIndexTest > testReopen PASSED
kafka.log.OffsetIndexTest > appendOutOfOrder PASSED
kafka.log.OffsetIndexTest > truncate PASSED
694 tests completed, 1 failed
:kafka-trunk-jdk7:core:test FAILED
:test_core_2_10 FAILED
FAILURE: Build failed with an exception.
* What went wrong:
Execution failed for task ':core:test'.
> There were failing tests. See the report at: file://<https://builds.apache.org/job/kafka-trunk-jdk7/ws/core/build/reports/tests/index.html>
* Try:
Run with --stacktrace option to get the stack trace. Run with --info or --debug option to get more log output.
BUILD FAILED
Total time: 35 mins 47.686 secs
Build step 'Execute shell' marked build as failure
Recording test results
Setting GRADLE_2_4_RC_2_HOME=/jenkins/tools/hudson.plugins.gradle.GradleInstallation/Gradle_2.4-rc-2
Setting JDK_1_7U51_HOME=/jenkins/tools/hudson.model.JDK/jdk-1.7u51
Setting GRADLE_2_4_RC_2_HOME=/jenkins/tools/hudson.plugins.gradle.GradleInstallation/Gradle_2.4-rc-2
Setting JDK_1_7U51_HOME=/jenkins/tools/hudson.model.JDK/jdk-1.7u51
Build failed in Jenkins: kafka-trunk-jdk7 #1084
Posted by Apache Jenkins Server <je...@builds.apache.org>.
See <https://builds.apache.org/job/kafka-trunk-jdk7/1084/changes>
Changes:
[cshapi] KAFKA-2784: swallow exceptions when mirror maker exits.
[me] KAFKA-2944: Replaced the NPE with a nicer error and clean exit and added
------------------------------------------
[...truncated 1488 lines...]
kafka.log.LogTest > testTruncateTo PASSED
kafka.log.LogTest > testCleanShutdownFile PASSED
kafka.log.OffsetIndexTest > lookupExtremeCases PASSED
kafka.log.OffsetIndexTest > appendTooMany PASSED
kafka.log.OffsetIndexTest > randomLookupTest PASSED
kafka.log.OffsetIndexTest > testReopen PASSED
kafka.log.OffsetIndexTest > appendOutOfOrder PASSED
kafka.log.OffsetIndexTest > truncate PASSED
kafka.log.LogSegmentTest > testRecoveryWithCorruptMessage PASSED
kafka.log.LogSegmentTest > testRecoveryFixesCorruptIndex PASSED
kafka.log.LogSegmentTest > testReadFromGap PASSED
kafka.log.LogSegmentTest > testTruncate PASSED
kafka.log.LogSegmentTest > testReadBeforeFirstOffset PASSED
kafka.log.LogSegmentTest > testCreateWithInitFileSizeAppendMessage PASSED
kafka.log.LogSegmentTest > testChangeFileSuffixes PASSED
kafka.log.LogSegmentTest > testMaxOffset PASSED
kafka.log.LogSegmentTest > testNextOffsetCalculation PASSED
kafka.log.LogSegmentTest > testReadOnEmptySegment PASSED
kafka.log.LogSegmentTest > testReadAfterLast PASSED
kafka.log.LogSegmentTest > testCreateWithInitFileSizeClearShutdown PASSED
kafka.log.LogSegmentTest > testTruncateFull PASSED
kafka.log.CleanerTest > testBuildOffsetMap PASSED
kafka.log.CleanerTest > testSegmentGrouping PASSED
kafka.log.CleanerTest > testCleanSegmentsWithAbort PASSED
kafka.log.CleanerTest > testSegmentGroupingWithSparseOffsets PASSED
kafka.log.CleanerTest > testRecoveryAfterCrash PASSED
kafka.log.CleanerTest > testLogToClean PASSED
kafka.log.CleanerTest > testCleaningWithDeletes PASSED
kafka.log.CleanerTest > testCleanSegments PASSED
kafka.log.CleanerTest > testCleaningWithUnkeyedMessages PASSED
kafka.log.OffsetMapTest > testClear PASSED
kafka.log.OffsetMapTest > testBasicValidation PASSED
kafka.coordinator.GroupCoordinatorResponseTest > testHeartbeatWrongCoordinator PASSED
kafka.coordinator.GroupCoordinatorResponseTest > testDescribeGroupStable PASSED
kafka.coordinator.GroupCoordinatorResponseTest > testHeartbeatIllegalGeneration PASSED
kafka.coordinator.GroupCoordinatorResponseTest > testDescribeGroupWrongCoordinator PASSED
kafka.coordinator.GroupCoordinatorResponseTest > testDescribeGroupRebalancing PASSED
kafka.coordinator.GroupCoordinatorResponseTest > testLeaderFailureInSyncGroup PASSED
kafka.coordinator.GroupCoordinatorResponseTest > testGenerationIdIncrementsOnRebalance PASSED
kafka.coordinator.GroupCoordinatorResponseTest > testSyncGroupFromIllegalGeneration PASSED
kafka.coordinator.GroupCoordinatorResponseTest > testInvalidGroupId PASSED
kafka.coordinator.GroupCoordinatorResponseTest > testHeartbeatUnknownGroup PASSED
kafka.coordinator.GroupCoordinatorResponseTest > testListGroupsIncludesStableGroups PASSED
kafka.coordinator.GroupCoordinatorResponseTest > testHeartbeatDuringRebalanceCausesRebalanceInProgress PASSED
kafka.coordinator.GroupCoordinatorResponseTest > testJoinGroupInconsistentGroupProtocol PASSED
kafka.coordinator.GroupCoordinatorResponseTest > testJoinGroupSessionTimeoutTooLarge PASSED
kafka.coordinator.GroupCoordinatorResponseTest > testJoinGroupSessionTimeoutTooSmall PASSED
kafka.coordinator.GroupCoordinatorResponseTest > testSyncGroupEmptyAssignment PASSED
kafka.coordinator.GroupCoordinatorResponseTest > testCommitOffsetWithDefaultGeneration PASSED
kafka.coordinator.GroupCoordinatorResponseTest > testJoinGroupFromUnchangedLeaderShouldRebalance PASSED
kafka.coordinator.GroupCoordinatorResponseTest > testHeartbeatRebalanceInProgress PASSED
kafka.coordinator.GroupCoordinatorResponseTest > testLeaveGroupUnknownGroup PASSED
kafka.coordinator.GroupCoordinatorResponseTest > testListGroupsIncludesRebalancingGroups PASSED
kafka.coordinator.GroupCoordinatorResponseTest > testSyncGroupFollowerAfterLeader PASSED
kafka.coordinator.GroupCoordinatorResponseTest > testCommitOffsetInAwaitingSync PASSED
kafka.coordinator.GroupCoordinatorResponseTest > testJoinGroupWrongCoordinator PASSED
kafka.coordinator.GroupCoordinatorResponseTest > testJoinGroupUnknownConsumerExistingGroup PASSED
kafka.coordinator.GroupCoordinatorResponseTest > testSyncGroupFromUnknownGroup PASSED
kafka.coordinator.GroupCoordinatorResponseTest > testJoinGroupInconsistentProtocolType PASSED
kafka.coordinator.GroupCoordinatorResponseTest > testCommitOffsetFromUnknownGroup PASSED
kafka.coordinator.GroupCoordinatorResponseTest > testLeaveGroupWrongCoordinator PASSED
kafka.coordinator.GroupCoordinatorResponseTest > testLeaveGroupUnknownConsumerExistingGroup PASSED
kafka.coordinator.GroupCoordinatorResponseTest > testJoinGroupUnknownConsumerNewGroup PASSED
kafka.coordinator.GroupCoordinatorResponseTest > testJoinGroupFromUnchangedFollowerDoesNotRebalance PASSED
kafka.coordinator.GroupCoordinatorResponseTest > testValidJoinGroup PASSED
kafka.coordinator.GroupCoordinatorResponseTest > testSyncGroupLeaderAfterFollower PASSED
kafka.coordinator.GroupCoordinatorResponseTest > testSyncGroupFromUnknownMember PASSED
kafka.coordinator.GroupCoordinatorResponseTest > testValidLeaveGroup PASSED
kafka.coordinator.GroupCoordinatorResponseTest > testDescribeGroupInactiveGroup PASSED
kafka.coordinator.GroupCoordinatorResponseTest > testSyncGroupNotCoordinator PASSED
kafka.coordinator.GroupCoordinatorResponseTest > testHeartbeatUnknownConsumerExistingGroup PASSED
kafka.coordinator.GroupCoordinatorResponseTest > testValidHeartbeat PASSED
kafka.coordinator.MemberMetadataTest > testMatchesSupportedProtocols PASSED
kafka.coordinator.MemberMetadataTest > testMetadata PASSED
kafka.coordinator.MemberMetadataTest > testMetadataRaisesOnUnsupportedProtocol PASSED
kafka.coordinator.MemberMetadataTest > testVoteForPreferredProtocol PASSED
kafka.coordinator.MemberMetadataTest > testVoteRaisesOnNoSupportedProtocols PASSED
kafka.coordinator.GroupMetadataTest > testDeadToAwaitingSyncIllegalTransition PASSED
kafka.coordinator.GroupMetadataTest > testPreparingRebalanceToStableIllegalTransition PASSED
kafka.coordinator.GroupMetadataTest > testCannotRebalanceWhenDead PASSED
kafka.coordinator.GroupMetadataTest > testSelectProtocol PASSED
kafka.coordinator.GroupMetadataTest > testCannotRebalanceWhenPreparingRebalance PASSED
kafka.coordinator.GroupMetadataTest > testDeadToPreparingRebalanceIllegalTransition PASSED
kafka.coordinator.GroupMetadataTest > testCanRebalanceWhenAwaitingSync PASSED
kafka.coordinator.GroupMetadataTest > testAwaitingSyncToPreparingRebalanceTransition PASSED
kafka.coordinator.GroupMetadataTest > testStableToAwaitingSyncIllegalTransition PASSED
kafka.coordinator.GroupMetadataTest > testDeadToDeadIllegalTransition PASSED
kafka.coordinator.GroupMetadataTest > testSelectProtocolRaisesIfNoMembers PASSED
kafka.coordinator.GroupMetadataTest > testStableToPreparingRebalanceTransition PASSED
kafka.coordinator.GroupMetadataTest > testPreparingRebalanceToDeadTransition PASSED
kafka.coordinator.GroupMetadataTest > testStableToStableIllegalTransition PASSED
kafka.coordinator.GroupMetadataTest > testAwaitingSyncToStableTransition PASSED
kafka.coordinator.GroupMetadataTest > testDeadToStableIllegalTransition PASSED
kafka.coordinator.GroupMetadataTest > testAwaitingSyncToAwaitingSyncIllegalTransition PASSED
kafka.coordinator.GroupMetadataTest > testSupportsProtocols PASSED
kafka.coordinator.GroupMetadataTest > testCanRebalanceWhenStable PASSED
kafka.coordinator.GroupMetadataTest > testPreparingRebalanceToPreparingRebalanceIllegalTransition PASSED
kafka.coordinator.GroupMetadataTest > testSelectProtocolChoosesCompatibleProtocol PASSED
kafka.javaapi.message.ByteBufferMessageSetTest > testSizeInBytesWithCompression PASSED
kafka.javaapi.message.ByteBufferMessageSetTest > testIteratorIsConsistentWithCompression PASSED
kafka.javaapi.message.ByteBufferMessageSetTest > testIteratorIsConsistent PASSED
kafka.javaapi.message.ByteBufferMessageSetTest > testEqualsWithCompression PASSED
kafka.javaapi.message.ByteBufferMessageSetTest > testWrittenEqualsRead PASSED
kafka.javaapi.message.ByteBufferMessageSetTest > testEquals PASSED
kafka.javaapi.message.ByteBufferMessageSetTest > testSizeInBytes PASSED
kafka.javaapi.consumer.ZookeeperConsumerConnectorTest > testBasic PASSED
kafka.KafkaTest > testGetKafkaConfigFromArgsWrongSetValue PASSED
kafka.KafkaTest > testKafkaSslPasswords PASSED
kafka.KafkaTest > testGetKafkaConfigFromArgs PASSED
kafka.KafkaTest > testGetKafkaConfigFromArgsNonArgsAtTheEnd PASSED
kafka.KafkaTest > testGetKafkaConfigFromArgsNonArgsOnly PASSED
kafka.KafkaTest > testGetKafkaConfigFromArgsNonArgsAtTheBegging PASSED
kafka.controller.ControllerFailoverTest > testMetadataUpdate PASSED
694 tests completed, 1 failed
:kafka-trunk-jdk7:core:test FAILED
:test_core_2_10 FAILED
FAILURE: Build failed with an exception.
* What went wrong:
Execution failed for task ':core:test'.
> There were failing tests. See the report at: file://<https://builds.apache.org/job/kafka-trunk-jdk7/ws/core/build/reports/tests/index.html>
* Try:
Run with --stacktrace option to get the stack trace. Run with --info or --debug option to get more log output.
BUILD FAILED
Total time: 58 mins 8.8 secs
Build step 'Execute shell' marked build as failure
Recording test results
Setting GRADLE_2_4_RC_2_HOME=/home/jenkins/jenkins-slave/tools/hudson.plugins.gradle.GradleInstallation/Gradle_2.4-rc-2
Setting JDK_1_7U51_HOME=/home/jenkins/jenkins-slave/tools/hudson.model.JDK/jdk-1.7u51
Setting GRADLE_2_4_RC_2_HOME=/home/jenkins/jenkins-slave/tools/hudson.plugins.gradle.GradleInstallation/Gradle_2.4-rc-2
Setting JDK_1_7U51_HOME=/home/jenkins/jenkins-slave/tools/hudson.model.JDK/jdk-1.7u51
Build failed in Jenkins: kafka-trunk-jdk7 #1083
Posted by Apache Jenkins Server <je...@builds.apache.org>.
See <https://builds.apache.org/job/kafka-trunk-jdk7/1083/changes>
Changes:
[cshapi] KAFKA-3290: fix transient test failures in WorkerSourceTaskTest
[cshapi] MINOR: fix typo
------------------------------------------
[...truncated 2916 lines...]
kafka.api.PlaintextProducerSendTest > testAutoCreateTopic PASSED
kafka.api.PlaintextProducerSendTest > testSendWithInvalidCreateTime PASSED
kafka.api.PlaintextProducerSendTest > testSendCompressedMessageWithCreateTime PASSED
kafka.api.PlaintextProducerSendTest > testCloseWithZeroTimeoutFromCallerThread PASSED
kafka.api.PlaintextProducerSendTest > testCloseWithZeroTimeoutFromSenderThread PASSED
kafka.api.PlaintextProducerSendTest > testWrongSerializer PASSED
kafka.api.PlaintextProducerSendTest > testSendNonCompressedMessageWithLogApendTime PASSED
kafka.api.AdminClientTest > testDescribeGroup PASSED
kafka.api.AdminClientTest > testDescribeConsumerGroup PASSED
kafka.api.AdminClientTest > testListGroups PASSED
kafka.api.AdminClientTest > testDescribeConsumerGroupForNonExistentGroup PASSED
kafka.api.ApiUtilsTest > testShortStringNonASCII PASSED
kafka.api.ApiUtilsTest > testShortStringASCII PASSED
kafka.api.PlaintextConsumerTest > testPartitionsForAutoCreate PASSED
kafka.api.PlaintextConsumerTest > testShrinkingTopicSubscriptions PASSED
kafka.api.PlaintextConsumerTest > testMultiConsumerSessionTimeoutOnStopPolling PASSED
kafka.api.PlaintextConsumerTest > testPartitionsForInvalidTopic PASSED
kafka.api.PlaintextConsumerTest > testSeek PASSED
kafka.api.PlaintextConsumerTest > testPositionAndCommit PASSED
kafka.api.PlaintextConsumerTest > testMultiConsumerSessionTimeoutOnClose PASSED
kafka.api.PlaintextConsumerTest > testFetchRecordTooLarge PASSED
kafka.api.PlaintextConsumerTest > testMultiConsumerDefaultAssignment PASSED
kafka.api.PlaintextConsumerTest > testAutoCommitOnClose PASSED
kafka.api.PlaintextConsumerTest > testExpandingTopicSubscriptions PASSED
kafka.api.PlaintextConsumerTest > testInterceptors PASSED
kafka.api.PlaintextConsumerTest > testPatternUnsubscription PASSED
kafka.api.PlaintextConsumerTest > testGroupConsumption PASSED
kafka.api.PlaintextConsumerTest > testPartitionsFor PASSED
kafka.api.PlaintextConsumerTest > testInterceptorsWithWrongKeyValue PASSED
kafka.api.PlaintextConsumerTest > testMultiConsumerRoundRobinAssignment PASSED
kafka.api.PlaintextConsumerTest > testPartitionPauseAndResume PASSED
kafka.api.PlaintextConsumerTest > testConsumeMessagesWithLogAppendTime PASSED
kafka.api.PlaintextConsumerTest > testAutoCommitOnCloseAfterWakeup PASSED
kafka.api.PlaintextConsumerTest > testMaxPollRecords PASSED
kafka.api.PlaintextConsumerTest > testAutoOffsetReset PASSED
kafka.api.PlaintextConsumerTest > testFetchInvalidOffset PASSED
kafka.api.PlaintextConsumerTest > testAutoCommitIntercept PASSED
kafka.api.PlaintextConsumerTest > testCommitMetadata PASSED
kafka.api.PlaintextConsumerTest > testRoundRobinAssignment PASSED
kafka.api.PlaintextConsumerTest > testPatternSubscription PASSED
kafka.api.PlaintextConsumerTest > testPauseStateNotPreservedByRebalance PASSED
kafka.api.PlaintextConsumerTest > testUnsubscribeTopic PASSED
kafka.api.PlaintextConsumerTest > testListTopics PASSED
kafka.api.PlaintextConsumerTest > testAutoCommitOnRebalance PASSED
kafka.api.PlaintextConsumerTest > testSimpleConsumption PASSED
kafka.api.PlaintextConsumerTest > testPartitionReassignmentCallback PASSED
kafka.api.PlaintextConsumerTest > testCommitSpecifiedOffsets PASSED
ERROR: Could not install GRADLE_2_4_RC_2_HOME
java.lang.NullPointerException
at hudson.plugins.toolenv.ToolEnvBuildWrapper$1.buildEnvVars(ToolEnvBuildWrapper.java:46)
at hudson.model.AbstractBuild.getEnvironment(AbstractBuild.java:947)
at hudson.plugins.git.GitSCM.getParamExpandedRepos(GitSCM.java:390)
at hudson.plugins.git.GitSCM.compareRemoteRevisionWithImpl(GitSCM.java:577)
at hudson.plugins.git.GitSCM.compareRemoteRevisionWith(GitSCM.java:527)
at hudson.scm.SCM.compareRemoteRevisionWith(SCM.java:381)
at hudson.scm.SCM.poll(SCM.java:398)
at hudson.model.AbstractProject._poll(AbstractProject.java:1453)
at hudson.model.AbstractProject.poll(AbstractProject.java:1356)
at hudson.triggers.SCMTrigger$Runner.runPolling(SCMTrigger.java:526)
at hudson.triggers.SCMTrigger$Runner.run(SCMTrigger.java:555)
at hudson.util.SequentialExecutionQueue$QueueEntry.run(SequentialExecutionQueue.java:119)
at java.util.concurrent.Executors$RunnableAdapter.call(Executors.java:471)
at java.util.concurrent.FutureTask.run(FutureTask.java:262)
at java.util.concurrent.ThreadPoolExecutor.runWorker(ThreadPoolExecutor.java:1145)
at java.util.concurrent.ThreadPoolExecutor$Worker.run(ThreadPoolExecutor.java:615)
at java.lang.Thread.run(Thread.java:745)
ERROR: Could not install JDK_1_7U51_HOME
java.lang.NullPointerException
at hudson.plugins.toolenv.ToolEnvBuildWrapper$1.buildEnvVars(ToolEnvBuildWrapper.java:46)
at hudson.model.AbstractBuild.getEnvironment(AbstractBuild.java:947)
at hudson.plugins.git.GitSCM.getParamExpandedRepos(GitSCM.java:390)
at hudson.plugins.git.GitSCM.compareRemoteRevisionWithImpl(GitSCM.java:577)
at hudson.plugins.git.GitSCM.compareRemoteRevisionWith(GitSCM.java:527)
at hudson.scm.SCM.compareRemoteRevisionWith(SCM.java:381)
at hudson.scm.SCM.poll(SCM.java:398)
at hudson.model.AbstractProject._poll(AbstractProject.java:1453)
at hudson.model.AbstractProject.poll(AbstractProject.java:1356)
at hudson.triggers.SCMTrigger$Runner.runPolling(SCMTrigger.java:526)
at hudson.triggers.SCMTrigger$Runner.run(SCMTrigger.java:555)
at hudson.util.SequentialExecutionQueue$QueueEntry.run(SequentialExecutionQueue.java:119)
at java.util.concurrent.Executors$RunnableAdapter.call(Executors.java:471)
at java.util.concurrent.FutureTask.run(FutureTask.java:262)
at java.util.concurrent.ThreadPoolExecutor.runWorker(ThreadPoolExecutor.java:1145)
at java.util.concurrent.ThreadPoolExecutor$Worker.run(ThreadPoolExecutor.java:615)
at java.lang.Thread.run(Thread.java:745)
kafka.api.ProducerBounceTest > testBrokerFailure PASSED
kafka.api.ProducerFailureHandlingTest > testCannotSendToInternalTopic PASSED
kafka.api.ProducerFailureHandlingTest > testTooLargeRecordWithAckOne PASSED
kafka.api.ProducerFailureHandlingTest > testWrongBrokerList PASSED
kafka.api.ProducerFailureHandlingTest > testNotEnoughReplicas PASSED
kafka.api.ProducerFailureHandlingTest > testNonExistentTopic PASSED
kafka.api.ProducerFailureHandlingTest > testInvalidPartition PASSED
kafka.api.ProducerFailureHandlingTest > testSendAfterClosed PASSED
kafka.api.ProducerFailureHandlingTest > testTooLargeRecordWithAckZero PASSED
kafka.api.ProducerFailureHandlingTest > testNotEnoughReplicasAfterBrokerShutdown PASSED
kafka.api.SaslPlaintextConsumerTest > testPauseStateNotPreservedByRebalance PASSED
kafka.api.SaslPlaintextConsumerTest > testUnsubscribeTopic PASSED
kafka.api.SaslPlaintextConsumerTest > testListTopics PASSED
kafka.api.SaslPlaintextConsumerTest > testAutoCommitOnRebalance PASSED
kafka.api.SaslPlaintextConsumerTest > testSimpleConsumption PASSED
kafka.api.SaslPlaintextConsumerTest > testPartitionReassignmentCallback PASSED
kafka.api.SaslPlaintextConsumerTest > testCommitSpecifiedOffsets PASSED
kafka.api.SslConsumerTest > testPauseStateNotPreservedByRebalance PASSED
kafka.api.SslConsumerTest > testUnsubscribeTopic PASSED
kafka.api.SslConsumerTest > testListTopics PASSED
kafka.api.SslConsumerTest > testAutoCommitOnRebalance PASSED
kafka.api.SslConsumerTest > testSimpleConsumption PASSED
kafka.api.SslConsumerTest > testPartitionReassignmentCallback PASSED
kafka.api.SslConsumerTest > testCommitSpecifiedOffsets PASSED
kafka.api.ConsumerBounceTest > testSeekAndCommitWithBrokerFailures PASSED
kafka.api.ConsumerBounceTest > testConsumptionWithBrokerFailures PASSED
kafka.api.AuthorizerIntegrationTest > testCommitWithTopicWrite PASSED
kafka.api.AuthorizerIntegrationTest > testConsumeWithNoTopicAccess PASSED
kafka.api.AuthorizerIntegrationTest > testCreatePermissionNeededToReadFromNonExistentTopic PASSED
kafka.api.AuthorizerIntegrationTest > testOffsetFetchWithNoAccess PASSED
kafka.api.AuthorizerIntegrationTest > testListOfsetsWithTopicDescribe PASSED
kafka.api.AuthorizerIntegrationTest > testProduceWithTopicRead PASSED
kafka.api.AuthorizerIntegrationTest > testListOffsetsWithNoTopicAccess PASSED
kafka.api.AuthorizerIntegrationTest > testCreatePermissionNeededForWritingToNonExistentTopic PASSED
kafka.api.AuthorizerIntegrationTest > testConsumeWithNoGroupAccess PASSED
kafka.api.AuthorizerIntegrationTest > testConsumeWithTopicDescribe PASSED
kafka.api.AuthorizerIntegrationTest > testOffsetFetchWithNoTopicAccess PASSED
kafka.api.AuthorizerIntegrationTest > testCommitWithNoTopicAccess PASSED
kafka.api.AuthorizerIntegrationTest > testProduceWithNoTopicAccess PASSED
kafka.api.AuthorizerIntegrationTest > testProduceWithTopicWrite PASSED
kafka.api.AuthorizerIntegrationTest > testAuthorization PASSED
kafka.api.AuthorizerIntegrationTest > testConsumeWithTopicAndGroupRead PASSED
kafka.api.AuthorizerIntegrationTest > testConsumeWithTopicWrite PASSED
kafka.api.AuthorizerIntegrationTest > testOffsetFetchWithNoGroupAccess PASSED
kafka.api.AuthorizerIntegrationTest > testCommitWithNoAccess PASSED
kafka.api.AuthorizerIntegrationTest > testCommitWithNoGroupAccess PASSED
kafka.api.AuthorizerIntegrationTest > testConsumeWithNoAccess PASSED
kafka.api.AuthorizerIntegrationTest > testOffsetFetchWithTopicAndGroupRead PASSED
kafka.api.AuthorizerIntegrationTest > testCommitWithTopicDescribe PASSED
kafka.api.AuthorizerIntegrationTest > testProduceWithTopicDescribe PASSED
kafka.api.AuthorizerIntegrationTest > testOffsetFetchTopicDescribe PASSED
kafka.api.AuthorizerIntegrationTest > testCommitWithTopicAndGroupRead PASSED
kafka.api.RequestResponseSerializationTest > testSerializationAndDeserialization PASSED
kafka.api.RequestResponseSerializationTest > testFetchResponseVersion PASSED
kafka.api.RequestResponseSerializationTest > testProduceResponseVersion PASSED
Build timed out (after 120 minutes). Marking the build as failed.
Build was aborted
Recording test results
Setting GRADLE_2_4_RC_2_HOME=/home/jenkins/jenkins-slave/tools/hudson.plugins.gradle.GradleInstallation/Gradle_2.4-rc-2
Setting JDK_1_7U51_HOME=/home/jenkins/jenkins-slave/tools/hudson.model.JDK/jdk-1.7u51
Setting GRADLE_2_4_RC_2_HOME=/home/jenkins/jenkins-slave/tools/hudson.plugins.gradle.GradleInstallation/Gradle_2.4-rc-2
Setting JDK_1_7U51_HOME=/home/jenkins/jenkins-slave/tools/hudson.model.JDK/jdk-1.7u51