You are viewing a plain text version of this content. The canonical link for it is here.
Posted to dev@kafka.apache.org by Apache Jenkins Server <je...@builds.apache.org> on 2018/10/05 07:07:12 UTC
Build failed in Jenkins: kafka-0.10.2-jdk7 #235
See <https://builds.apache.org/job/kafka-0.10.2-jdk7/235/display/redirect?page=changes>
Changes:
[me] KAFKA-7476: Fix Date-based types in SchemaProjector
------------------------------------------
[...truncated 1.31 MB...]
org.apache.kafka.streams.processor.internals.StateConsumerTest > shouldFlushStoreWhenFlushIntervalHasLapsed STARTED
org.apache.kafka.streams.processor.internals.StateConsumerTest > shouldFlushStoreWhenFlushIntervalHasLapsed PASSED
org.apache.kafka.streams.processor.internals.StateConsumerTest > shouldUpdateStateWithReceivedRecordsForAllTopicPartition STARTED
org.apache.kafka.streams.processor.internals.StateConsumerTest > shouldUpdateStateWithReceivedRecordsForAllTopicPartition PASSED
org.apache.kafka.streams.processor.internals.StateConsumerTest > shouldAssignPartitionsToConsumer STARTED
org.apache.kafka.streams.processor.internals.StateConsumerTest > shouldAssignPartitionsToConsumer PASSED
org.apache.kafka.streams.processor.internals.StateConsumerTest > shouldCloseStateMaintainer STARTED
org.apache.kafka.streams.processor.internals.StateConsumerTest > shouldCloseStateMaintainer PASSED
org.apache.kafka.streams.processor.internals.StreamThreadTest > shouldNotNullPointerWhenStandbyTasksAssignedAndNoStateStoresForTopology STARTED
org.apache.kafka.streams.processor.internals.StreamThreadTest > shouldNotNullPointerWhenStandbyTasksAssignedAndNoStateStoresForTopology PASSED
org.apache.kafka.streams.processor.internals.StreamThreadTest > testInjectClients STARTED
org.apache.kafka.streams.processor.internals.StreamThreadTest > testInjectClients PASSED
org.apache.kafka.streams.processor.internals.StreamThreadTest > shouldCloseActiveTasksThatAreAssignedToThisStreamThreadButAssignmentHasChangedBeforeCreatingNewTasks STARTED
org.apache.kafka.streams.processor.internals.StreamThreadTest > shouldCloseActiveTasksThatAreAssignedToThisStreamThreadButAssignmentHasChangedBeforeCreatingNewTasks PASSED
org.apache.kafka.streams.processor.internals.StreamThreadTest > shouldNotViolateAtLeastOnceWhenExceptionOccursDuringFlushStateWhileSuspendingState STARTED
org.apache.kafka.streams.processor.internals.StreamThreadTest > shouldNotViolateAtLeastOnceWhenExceptionOccursDuringFlushStateWhileSuspendingState PASSED
org.apache.kafka.streams.processor.internals.StreamThreadTest > shouldInitializeRestoreConsumerWithOffsetsFromStandbyTasks STARTED
org.apache.kafka.streams.processor.internals.StreamThreadTest > shouldInitializeRestoreConsumerWithOffsetsFromStandbyTasks PASSED
org.apache.kafka.streams.processor.internals.StreamThreadTest > shouldReleaseStateDirLockIfFailureOnStandbyTaskCloseForUnassignedSuspendedStandbyTask STARTED
org.apache.kafka.streams.processor.internals.StreamThreadTest > shouldReleaseStateDirLockIfFailureOnStandbyTaskCloseForUnassignedSuspendedStandbyTask PASSED
org.apache.kafka.streams.processor.internals.StreamThreadTest > testHandingOverTaskFromOneToAnotherThread STARTED
org.apache.kafka.streams.processor.internals.StreamThreadTest > testHandingOverTaskFromOneToAnotherThread PASSED
org.apache.kafka.streams.processor.internals.StreamThreadTest > testMaybeCommit STARTED
org.apache.kafka.streams.processor.internals.StreamThreadTest > testMaybeCommit PASSED
org.apache.kafka.streams.processor.internals.StreamThreadTest > testStateChangeStartClose STARTED
org.apache.kafka.streams.processor.internals.StreamThreadTest > testStateChangeStartClose PASSED
org.apache.kafka.streams.processor.internals.StreamThreadTest > shouldNotViolateAtLeastOnceWhenAnExceptionOccursOnTaskCloseDuringShutdown STARTED
org.apache.kafka.streams.processor.internals.StreamThreadTest > shouldNotViolateAtLeastOnceWhenAnExceptionOccursOnTaskCloseDuringShutdown PASSED
org.apache.kafka.streams.processor.internals.StreamThreadTest > shouldNotViolateAtLeastOnceWhenExceptionOccursDuringCloseTopologyWhenSuspendingState STARTED
org.apache.kafka.streams.processor.internals.StreamThreadTest > shouldNotViolateAtLeastOnceWhenExceptionOccursDuringCloseTopologyWhenSuspendingState PASSED
org.apache.kafka.streams.processor.internals.StreamThreadTest > testPartitionAssignmentChange STARTED
org.apache.kafka.streams.processor.internals.StreamThreadTest > testPartitionAssignmentChange PASSED
org.apache.kafka.streams.processor.internals.StreamThreadTest > testMaybeClean STARTED
org.apache.kafka.streams.processor.internals.StreamThreadTest > testMaybeClean PASSED
org.apache.kafka.streams.processor.internals.StreamThreadTest > shouldReleaseStateDirLockIfFailureOnTaskCloseForUnassignedSuspendedTask STARTED
org.apache.kafka.streams.processor.internals.StreamThreadTest > shouldReleaseStateDirLockIfFailureOnTaskCloseForUnassignedSuspendedTask PASSED
org.apache.kafka.streams.processor.internals.StreamThreadTest > testMetrics STARTED
org.apache.kafka.streams.processor.internals.StreamThreadTest > testMetrics PASSED
org.apache.kafka.streams.processor.internals.StreamThreadTest > shouldCloseSuspendedTasksThatAreNoLongerAssignedToThisStreamThreadBeforeCreatingNewTasks STARTED
org.apache.kafka.streams.processor.internals.StreamThreadTest > shouldCloseSuspendedTasksThatAreNoLongerAssignedToThisStreamThreadBeforeCreatingNewTasks PASSED
org.apache.kafka.streams.processor.internals.StreamThreadTest > shouldNotViolateAtLeastOnceWhenAnExceptionOccursOnTaskFlushDuringShutdown STARTED
org.apache.kafka.streams.processor.internals.StreamThreadTest > shouldNotViolateAtLeastOnceWhenAnExceptionOccursOnTaskFlushDuringShutdown PASSED
org.apache.kafka.streams.processor.internals.GlobalStreamThreadTest > shouldStayDeadAfterTwoCloses STARTED
org.apache.kafka.streams.processor.internals.GlobalStreamThreadTest > shouldStayDeadAfterTwoCloses PASSED
org.apache.kafka.streams.processor.internals.GlobalStreamThreadTest > shouldThrowStreamsExceptionOnStartupIfThereIsAnException STARTED
org.apache.kafka.streams.processor.internals.GlobalStreamThreadTest > shouldThrowStreamsExceptionOnStartupIfThereIsAnException PASSED
org.apache.kafka.streams.processor.internals.GlobalStreamThreadTest > shouldTransitiontoRunningOnStart STARTED
org.apache.kafka.streams.processor.internals.GlobalStreamThreadTest > shouldTransitiontoRunningOnStart PASSED
org.apache.kafka.streams.processor.internals.GlobalStreamThreadTest > shouldCloseStateStoresOnClose STARTED
org.apache.kafka.streams.processor.internals.GlobalStreamThreadTest > shouldCloseStateStoresOnClose PASSED
org.apache.kafka.streams.processor.internals.GlobalStreamThreadTest > shouldBeRunningAfterSuccessfulStart STARTED
org.apache.kafka.streams.processor.internals.GlobalStreamThreadTest > shouldBeRunningAfterSuccessfulStart PASSED
org.apache.kafka.streams.processor.internals.GlobalStreamThreadTest > shouldTransitionToDeadOnClose STARTED
org.apache.kafka.streams.processor.internals.GlobalStreamThreadTest > shouldTransitionToDeadOnClose PASSED
org.apache.kafka.streams.processor.internals.GlobalStreamThreadTest > shouldStopRunningWhenClosedByUser STARTED
org.apache.kafka.streams.processor.internals.GlobalStreamThreadTest > shouldStopRunningWhenClosedByUser PASSED
org.apache.kafka.streams.processor.internals.QuickUnionTest > testUnite STARTED
org.apache.kafka.streams.processor.internals.QuickUnionTest > testUnite PASSED
org.apache.kafka.streams.processor.internals.QuickUnionTest > testUniteMany STARTED
org.apache.kafka.streams.processor.internals.QuickUnionTest > testUniteMany PASSED
org.apache.kafka.streams.processor.internals.AbstractTaskTest > shouldThrowProcessorStateExceptionOnInitializeOffsetsWhenAuthorizationException STARTED
org.apache.kafka.streams.processor.internals.AbstractTaskTest > shouldThrowProcessorStateExceptionOnInitializeOffsetsWhenAuthorizationException PASSED
org.apache.kafka.streams.processor.internals.AbstractTaskTest > shouldThrowProcessorStateExceptionOnInitializeOffsetsWhenKafkaException STARTED
org.apache.kafka.streams.processor.internals.AbstractTaskTest > shouldThrowProcessorStateExceptionOnInitializeOffsetsWhenKafkaException PASSED
org.apache.kafka.streams.processor.internals.AbstractTaskTest > shouldThrowWakeupExceptionOnInitializeOffsetsWhenWakeupException STARTED
org.apache.kafka.streams.processor.internals.AbstractTaskTest > shouldThrowWakeupExceptionOnInitializeOffsetsWhenWakeupException PASSED
org.apache.kafka.streams.processor.internals.RecordQueueTest > testTimeTracking STARTED
org.apache.kafka.streams.processor.internals.RecordQueueTest > testTimeTracking PASSED
org.apache.kafka.streams.processor.internals.RecordQueueTest > shouldDropOnNegativeTimestamp STARTED
org.apache.kafka.streams.processor.internals.RecordQueueTest > shouldDropOnNegativeTimestamp PASSED
org.apache.kafka.streams.processor.internals.RecordQueueTest > shouldThrowOnNegativeTimestamp STARTED
org.apache.kafka.streams.processor.internals.RecordQueueTest > shouldThrowOnNegativeTimestamp PASSED
org.apache.kafka.streams.processor.internals.RecordQueueTest > shouldThrowStreamsExceptionWhenKeyDeserializationFails STARTED
org.apache.kafka.streams.processor.internals.RecordQueueTest > shouldThrowStreamsExceptionWhenKeyDeserializationFails PASSED
org.apache.kafka.streams.processor.internals.RecordQueueTest > shouldThrowStreamsExceptionWhenValueDeserializationFails STARTED
org.apache.kafka.streams.processor.internals.RecordQueueTest > shouldThrowStreamsExceptionWhenValueDeserializationFails PASSED
org.apache.kafka.streams.processor.internals.assignment.AssignmentInfoTest > testEncodeDecode STARTED
org.apache.kafka.streams.processor.internals.assignment.AssignmentInfoTest > testEncodeDecode PASSED
org.apache.kafka.streams.processor.internals.assignment.AssignmentInfoTest > shouldDecodePreviousVersion STARTED
org.apache.kafka.streams.processor.internals.assignment.AssignmentInfoTest > shouldDecodePreviousVersion PASSED
org.apache.kafka.streams.processor.internals.assignment.TaskAssignorTest > testStickiness STARTED
org.apache.kafka.streams.processor.internals.assignment.TaskAssignorTest > testStickiness PASSED
org.apache.kafka.streams.processor.internals.assignment.TaskAssignorTest > testAssignWithStandby STARTED
org.apache.kafka.streams.processor.internals.assignment.TaskAssignorTest > testAssignWithStandby PASSED
org.apache.kafka.streams.processor.internals.assignment.TaskAssignorTest > testAssignWithoutStandby STARTED
org.apache.kafka.streams.processor.internals.assignment.TaskAssignorTest > testAssignWithoutStandby PASSED
org.apache.kafka.streams.processor.internals.assignment.SubscriptionInfoTest > testEncodeDecode STARTED
org.apache.kafka.streams.processor.internals.assignment.SubscriptionInfoTest > testEncodeDecode PASSED
org.apache.kafka.streams.processor.internals.assignment.SubscriptionInfoTest > shouldEncodeDecodeWithUserEndPoint STARTED
org.apache.kafka.streams.processor.internals.assignment.SubscriptionInfoTest > shouldEncodeDecodeWithUserEndPoint PASSED
org.apache.kafka.streams.processor.internals.assignment.SubscriptionInfoTest > shouldBeBackwardCompatible STARTED
org.apache.kafka.streams.processor.internals.assignment.SubscriptionInfoTest > shouldBeBackwardCompatible PASSED
org.apache.kafka.streams.processor.internals.MinTimestampTrackerTest > shouldReturnNotKnownTimestampWhenNoRecordsEverAdded STARTED
org.apache.kafka.streams.processor.internals.MinTimestampTrackerTest > shouldReturnNotKnownTimestampWhenNoRecordsEverAdded PASSED
org.apache.kafka.streams.processor.internals.MinTimestampTrackerTest > shouldThrowNullPointerExceptionWhenTryingToAddNullElement STARTED
org.apache.kafka.streams.processor.internals.MinTimestampTrackerTest > shouldThrowNullPointerExceptionWhenTryingToAddNullElement PASSED
org.apache.kafka.streams.processor.internals.MinTimestampTrackerTest > shouldReturnLowestAvailableTimestampFromAllInputs STARTED
org.apache.kafka.streams.processor.internals.MinTimestampTrackerTest > shouldReturnLowestAvailableTimestampFromAllInputs PASSED
org.apache.kafka.streams.processor.internals.MinTimestampTrackerTest > shouldReturnTimestampOfOnlyRecord STARTED
org.apache.kafka.streams.processor.internals.MinTimestampTrackerTest > shouldReturnTimestampOfOnlyRecord PASSED
org.apache.kafka.streams.processor.internals.MinTimestampTrackerTest > shouldReturnLowestAvailableTimestampAfterPreviousLowestRemoved STARTED
org.apache.kafka.streams.processor.internals.MinTimestampTrackerTest > shouldReturnLowestAvailableTimestampAfterPreviousLowestRemoved PASSED
org.apache.kafka.streams.processor.internals.MinTimestampTrackerTest > shouldIgnoreNullRecordOnRemove STARTED
org.apache.kafka.streams.processor.internals.MinTimestampTrackerTest > shouldIgnoreNullRecordOnRemove PASSED
org.apache.kafka.streams.processor.internals.MinTimestampTrackerTest > shouldReturnLastKnownTimestampWhenAllElementsHaveBeenRemoved STARTED
org.apache.kafka.streams.processor.internals.MinTimestampTrackerTest > shouldReturnLastKnownTimestampWhenAllElementsHaveBeenRemoved PASSED
org.apache.kafka.streams.processor.UsePreviousTimeOnInvalidTimestampTest > usePreviousTimeOnInvalidTimestamp STARTED
org.apache.kafka.streams.processor.UsePreviousTimeOnInvalidTimestampTest > usePreviousTimeOnInvalidTimestamp PASSED
org.apache.kafka.streams.processor.UsePreviousTimeOnInvalidTimestampTest > extractMetadataTimestamp STARTED
org.apache.kafka.streams.processor.UsePreviousTimeOnInvalidTimestampTest > extractMetadataTimestamp PASSED
932 tests completed, 2 failed
> Task :streams:test FAILED
FAILURE: Build failed with an exception.
* What went wrong:
Execution failed for task ':streams:test'.
> There were failing tests. See the report at: file://<https://builds.apache.org/job/kafka-0.10.2-jdk7/ws/streams/build/reports/tests/test/index.html>
* Try:
Run with --stacktrace option to get the stack trace. Run with --info or --debug option to get more log output. Run with --scan to get full insights.
* Get more help at https://help.gradle.org
Deprecated Gradle features were used in this build, making it incompatible with Gradle 5.0.
See https://docs.gradle.org/4.8.1/userguide/command_line_interface.html#sec:command_line_warnings
BUILD FAILED in 2h 39m 6s
50 actionable tasks: 31 executed, 19 up-to-date
Build step 'Execute shell' marked build as failure
Recording test results
ERROR: No tool found matching GRADLE_2_4_RC_2_HOME
Setting GRADLE_4_8_1_HOME=/home/jenkins/tools/gradle/4.8.1
ERROR: No tool found matching GRADLE_2_4_RC_2_HOME
Setting GRADLE_4_8_1_HOME=/home/jenkins/tools/gradle/4.8.1
Not sending mail to unregistered user rajinisivaram@googlemail.com
Not sending mail to unregistered user noreply@github.com
Jenkins build is back to normal : kafka-0.10.2-jdk7 #237
Posted by Apache Jenkins Server <je...@builds.apache.org>.
See <https://builds.apache.org/job/kafka-0.10.2-jdk7/237/display/redirect?page=changes>
Build failed in Jenkins: kafka-0.10.2-jdk7 #236
Posted by Apache Jenkins Server <je...@builds.apache.org>.
See <https://builds.apache.org/job/kafka-0.10.2-jdk7/236/display/redirect?page=changes>
Changes:
[me] MINOR: Switch to use AWS spot instances
------------------------------------------
[...truncated 1.33 MB...]
org.apache.kafka.streams.processor.internals.MinTimestampTrackerTest > shouldThrowNullPointerExceptionWhenTryingToAddNullElement STARTED
org.apache.kafka.streams.processor.internals.MinTimestampTrackerTest > shouldThrowNullPointerExceptionWhenTryingToAddNullElement PASSED
org.apache.kafka.streams.processor.internals.MinTimestampTrackerTest > shouldReturnLowestAvailableTimestampFromAllInputs STARTED
org.apache.kafka.streams.processor.internals.MinTimestampTrackerTest > shouldReturnLowestAvailableTimestampFromAllInputs PASSED
org.apache.kafka.streams.processor.internals.MinTimestampTrackerTest > shouldReturnTimestampOfOnlyRecord STARTED
org.apache.kafka.streams.processor.internals.MinTimestampTrackerTest > shouldReturnTimestampOfOnlyRecord PASSED
org.apache.kafka.streams.processor.internals.MinTimestampTrackerTest > shouldReturnLowestAvailableTimestampAfterPreviousLowestRemoved STARTED
org.apache.kafka.streams.processor.internals.MinTimestampTrackerTest > shouldReturnLowestAvailableTimestampAfterPreviousLowestRemoved PASSED
org.apache.kafka.streams.processor.internals.MinTimestampTrackerTest > shouldIgnoreNullRecordOnRemove STARTED
org.apache.kafka.streams.processor.internals.MinTimestampTrackerTest > shouldIgnoreNullRecordOnRemove PASSED
org.apache.kafka.streams.processor.internals.MinTimestampTrackerTest > shouldReturnLastKnownTimestampWhenAllElementsHaveBeenRemoved STARTED
org.apache.kafka.streams.processor.internals.MinTimestampTrackerTest > shouldReturnLastKnownTimestampWhenAllElementsHaveBeenRemoved PASSED
org.apache.kafka.streams.processor.DefaultPartitionGrouperTest > shouldComputeGroupingForSingleGroupWithMultipleTopics STARTED
org.apache.kafka.streams.processor.DefaultPartitionGrouperTest > shouldComputeGroupingForSingleGroupWithMultipleTopics PASSED
org.apache.kafka.streams.processor.DefaultPartitionGrouperTest > shouldNotCreateAnyTasksBecauseOneTopicHasUnknownPartitions STARTED
org.apache.kafka.streams.processor.DefaultPartitionGrouperTest > shouldNotCreateAnyTasksBecauseOneTopicHasUnknownPartitions PASSED
org.apache.kafka.streams.processor.DefaultPartitionGrouperTest > shouldComputeGroupingForTwoGroups STARTED
org.apache.kafka.streams.processor.DefaultPartitionGrouperTest > shouldComputeGroupingForTwoGroups PASSED
org.apache.kafka.streams.processor.LogAndSkipOnInvalidTimestampTest > logAndSkipOnInvalidTimestamp STARTED
org.apache.kafka.streams.processor.LogAndSkipOnInvalidTimestampTest > logAndSkipOnInvalidTimestamp PASSED
org.apache.kafka.streams.processor.LogAndSkipOnInvalidTimestampTest > extractMetadataTimestamp STARTED
org.apache.kafka.streams.processor.LogAndSkipOnInvalidTimestampTest > extractMetadataTimestamp PASSED
org.apache.kafka.streams.processor.TopologyBuilderTest > shouldNotAllowNullProcessorSupplier STARTED
org.apache.kafka.streams.processor.TopologyBuilderTest > shouldNotAllowNullProcessorSupplier PASSED
org.apache.kafka.streams.processor.TopologyBuilderTest > shouldNotSetApplicationIdToNull STARTED
org.apache.kafka.streams.processor.TopologyBuilderTest > shouldNotSetApplicationIdToNull PASSED
org.apache.kafka.streams.processor.TopologyBuilderTest > testSourceTopics STARTED
org.apache.kafka.streams.processor.TopologyBuilderTest > testSourceTopics PASSED
org.apache.kafka.streams.processor.TopologyBuilderTest > shouldNotAllowNullNameWhenAddingSink STARTED
org.apache.kafka.streams.processor.TopologyBuilderTest > shouldNotAllowNullNameWhenAddingSink PASSED
org.apache.kafka.streams.processor.TopologyBuilderTest > testNamedTopicMatchesAlreadyProvidedPattern STARTED
org.apache.kafka.streams.processor.TopologyBuilderTest > testNamedTopicMatchesAlreadyProvidedPattern PASSED
org.apache.kafka.streams.processor.TopologyBuilderTest > shouldAddInternalTopicConfigWithCompactAndDeleteSetForWindowStores STARTED
org.apache.kafka.streams.processor.TopologyBuilderTest > shouldAddInternalTopicConfigWithCompactAndDeleteSetForWindowStores PASSED
org.apache.kafka.streams.processor.TopologyBuilderTest > shouldAddInternalTopicConfigWithCompactForNonWindowStores STARTED
org.apache.kafka.streams.processor.TopologyBuilderTest > shouldAddInternalTopicConfigWithCompactForNonWindowStores PASSED
org.apache.kafka.streams.processor.TopologyBuilderTest > testAddSinkWithSameName STARTED
org.apache.kafka.streams.processor.TopologyBuilderTest > testAddSinkWithSameName PASSED
org.apache.kafka.streams.processor.TopologyBuilderTest > testAddSinkWithSelfParent STARTED
org.apache.kafka.streams.processor.TopologyBuilderTest > testAddSinkWithSelfParent PASSED
org.apache.kafka.streams.processor.TopologyBuilderTest > testAddProcessorWithSelfParent STARTED
org.apache.kafka.streams.processor.TopologyBuilderTest > testAddProcessorWithSelfParent PASSED
org.apache.kafka.streams.processor.TopologyBuilderTest > shouldAssociateStateStoreNameWhenStateStoreSupplierIsInternal STARTED
org.apache.kafka.streams.processor.TopologyBuilderTest > shouldAssociateStateStoreNameWhenStateStoreSupplierIsInternal PASSED
org.apache.kafka.streams.processor.TopologyBuilderTest > testAddStateStoreWithSink STARTED
org.apache.kafka.streams.processor.TopologyBuilderTest > testAddStateStoreWithSink PASSED
org.apache.kafka.streams.processor.TopologyBuilderTest > testTopicGroups STARTED
org.apache.kafka.streams.processor.TopologyBuilderTest > testTopicGroups PASSED
org.apache.kafka.streams.processor.TopologyBuilderTest > testBuild STARTED
org.apache.kafka.streams.processor.TopologyBuilderTest > testBuild PASSED
org.apache.kafka.streams.processor.TopologyBuilderTest > shouldNotAddNullStateStoreSupplier STARTED
org.apache.kafka.streams.processor.TopologyBuilderTest > shouldNotAddNullStateStoreSupplier PASSED
org.apache.kafka.streams.processor.TopologyBuilderTest > shouldNotAllowNullNameWhenAddingSource STARTED
org.apache.kafka.streams.processor.TopologyBuilderTest > shouldNotAllowNullNameWhenAddingSource PASSED
org.apache.kafka.streams.processor.TopologyBuilderTest > shouldNotAllowNullTopicWhenAddingSink STARTED
org.apache.kafka.streams.processor.TopologyBuilderTest > shouldNotAllowNullTopicWhenAddingSink PASSED
org.apache.kafka.streams.processor.TopologyBuilderTest > testAddStateStoreWithSource STARTED
org.apache.kafka.streams.processor.TopologyBuilderTest > testAddStateStoreWithSource PASSED
org.apache.kafka.streams.processor.TopologyBuilderTest > shouldThroughOnUnassignedStateStoreAccess STARTED
org.apache.kafka.streams.processor.TopologyBuilderTest > shouldThroughOnUnassignedStateStoreAccess PASSED
org.apache.kafka.streams.processor.TopologyBuilderTest > shouldNotAllowNullProcessorNameWhenConnectingProcessorAndStateStores STARTED
org.apache.kafka.streams.processor.TopologyBuilderTest > shouldNotAllowNullProcessorNameWhenConnectingProcessorAndStateStores PASSED
org.apache.kafka.streams.processor.TopologyBuilderTest > testAddSourceWithSameName STARTED
org.apache.kafka.streams.processor.TopologyBuilderTest > testAddSourceWithSameName PASSED
org.apache.kafka.streams.processor.TopologyBuilderTest > testAddMoreThanOnePatternSourceNode STARTED
org.apache.kafka.streams.processor.TopologyBuilderTest > testAddMoreThanOnePatternSourceNode PASSED
org.apache.kafka.streams.processor.TopologyBuilderTest > testAddProcessorWithSameName STARTED
org.apache.kafka.streams.processor.TopologyBuilderTest > testAddProcessorWithSameName PASSED
org.apache.kafka.streams.processor.TopologyBuilderTest > shouldSetCorrectSourceNodesWithRegexUpdatedTopics STARTED
org.apache.kafka.streams.processor.TopologyBuilderTest > shouldSetCorrectSourceNodesWithRegexUpdatedTopics PASSED
org.apache.kafka.streams.processor.TopologyBuilderTest > shouldConnectRegexMatchedTopicsToStateStore STARTED
org.apache.kafka.streams.processor.TopologyBuilderTest > shouldConnectRegexMatchedTopicsToStateStore PASSED
org.apache.kafka.streams.processor.TopologyBuilderTest > testAddSourceWithSameTopic STARTED
org.apache.kafka.streams.processor.TopologyBuilderTest > testAddSourceWithSameTopic PASSED
org.apache.kafka.streams.processor.TopologyBuilderTest > testTopicGroupsByStateStore STARTED
org.apache.kafka.streams.processor.TopologyBuilderTest > testTopicGroupsByStateStore PASSED
org.apache.kafka.streams.processor.TopologyBuilderTest > testAddStateStoreWithDuplicates STARTED
org.apache.kafka.streams.processor.TopologyBuilderTest > testAddStateStoreWithDuplicates PASSED
org.apache.kafka.streams.processor.TopologyBuilderTest > testPatternSourceTopic STARTED
org.apache.kafka.streams.processor.TopologyBuilderTest > testPatternSourceTopic PASSED
org.apache.kafka.streams.processor.TopologyBuilderTest > shouldAssociateStateStoreNameWhenStateStoreSupplierIsExternal STARTED
org.apache.kafka.streams.processor.TopologyBuilderTest > shouldAssociateStateStoreNameWhenStateStoreSupplierIsExternal PASSED
org.apache.kafka.streams.processor.TopologyBuilderTest > testAddSinkWithWrongParent STARTED
org.apache.kafka.streams.processor.TopologyBuilderTest > testAddSinkWithWrongParent PASSED
org.apache.kafka.streams.processor.TopologyBuilderTest > testPatternMatchesAlreadyProvidedTopicSource STARTED
org.apache.kafka.streams.processor.TopologyBuilderTest > testPatternMatchesAlreadyProvidedTopicSource PASSED
org.apache.kafka.streams.processor.TopologyBuilderTest > testAddSinkConnectedWithMultipleParent STARTED
org.apache.kafka.streams.processor.TopologyBuilderTest > testAddSinkConnectedWithMultipleParent PASSED
org.apache.kafka.streams.processor.TopologyBuilderTest > testSubscribeTopicNameAndPattern STARTED
org.apache.kafka.streams.processor.TopologyBuilderTest > testSubscribeTopicNameAndPattern PASSED
org.apache.kafka.streams.processor.TopologyBuilderTest > shouldNotAddNullInternalTopic STARTED
org.apache.kafka.streams.processor.TopologyBuilderTest > shouldNotAddNullInternalTopic PASSED
org.apache.kafka.streams.processor.TopologyBuilderTest > testAddProcessorWithWrongParent STARTED
org.apache.kafka.streams.processor.TopologyBuilderTest > testAddProcessorWithWrongParent PASSED
org.apache.kafka.streams.processor.TopologyBuilderTest > shouldNotAllowNullNameWhenAddingProcessor STARTED
org.apache.kafka.streams.processor.TopologyBuilderTest > shouldNotAllowNullNameWhenAddingProcessor PASSED
org.apache.kafka.streams.processor.TopologyBuilderTest > testAddStateStore STARTED
org.apache.kafka.streams.processor.TopologyBuilderTest > testAddStateStore PASSED
org.apache.kafka.streams.processor.TopologyBuilderTest > testAddSinkConnectedWithParent STARTED
org.apache.kafka.streams.processor.TopologyBuilderTest > testAddSinkConnectedWithParent PASSED
org.apache.kafka.streams.processor.TopologyBuilderTest > testAddStateStoreWithNonExistingProcessor STARTED
org.apache.kafka.streams.processor.TopologyBuilderTest > testAddStateStoreWithNonExistingProcessor PASSED
org.apache.kafka.streams.processor.TopologyBuilderTest > shouldAddInternalTopicConfigWithCleanupPolicyDeleteForInternalTopics STARTED
org.apache.kafka.streams.processor.TopologyBuilderTest > shouldAddInternalTopicConfigWithCleanupPolicyDeleteForInternalTopics PASSED
org.apache.kafka.streams.processor.TopologyBuilderTest > shouldCorrectlyMapStateStoreToInternalTopics STARTED
org.apache.kafka.streams.processor.TopologyBuilderTest > shouldCorrectlyMapStateStoreToInternalTopics PASSED
org.apache.kafka.streams.processor.UsePreviousTimeOnInvalidTimestampTest > usePreviousTimeOnInvalidTimestamp STARTED
org.apache.kafka.streams.processor.UsePreviousTimeOnInvalidTimestampTest > usePreviousTimeOnInvalidTimestamp PASSED
org.apache.kafka.streams.processor.UsePreviousTimeOnInvalidTimestampTest > extractMetadataTimestamp STARTED
org.apache.kafka.streams.processor.UsePreviousTimeOnInvalidTimestampTest > extractMetadataTimestamp PASSED
932 tests completed, 2 failed
> Task :streams:test FAILED
FAILURE: Build failed with an exception.
* What went wrong:
Execution failed for task ':streams:test'.
> There were failing tests. See the report at: file://<https://builds.apache.org/job/kafka-0.10.2-jdk7/ws/streams/build/reports/tests/test/index.html>
* Try:
Run with --stacktrace option to get the stack trace. Run with --info or --debug option to get more log output. Run with --scan to get full insights.
* Get more help at https://help.gradle.org
Deprecated Gradle features were used in this build, making it incompatible with Gradle 5.0.
See https://docs.gradle.org/4.8.1/userguide/command_line_interface.html#sec:command_line_warnings
BUILD FAILED in 2h 58m 42s
50 actionable tasks: 30 executed, 20 up-to-date
Build step 'Execute shell' marked build as failure
Recording test results
ERROR: No tool found matching GRADLE_2_4_RC_2_HOME
Setting GRADLE_4_8_1_HOME=/home/jenkins/tools/gradle/4.8.1
ERROR: No tool found matching GRADLE_2_4_RC_2_HOME
Setting GRADLE_4_8_1_HOME=/home/jenkins/tools/gradle/4.8.1
Not sending mail to unregistered user rajinisivaram@googlemail.com
Not sending mail to unregistered user noreply@github.com