You are viewing a plain text version of this content. The canonical link for it is here.
Posted to builds@beam.apache.org by Apache Jenkins Server <je...@builds.apache.org> on 2023/05/18 15:38:28 UTC
beam_PostCommit_Python_Xlang_Gcp_Dataflow - Build # 207 - Aborted!
beam_PostCommit_Python_Xlang_Gcp_Dataflow - Build # 207 - Aborted:
Check console output at https://ci-beam.apache.org/job/beam_PostCommit_Python_Xlang_Gcp_Dataflow/207/ to view the results.
Jenkins build is back to normal : beam_PostCommit_Python_Xlang_Gcp_Dataflow #241
Posted by Apache Jenkins Server <je...@builds.apache.org>.
See <https://ci-beam.apache.org/job/beam_PostCommit_Python_Xlang_Gcp_Dataflow/241/display/redirect>
---------------------------------------------------------------------
To unsubscribe, e-mail: builds-unsubscribe@beam.apache.org
For additional commands, e-mail: builds-help@beam.apache.org
Build failed in Jenkins: beam_PostCommit_Python_Xlang_Gcp_Dataflow #240
Posted by Apache Jenkins Server <je...@builds.apache.org>.
See <https://ci-beam.apache.org/job/beam_PostCommit_Python_Xlang_Gcp_Dataflow/240/display/redirect>
Changes:
------------------------------------------
[...truncated 92.68 KB...]
Collecting numpy
Downloading numpy-1.21.6-cp37-cp37m-manylinux_2_12_x86_64.manylinux2010_x86_64.whl (15.7 MB)
━━━━━━━━━━━━━━━━━━━━━━━━━━━━━━━━━━━━━━━━ 15.7/15.7 MB 33.7 MB/s eta 0:00:00
Installing collected packages: numpy, cython
Successfully installed cython-0.29.35 numpy-1.21.6
Requirement already satisfied: setuptools in /opt/_internal/cpython-3.7.13/lib/python3.7/site-packages (63.4.2)
Collecting setuptools
Downloading setuptools-67.8.0-py3-none-any.whl (1.1 MB)
━━━━━━━━━━━━━━━━━━━━━━━━━━━━━━━━━━━━━━━━ 1.1/1.1 MB 16.5 MB/s eta 0:00:00
Installing collected packages: setuptools
Attempting uninstall: setuptools
Found existing installation: setuptools 63.4.2
Uninstalling setuptools-63.4.2:
Successfully uninstalled setuptools-63.4.2
Successfully installed setuptools-67.8.0
✓ 14.84s
Building wheel...
+ rm -rf /tmp/cibuildwheel/built_wheel
+ mkdir -p /tmp/cibuildwheel/built_wheel
+ python -m pip wheel /project --wheel-dir=/tmp/cibuildwheel/built_wheel --no-deps
[notice] A new release of pip available: 22.2.2 -> 23.1.2
[notice] To update, run: pip install --upgrade pip
Processing /project
Preparing metadata (setup.py): started
Preparing metadata (setup.py): finished with status 'done'
Building wheels for collected packages: apache-beam
Building wheel for apache-beam (setup.py): started
Building wheel for apache-beam (setup.py): still running...
Building wheel for apache-beam (setup.py): still running...
Building wheel for apache-beam (setup.py): still running...
Building wheel for apache-beam (setup.py): finished with status 'done'
Created wheel for apache-beam: filename=apache_beam-2.49.0.dev0-cp37-cp37m-linux_x86_64.whl size=13576754 sha256=6b239468ce4f1bb7df79ee4b6021b7647062ae082b64e25ac577ff49c4987dac
Stored in directory: /tmp/pip-ephem-wheel-cache-z8eh2o4i/wheels/84/ce/ef/3768e7d143f298e3f79dda4c505f7ffa005f429720ee7533a3
Successfully built apache-beam
+ /opt/python/cp38-cp38/bin/python -c 'import sys, json, glob; json.dump(glob.glob('"'"'/tmp/cibuildwheel/built_wheel/*.whl'"'"'), sys.stdout)'
+ rm -rf /tmp/cibuildwheel/repaired_wheel
+ mkdir -p /tmp/cibuildwheel/repaired_wheel
✓ 227.07s
Repairing wheel...
+ sh -c 'auditwheel repair -w /tmp/cibuildwheel/repaired_wheel /tmp/cibuildwheel/built_wheel/apache_beam-2.49.0.dev0-cp37-cp37m-linux_x86_64.whl'
INFO:auditwheel.main_repair:Repairing apache_beam-2.49.0.dev0-cp37-cp37m-linux_x86_64.whl
INFO:auditwheel.wheeltools:Previous filename tags: linux_x86_64
INFO:auditwheel.wheeltools:New filename tags: manylinux_2_17_x86_64, manylinux2014_x86_64
INFO:auditwheel.wheeltools:Previous WHEEL info tags: cp37-cp37m-linux_x86_64
INFO:auditwheel.wheeltools:New WHEEL info tags: cp37-cp37m-manylinux_2_17_x86_64, cp37-cp37m-manylinux2014_x86_64
INFO:auditwheel.main_repair:
Fixed-up wheel written to /tmp/cibuildwheel/repaired_wheel/apache_beam-2.49.0.dev0-cp37-cp37m-manylinux_2_17_x86_64.manylinux2014_x86_64.whl
+ /opt/python/cp38-cp38/bin/python -c 'import sys, json, glob; json.dump(glob.glob('"'"'/tmp/cibuildwheel/repaired_wheel/*.whl'"'"'), sys.stdout)'
+ mkdir -p /output
+ mv /tmp/cibuildwheel/repaired_wheel/apache_beam-2.49.0.dev0-cp37-cp37m-manylinux_2_17_x86_64.manylinux2014_x86_64.whl /output
✓ 7.89s
✓ cp37-manylinux_x86_64 finished in 250.67s
Copying wheels back to host...
✓ 0.16s
1 wheels produced in 5 minutes:
apache_beam-2.49.0.dev0-cp37-cp37m-manylinux_2_17_x86_64.manylinux2014_x86_64.whl 13,275 kB
> Task :sdks:python:test-suites:dataflow:py37:initializeForDataflowJob
> Task :sdks:python:bdistPy311linux
Requirement already satisfied: cibuildwheel==2.9.0 in <https://ci-beam.apache.org/job/beam_PostCommit_Python_Xlang_Gcp_Dataflow/ws/src/build/gradleenv/1922375555/lib/python3.8/site-packages> (2.9.0)
Requirement already satisfied: bashlex!=0.13 in <https://ci-beam.apache.org/job/beam_PostCommit_Python_Xlang_Gcp_Dataflow/ws/src/build/gradleenv/1922375555/lib/python3.8/site-packages> (from cibuildwheel==2.9.0) (0.18)
Requirement already satisfied: bracex in <https://ci-beam.apache.org/job/beam_PostCommit_Python_Xlang_Gcp_Dataflow/ws/src/build/gradleenv/1922375555/lib/python3.8/site-packages> (from cibuildwheel==2.9.0) (2.3.post1)
Requirement already satisfied: certifi in <https://ci-beam.apache.org/job/beam_PostCommit_Python_Xlang_Gcp_Dataflow/ws/src/build/gradleenv/1922375555/lib/python3.8/site-packages> (from cibuildwheel==2.9.0) (2023.5.7)
Requirement already satisfied: filelock in <https://ci-beam.apache.org/job/beam_PostCommit_Python_Xlang_Gcp_Dataflow/ws/src/build/gradleenv/1922375555/lib/python3.8/site-packages> (from cibuildwheel==2.9.0) (3.12.0)
Requirement already satisfied: packaging>=20.9 in <https://ci-beam.apache.org/job/beam_PostCommit_Python_Xlang_Gcp_Dataflow/ws/src/build/gradleenv/1922375555/lib/python3.8/site-packages> (from cibuildwheel==2.9.0) (23.1)
Requirement already satisfied: platformdirs in <https://ci-beam.apache.org/job/beam_PostCommit_Python_Xlang_Gcp_Dataflow/ws/src/build/gradleenv/1922375555/lib/python3.8/site-packages> (from cibuildwheel==2.9.0) (3.5.1)
Requirement already satisfied: tomli in <https://ci-beam.apache.org/job/beam_PostCommit_Python_Xlang_Gcp_Dataflow/ws/src/build/gradleenv/1922375555/lib/python3.8/site-packages> (from cibuildwheel==2.9.0) (2.0.1)
cp311-manylinux_x86_64
_ _ _ _ _ _ _
___|_| |_ _ _|_| |_| |_ _ _| |_ ___ ___| |
| _| | . | | | | | . | | | | | -_| -_| |
|___|_|___|___|_|_|___|_____|_|_|___|___|_|
cibuildwheel version 2.9.0
Build options:
platform: 'linux'
architectures: {<Architecture.i686: 'i686'>, <Architecture.x86_64: 'x86_64'>}
build_selector: {'build_config': 'cp311-manylinux_*64*', 'skip_config': '', 'requires_python': None, 'prerelease_pythons': False}
container_engine: 'docker'
output_dir: PosixPath('<https://ci-beam.apache.org/job/beam_PostCommit_Python_Xlang_Gcp_Dataflow/ws/src/sdks/python/build')>
package_dir: PosixPath('<https://ci-beam.apache.org/job/beam_PostCommit_Python_Xlang_Gcp_Dataflow/ws/src/sdks/python')>
test_selector: {'skip_config': ''}
before_all: ''
before_build: 'pip install cython numpy && pip install --upgrade setuptools'
before_test: ''
build_frontend: 'pip'
build_verbosity: 0
dependency_constraints: DependencyConstraints(PosixPath('<https://ci-beam.apache.org/job/beam_PostCommit_Python_Xlang_Gcp_Dataflow/ws/src/build/gradleenv/1922375555/lib/python3.8/site-packages/cibuildwheel/resources/constraints.txt'))>
environment: {'assignments': [SETUPTOOLS_USE_DISTUTILS=stdlib]}
cp311-manylinux_x86_64: ParsedEnvironment(['SETUPTOOLS_USE_DISTUTILS=stdlib'])
manylinux_images: {'x86_64': 'quay.io/pypa/manylinux2014_x86_64:2022-08-09-51a01be', 'i686': 'quay.io/pypa/manylinux2014_i686:2022-08-09-51a01be', 'pypy_x86_64': 'quay.io/pypa/manylinux2014_x86_64:2022-08-09-51a01be', 'aarch64': 'quay.io/pypa/manylinux2014_aarch64:2022-08-09-51a01be', 'ppc64le': 'quay.io/pypa/manylinux2014_ppc64le:2022-08-09-51a01be', 's390x': 'quay.io/pypa/manylinux2014_s390x:2022-08-09-51a01be', 'pypy_aarch64': 'quay.io/pypa/manylinux2014_aarch64:2022-08-09-51a01be', 'pypy_i686': 'quay.io/pypa/manylinux2014_i686:2022-08-09-51a01be'}
musllinux_images: {'x86_64': 'quay.io/pypa/musllinux_1_1_x86_64:2022-08-09-51a01be', 'i686': 'quay.io/pypa/musllinux_1_1_i686:2022-08-09-51a01be', 'aarch64': 'quay.io/pypa/musllinux_1_1_aarch64:2022-08-09-51a01be', 'ppc64le': 'quay.io/pypa/musllinux_1_1_ppc64le:2022-08-09-51a01be', 's390x': 'quay.io/pypa/musllinux_1_1_s390x:2022-08-09-51a01be'}
repair_command: 'auditwheel repair -w {dest_dir} {wheel}'
test_command: ''
test_extras: ''
test_requires: []
Cache folder: /home/jenkins/.cache/cibuildwheel
Here we go!
Starting container image quay.io/pypa/manylinux2014_x86_64:2022-08-09-51a01be...
info: This container will host the build for cp311-manylinux_x86_64...
d4268bb727c4c579b824cb92665f8b378e6e83e347168b742b7f778eb426855c
+ /bin/true
+ mkdir -p /project
✓ 0.46s
Copying project into container...
+ mkdir -p /project
✓ 0.26s
Building cp311-manylinux_x86_64 wheel
CPython 3.11 manylinux x86_64
Setting up build environment...
+ /opt/python/cp38-cp38/bin/python -c 'import sys, json, os; json.dump(os.environ.copy(), sys.stdout)'
+ which python
+ which pip
✓ 0.13s
Running before_build...
+ sh -c 'pip install cython numpy && pip install --upgrade setuptools'
WARNING: Running pip as the 'root' user can result in broken permissions and conflicting behaviour with the system package manager. It is recommended to use a virtual environment instead: https://pip.pypa.io/warnings/venv
[notice] A new release of pip available: 22.2.2 -> 23.1.2
[notice] To update, run: python -m pip install --upgrade pip
WARNING: Running pip as the 'root' user can result in broken permissions and conflicting behaviour with the system package manager. It is recommended to use a virtual environment instead: https://pip.pypa.io/warnings/venv
[notice] A new release of pip available: 22.2.2 -> 23.1.2
[notice] To update, run: python -m pip install --upgrade pip
Collecting cython
Downloading Cython-0.29.35-cp311-cp311-manylinux_2_17_x86_64.manylinux2014_x86_64.manylinux_2_24_x86_64.whl (1.9 MB)
━━━━━━━━━━━━━━━━━━━━━━━━━━━━━━━━━━━━━━━━ 1.9/1.9 MB 24.4 MB/s eta 0:00:00
Collecting numpy
Downloading numpy-1.24.3-cp311-cp311-manylinux_2_17_x86_64.manylinux2014_x86_64.whl (17.3 MB)
━━━━━━━━━━━━━━━━━━━━━━━━━━━━━━━━━━━━━━━━ 17.3/17.3 MB 46.9 MB/s eta 0:00:00
Installing collected packages: numpy, cython
Successfully installed cython-0.29.35 numpy-1.24.3
Requirement already satisfied: setuptools in /opt/_internal/cpython-3.11.0rc1/lib/python3.11/site-packages (63.4.2)
Collecting setuptools
Downloading setuptools-67.8.0-py3-none-any.whl (1.1 MB)
━━━━━━━━━━━━━━━━━━━━━━━━━━━━━━━━━━━━━━━━ 1.1/1.1 MB 15.2 MB/s eta 0:00:00
Installing collected packages: setuptools
Attempting uninstall: setuptools
Found existing installation: setuptools 63.4.2
Uninstalling setuptools-63.4.2:
Successfully uninstalled setuptools-63.4.2
Successfully installed setuptools-67.8.0
✓ 13.12s
Building wheel...
+ rm -rf /tmp/cibuildwheel/built_wheel
+ mkdir -p /tmp/cibuildwheel/built_wheel
+ python -m pip wheel /project --wheel-dir=/tmp/cibuildwheel/built_wheel --no-deps
[notice] A new release of pip available: 22.2.2 -> 23.1.2
[notice] To update, run: pip install --upgrade pip
Processing /project
Preparing metadata (setup.py): started
Preparing metadata (setup.py): finished with status 'done'
Building wheels for collected packages: apache-beam
Building wheel for apache-beam (setup.py): started
Building wheel for apache-beam (setup.py): still running...
Building wheel for apache-beam (setup.py): still running...
Building wheel for apache-beam (setup.py): still running...
Building wheel for apache-beam (setup.py): finished with status 'done'
Created wheel for apache-beam: filename=apache_beam-2.49.0.dev0-cp311-cp311-linux_x86_64.whl size=15468913 sha256=80f21c88d9bee83c48595487c4d7e8cb6219cd7c7abc02d1a1f41d805a1eb1c1
Stored in directory: /tmp/pip-ephem-wheel-cache-wdzqa89y/wheels/aa/0c/49/7c4d39428e78274ff9f1db5b9c539aa0d6bd6becda70207fa7
Successfully built apache-beam
+ /opt/python/cp38-cp38/bin/python -c 'import sys, json, glob; json.dump(glob.glob('"'"'/tmp/cibuildwheel/built_wheel/*.whl'"'"'), sys.stdout)'
+ rm -rf /tmp/cibuildwheel/repaired_wheel
+ mkdir -p /tmp/cibuildwheel/repaired_wheel
✓ 216.47s
Repairing wheel...
+ sh -c 'auditwheel repair -w /tmp/cibuildwheel/repaired_wheel /tmp/cibuildwheel/built_wheel/apache_beam-2.49.0.dev0-cp311-cp311-linux_x86_64.whl'
INFO:auditwheel.main_repair:Repairing apache_beam-2.49.0.dev0-cp311-cp311-linux_x86_64.whl
INFO:auditwheel.wheeltools:Previous filename tags: linux_x86_64
INFO:auditwheel.wheeltools:New filename tags: manylinux_2_17_x86_64, manylinux2014_x86_64
INFO:auditwheel.wheeltools:Previous WHEEL info tags: cp311-cp311-linux_x86_64
INFO:auditwheel.wheeltools:New WHEEL info tags: cp311-cp311-manylinux_2_17_x86_64, cp311-cp311-manylinux2014_x86_64
INFO:auditwheel.main_repair:
Fixed-up wheel written to /tmp/cibuildwheel/repaired_wheel/apache_beam-2.49.0.dev0-cp311-cp311-manylinux_2_17_x86_64.manylinux2014_x86_64.whl
+ /opt/python/cp38-cp38/bin/python -c 'import sys, json, glob; json.dump(glob.glob('"'"'/tmp/cibuildwheel/repaired_wheel/*.whl'"'"'), sys.stdout)'
+ mkdir -p /output
+ mv /tmp/cibuildwheel/repaired_wheel/apache_beam-2.49.0.dev0-cp311-cp311-manylinux_2_17_x86_64.manylinux2014_x86_64.whl /output
✓ 6.18s
✓ cp311-manylinux_x86_64 finished in 236.03s
Copying wheels back to host...
✓ 0.17s
1 wheels produced in 4 minutes:
apache_beam-2.49.0.dev0-cp311-cp311-manylinux_2_17_x86_64.manylinux2014_x86_64.whl 15,123 kB
> Task :sdks:python:test-suites:dataflow:py311:initializeForDataflowJob
FAILURE: Build failed with an exception.
* What went wrong:
Execution failed for task ':sdks:java:container:pullLicenses'.
> Process 'command './license_scripts/license_script.sh'' finished with non-zero exit value 1
* Try:
> Run with --stacktrace option to get the stack trace.
> Run with --info or --debug option to get more log output.
* Get more help at https://help.gradle.org
Deprecated Gradle features were used in this build, making it incompatible with Gradle 8.0.
You can use '--warning-mode all' to show the individual deprecation warnings and determine if they come from your own scripts or plugins.
See https://docs.gradle.org/7.5.1/userguide/command_line_interface.html#sec:command_line_warnings
Execution optimizations have been disabled for 1 invalid unit(s) of work during this build to ensure correctness.
Please consult deprecation warnings for more details.
BUILD FAILED in 10m 9s
110 actionable tasks: 75 executed, 31 from cache, 4 up-to-date
Publishing build scan...
https://ge.apache.org/s/ejyyyluqor25e
Build step 'Invoke Gradle script' changed build result to FAILURE
Build step 'Invoke Gradle script' marked build as failure
---------------------------------------------------------------------
To unsubscribe, e-mail: builds-unsubscribe@beam.apache.org
For additional commands, e-mail: builds-help@beam.apache.org
beam_PostCommit_Python_Xlang_Gcp_Dataflow - Build # 239 - Aborted!
Posted by Apache Jenkins Server <je...@builds.apache.org>.
beam_PostCommit_Python_Xlang_Gcp_Dataflow - Build # 239 - Aborted:
Check console output at https://ci-beam.apache.org/job/beam_PostCommit_Python_Xlang_Gcp_Dataflow/239/ to view the results.
beam_PostCommit_Python_Xlang_Gcp_Dataflow - Build # 238 - Aborted!
Posted by Apache Jenkins Server <je...@builds.apache.org>.
beam_PostCommit_Python_Xlang_Gcp_Dataflow - Build # 238 - Aborted:
Check console output at https://ci-beam.apache.org/job/beam_PostCommit_Python_Xlang_Gcp_Dataflow/238/ to view the results.
beam_PostCommit_Python_Xlang_Gcp_Dataflow - Build # 237 - Aborted!
Posted by Apache Jenkins Server <je...@builds.apache.org>.
beam_PostCommit_Python_Xlang_Gcp_Dataflow - Build # 237 - Aborted:
Check console output at https://ci-beam.apache.org/job/beam_PostCommit_Python_Xlang_Gcp_Dataflow/237/ to view the results.
Build failed in Jenkins: beam_PostCommit_Python_Xlang_Gcp_Dataflow #236
Posted by Apache Jenkins Server <je...@builds.apache.org>.
See <https://ci-beam.apache.org/job/beam_PostCommit_Python_Xlang_Gcp_Dataflow/236/display/redirect>
Changes:
------------------------------------------
[...truncated 144.28 KB...]
Collecting numpy
Downloading numpy-1.21.6-cp37-cp37m-manylinux_2_12_x86_64.manylinux2010_x86_64.whl (15.7 MB)
━━━━━━━━━━━━━━━━━━━━━━━━━━━━━━━━━━━━━━━━ 15.7/15.7 MB 55.5 MB/s eta 0:00:00
Installing collected packages: numpy, cython
Successfully installed cython-0.29.35 numpy-1.21.6
Requirement already satisfied: setuptools in /opt/_internal/cpython-3.7.13/lib/python3.7/site-packages (63.4.2)
Collecting setuptools
Downloading setuptools-67.8.0-py3-none-any.whl (1.1 MB)
━━━━━━━━━━━━━━━━━━━━━━━━━━━━━━━━━━━━━━━━ 1.1/1.1 MB 16.8 MB/s eta 0:00:00
Installing collected packages: setuptools
Attempting uninstall: setuptools
Found existing installation: setuptools 63.4.2
Uninstalling setuptools-63.4.2:
Successfully uninstalled setuptools-63.4.2
Successfully installed setuptools-67.8.0
✓ 10.05s
Building wheel...
+ rm -rf /tmp/cibuildwheel/built_wheel
+ mkdir -p /tmp/cibuildwheel/built_wheel
+ python -m pip wheel /project --wheel-dir=/tmp/cibuildwheel/built_wheel --no-deps
[notice] A new release of pip available: 22.2.2 -> 23.1.2
[notice] To update, run: pip install --upgrade pip
Processing /project
Preparing metadata (setup.py): started
Preparing metadata (setup.py): finished with status 'done'
Building wheels for collected packages: apache-beam
Building wheel for apache-beam (setup.py): started
Building wheel for apache-beam (setup.py): still running...
Building wheel for apache-beam (setup.py): still running...
Building wheel for apache-beam (setup.py): still running...
Building wheel for apache-beam (setup.py): finished with status 'done'
Created wheel for apache-beam: filename=apache_beam-2.49.0.dev0-cp37-cp37m-linux_x86_64.whl size=13576754 sha256=af350aedb9a59223a1877bc95e4dd5b854503ccf561b8afe95ae43551e188d17
Stored in directory: /tmp/pip-ephem-wheel-cache-iou38rm3/wheels/84/ce/ef/3768e7d143f298e3f79dda4c505f7ffa005f429720ee7533a3
Successfully built apache-beam
+ /opt/python/cp38-cp38/bin/python -c 'import sys, json, glob; json.dump(glob.glob('"'"'/tmp/cibuildwheel/built_wheel/*.whl'"'"'), sys.stdout)'
+ rm -rf /tmp/cibuildwheel/repaired_wheel
+ mkdir -p /tmp/cibuildwheel/repaired_wheel
✓ 235.72s
Repairing wheel...
+ sh -c 'auditwheel repair -w /tmp/cibuildwheel/repaired_wheel /tmp/cibuildwheel/built_wheel/apache_beam-2.49.0.dev0-cp37-cp37m-linux_x86_64.whl'
INFO:auditwheel.main_repair:Repairing apache_beam-2.49.0.dev0-cp37-cp37m-linux_x86_64.whl
INFO:auditwheel.wheeltools:Previous filename tags: linux_x86_64
INFO:auditwheel.wheeltools:New filename tags: manylinux_2_17_x86_64, manylinux2014_x86_64
INFO:auditwheel.wheeltools:Previous WHEEL info tags: cp37-cp37m-linux_x86_64
INFO:auditwheel.wheeltools:New WHEEL info tags: cp37-cp37m-manylinux_2_17_x86_64, cp37-cp37m-manylinux2014_x86_64
INFO:auditwheel.main_repair:
Fixed-up wheel written to /tmp/cibuildwheel/repaired_wheel/apache_beam-2.49.0.dev0-cp37-cp37m-manylinux_2_17_x86_64.manylinux2014_x86_64.whl
+ /opt/python/cp38-cp38/bin/python -c 'import sys, json, glob; json.dump(glob.glob('"'"'/tmp/cibuildwheel/repaired_wheel/*.whl'"'"'), sys.stdout)'
+ mkdir -p /output
+ mv /tmp/cibuildwheel/repaired_wheel/apache_beam-2.49.0.dev0-cp37-cp37m-manylinux_2_17_x86_64.manylinux2014_x86_64.whl /output
✓ 5.77s
✓ cp37-manylinux_x86_64 finished in 251.82s
Copying wheels back to host...
✓ 0.16s
1 wheels produced in 5 minutes:
apache_beam-2.49.0.dev0-cp37-cp37m-manylinux_2_17_x86_64.manylinux2014_x86_64.whl 13,275 kB
> Task :sdks:python:test-suites:dataflow:py37:initializeForDataflowJob
> Task :sdks:python:bdistPy311linux
Requirement already satisfied: cibuildwheel==2.9.0 in <https://ci-beam.apache.org/job/beam_PostCommit_Python_Xlang_Gcp_Dataflow/ws/src/build/gradleenv/1922375555/lib/python3.8/site-packages> (2.9.0)
Requirement already satisfied: bashlex!=0.13 in <https://ci-beam.apache.org/job/beam_PostCommit_Python_Xlang_Gcp_Dataflow/ws/src/build/gradleenv/1922375555/lib/python3.8/site-packages> (from cibuildwheel==2.9.0) (0.18)
Requirement already satisfied: bracex in <https://ci-beam.apache.org/job/beam_PostCommit_Python_Xlang_Gcp_Dataflow/ws/src/build/gradleenv/1922375555/lib/python3.8/site-packages> (from cibuildwheel==2.9.0) (2.3.post1)
Requirement already satisfied: certifi in <https://ci-beam.apache.org/job/beam_PostCommit_Python_Xlang_Gcp_Dataflow/ws/src/build/gradleenv/1922375555/lib/python3.8/site-packages> (from cibuildwheel==2.9.0) (2023.5.7)
Requirement already satisfied: filelock in <https://ci-beam.apache.org/job/beam_PostCommit_Python_Xlang_Gcp_Dataflow/ws/src/build/gradleenv/1922375555/lib/python3.8/site-packages> (from cibuildwheel==2.9.0) (3.12.0)
Requirement already satisfied: packaging>=20.9 in <https://ci-beam.apache.org/job/beam_PostCommit_Python_Xlang_Gcp_Dataflow/ws/src/build/gradleenv/1922375555/lib/python3.8/site-packages> (from cibuildwheel==2.9.0) (23.1)
Requirement already satisfied: platformdirs in <https://ci-beam.apache.org/job/beam_PostCommit_Python_Xlang_Gcp_Dataflow/ws/src/build/gradleenv/1922375555/lib/python3.8/site-packages> (from cibuildwheel==2.9.0) (3.5.1)
Requirement already satisfied: tomli in <https://ci-beam.apache.org/job/beam_PostCommit_Python_Xlang_Gcp_Dataflow/ws/src/build/gradleenv/1922375555/lib/python3.8/site-packages> (from cibuildwheel==2.9.0) (2.0.1)
cp311-manylinux_x86_64
_ _ _ _ _ _ _
___|_| |_ _ _|_| |_| |_ _ _| |_ ___ ___| |
| _| | . | | | | | . | | | | | -_| -_| |
|___|_|___|___|_|_|___|_____|_|_|___|___|_|
cibuildwheel version 2.9.0
Build options:
platform: 'linux'
architectures: {<Architecture.x86_64: 'x86_64'>, <Architecture.i686: 'i686'>}
build_selector: {'build_config': 'cp311-manylinux_*64*', 'skip_config': '', 'requires_python': None, 'prerelease_pythons': False}
container_engine: 'docker'
output_dir: PosixPath('<https://ci-beam.apache.org/job/beam_PostCommit_Python_Xlang_Gcp_Dataflow/ws/src/sdks/python/build')>
package_dir: PosixPath('<https://ci-beam.apache.org/job/beam_PostCommit_Python_Xlang_Gcp_Dataflow/ws/src/sdks/python')>
test_selector: {'skip_config': ''}
before_all: ''
before_build: 'pip install cython numpy && pip install --upgrade setuptools'
before_test: ''
build_frontend: 'pip'
build_verbosity: 0
dependency_constraints: DependencyConstraints(PosixPath('<https://ci-beam.apache.org/job/beam_PostCommit_Python_Xlang_Gcp_Dataflow/ws/src/build/gradleenv/1922375555/lib/python3.8/site-packages/cibuildwheel/resources/constraints.txt'))>
environment: {'assignments': [SETUPTOOLS_USE_DISTUTILS=stdlib]}
cp311-manylinux_x86_64: ParsedEnvironment(['SETUPTOOLS_USE_DISTUTILS=stdlib'])
manylinux_images: {'x86_64': 'quay.io/pypa/manylinux2014_x86_64:2022-08-09-51a01be', 'i686': 'quay.io/pypa/manylinux2014_i686:2022-08-09-51a01be', 'pypy_x86_64': 'quay.io/pypa/manylinux2014_x86_64:2022-08-09-51a01be', 'aarch64': 'quay.io/pypa/manylinux2014_aarch64:2022-08-09-51a01be', 'ppc64le': 'quay.io/pypa/manylinux2014_ppc64le:2022-08-09-51a01be', 's390x': 'quay.io/pypa/manylinux2014_s390x:2022-08-09-51a01be', 'pypy_aarch64': 'quay.io/pypa/manylinux2014_aarch64:2022-08-09-51a01be', 'pypy_i686': 'quay.io/pypa/manylinux2014_i686:2022-08-09-51a01be'}
musllinux_images: {'x86_64': 'quay.io/pypa/musllinux_1_1_x86_64:2022-08-09-51a01be', 'i686': 'quay.io/pypa/musllinux_1_1_i686:2022-08-09-51a01be', 'aarch64': 'quay.io/pypa/musllinux_1_1_aarch64:2022-08-09-51a01be', 'ppc64le': 'quay.io/pypa/musllinux_1_1_ppc64le:2022-08-09-51a01be', 's390x': 'quay.io/pypa/musllinux_1_1_s390x:2022-08-09-51a01be'}
repair_command: 'auditwheel repair -w {dest_dir} {wheel}'
test_command: ''
test_extras: ''
test_requires: []
Cache folder: /home/jenkins/.cache/cibuildwheel
Here we go!
Starting container image quay.io/pypa/manylinux2014_x86_64:2022-08-09-51a01be...
info: This container will host the build for cp311-manylinux_x86_64...
8cf8f14803cc3c2acbe80176944a0c89f2817405580bc48148779f524dca8345
+ /bin/true
+ mkdir -p /project
✓ 0.49s
Copying project into container...
+ mkdir -p /project
✓ 0.28s
Building cp311-manylinux_x86_64 wheel
CPython 3.11 manylinux x86_64
Setting up build environment...
+ /opt/python/cp38-cp38/bin/python -c 'import sys, json, os; json.dump(os.environ.copy(), sys.stdout)'
+ which python
+ which pip
✓ 0.15s
Running before_build...
+ sh -c 'pip install cython numpy && pip install --upgrade setuptools'
WARNING: Running pip as the 'root' user can result in broken permissions and conflicting behaviour with the system package manager. It is recommended to use a virtual environment instead: https://pip.pypa.io/warnings/venv
[notice] A new release of pip available: 22.2.2 -> 23.1.2
[notice] To update, run: python -m pip install --upgrade pip
WARNING: Running pip as the 'root' user can result in broken permissions and conflicting behaviour with the system package manager. It is recommended to use a virtual environment instead: https://pip.pypa.io/warnings/venv
[notice] A new release of pip available: 22.2.2 -> 23.1.2
[notice] To update, run: python -m pip install --upgrade pip
Collecting cython
Downloading Cython-0.29.35-cp311-cp311-manylinux_2_17_x86_64.manylinux2014_x86_64.manylinux_2_24_x86_64.whl (1.9 MB)
━━━━━━━━━━━━━━━━━━━━━━━━━━━━━━━━━━━━━━━━ 1.9/1.9 MB 24.7 MB/s eta 0:00:00
Collecting numpy
Downloading numpy-1.24.3-cp311-cp311-manylinux_2_17_x86_64.manylinux2014_x86_64.whl (17.3 MB)
━━━━━━━━━━━━━━━━━━━━━━━━━━━━━━━━━━━━━━━━ 17.3/17.3 MB 67.3 MB/s eta 0:00:00
Installing collected packages: numpy, cython
Successfully installed cython-0.29.35 numpy-1.24.3
Requirement already satisfied: setuptools in /opt/_internal/cpython-3.11.0rc1/lib/python3.11/site-packages (63.4.2)
Collecting setuptools
Downloading setuptools-67.8.0-py3-none-any.whl (1.1 MB)
━━━━━━━━━━━━━━━━━━━━━━━━━━━━━━━━━━━━━━━━ 1.1/1.1 MB 16.6 MB/s eta 0:00:00
Installing collected packages: setuptools
Attempting uninstall: setuptools
Found existing installation: setuptools 63.4.2
Uninstalling setuptools-63.4.2:
Successfully uninstalled setuptools-63.4.2
Successfully installed setuptools-67.8.0
✓ 11.16s
Building wheel...
+ rm -rf /tmp/cibuildwheel/built_wheel
+ mkdir -p /tmp/cibuildwheel/built_wheel
+ python -m pip wheel /project --wheel-dir=/tmp/cibuildwheel/built_wheel --no-deps
[notice] A new release of pip available: 22.2.2 -> 23.1.2
[notice] To update, run: pip install --upgrade pip
Processing /project
Preparing metadata (setup.py): started
Preparing metadata (setup.py): finished with status 'done'
Building wheels for collected packages: apache-beam
Building wheel for apache-beam (setup.py): started
Building wheel for apache-beam (setup.py): still running...
Building wheel for apache-beam (setup.py): still running...
Building wheel for apache-beam (setup.py): still running...
Building wheel for apache-beam (setup.py): finished with status 'done'
Created wheel for apache-beam: filename=apache_beam-2.49.0.dev0-cp311-cp311-linux_x86_64.whl size=15468913 sha256=16baec1d654883ad47f843b07fd4a8ffffdf2fbd04a899f15206cf4bbe8c3f94
Stored in directory: /tmp/pip-ephem-wheel-cache-2vx8g_nu/wheels/aa/0c/49/7c4d39428e78274ff9f1db5b9c539aa0d6bd6becda70207fa7
Successfully built apache-beam
+ /opt/python/cp38-cp38/bin/python -c 'import sys, json, glob; json.dump(glob.glob('"'"'/tmp/cibuildwheel/built_wheel/*.whl'"'"'), sys.stdout)'
+ rm -rf /tmp/cibuildwheel/repaired_wheel
+ mkdir -p /tmp/cibuildwheel/repaired_wheel
✓ 230.13s
Repairing wheel...
+ sh -c 'auditwheel repair -w /tmp/cibuildwheel/repaired_wheel /tmp/cibuildwheel/built_wheel/apache_beam-2.49.0.dev0-cp311-cp311-linux_x86_64.whl'
INFO:auditwheel.main_repair:Repairing apache_beam-2.49.0.dev0-cp311-cp311-linux_x86_64.whl
INFO:auditwheel.wheeltools:Previous filename tags: linux_x86_64
INFO:auditwheel.wheeltools:New filename tags: manylinux_2_17_x86_64, manylinux2014_x86_64
INFO:auditwheel.wheeltools:Previous WHEEL info tags: cp311-cp311-linux_x86_64
INFO:auditwheel.wheeltools:New WHEEL info tags: cp311-cp311-manylinux_2_17_x86_64, cp311-cp311-manylinux2014_x86_64
INFO:auditwheel.main_repair:
Fixed-up wheel written to /tmp/cibuildwheel/repaired_wheel/apache_beam-2.49.0.dev0-cp311-cp311-manylinux_2_17_x86_64.manylinux2014_x86_64.whl
+ /opt/python/cp38-cp38/bin/python -c 'import sys, json, glob; json.dump(glob.glob('"'"'/tmp/cibuildwheel/repaired_wheel/*.whl'"'"'), sys.stdout)'
+ mkdir -p /output
+ mv /tmp/cibuildwheel/repaired_wheel/apache_beam-2.49.0.dev0-cp311-cp311-manylinux_2_17_x86_64.manylinux2014_x86_64.whl /output
✓ 6.26s
✓ cp311-manylinux_x86_64 finished in 247.82s
Copying wheels back to host...
✓ 0.16s
1 wheels produced in 4 minutes:
apache_beam-2.49.0.dev0-cp311-cp311-manylinux_2_17_x86_64.manylinux2014_x86_64.whl 15,123 kB
> Task :sdks:python:test-suites:dataflow:py311:initializeForDataflowJob
FAILURE: Build failed with an exception.
* What went wrong:
Execution failed for task ':sdks:java:container:pullLicenses'.
> Process 'command './license_scripts/license_script.sh'' finished with non-zero exit value 1
* Try:
> Run with --stacktrace option to get the stack trace.
> Run with --info or --debug option to get more log output.
* Get more help at https://help.gradle.org
Deprecated Gradle features were used in this build, making it incompatible with Gradle 8.0.
You can use '--warning-mode all' to show the individual deprecation warnings and determine if they come from your own scripts or plugins.
See https://docs.gradle.org/7.5.1/userguide/command_line_interface.html#sec:command_line_warnings
Execution optimizations have been disabled for 1 invalid unit(s) of work during this build to ensure correctness.
Please consult deprecation warnings for more details.
BUILD FAILED in 10m 51s
110 actionable tasks: 75 executed, 31 from cache, 4 up-to-date
Publishing build scan...
https://ge.apache.org/s/izq4gfrzefwq6
Build step 'Invoke Gradle script' changed build result to FAILURE
Build step 'Invoke Gradle script' marked build as failure
---------------------------------------------------------------------
To unsubscribe, e-mail: builds-unsubscribe@beam.apache.org
For additional commands, e-mail: builds-help@beam.apache.org
beam_PostCommit_Python_Xlang_Gcp_Dataflow - Build # 235 - Aborted!
Posted by Apache Jenkins Server <je...@builds.apache.org>.
beam_PostCommit_Python_Xlang_Gcp_Dataflow - Build # 235 - Aborted:
Check console output at https://ci-beam.apache.org/job/beam_PostCommit_Python_Xlang_Gcp_Dataflow/235/ to view the results.
beam_PostCommit_Python_Xlang_Gcp_Dataflow - Build # 234 - Aborted!
Posted by Apache Jenkins Server <je...@builds.apache.org>.
beam_PostCommit_Python_Xlang_Gcp_Dataflow - Build # 234 - Aborted:
Check console output at https://ci-beam.apache.org/job/beam_PostCommit_Python_Xlang_Gcp_Dataflow/234/ to view the results.
beam_PostCommit_Python_Xlang_Gcp_Dataflow - Build # 233 - Aborted!
Posted by Apache Jenkins Server <je...@builds.apache.org>.
beam_PostCommit_Python_Xlang_Gcp_Dataflow - Build # 233 - Aborted:
Check console output at https://ci-beam.apache.org/job/beam_PostCommit_Python_Xlang_Gcp_Dataflow/233/ to view the results.
beam_PostCommit_Python_Xlang_Gcp_Dataflow - Build # 232 - Aborted!
Posted by Apache Jenkins Server <je...@builds.apache.org>.
beam_PostCommit_Python_Xlang_Gcp_Dataflow - Build # 232 - Aborted:
Check console output at https://ci-beam.apache.org/job/beam_PostCommit_Python_Xlang_Gcp_Dataflow/232/ to view the results.
beam_PostCommit_Python_Xlang_Gcp_Dataflow - Build # 231 - Aborted!
Posted by Apache Jenkins Server <je...@builds.apache.org>.
beam_PostCommit_Python_Xlang_Gcp_Dataflow - Build # 231 - Aborted:
Check console output at https://ci-beam.apache.org/job/beam_PostCommit_Python_Xlang_Gcp_Dataflow/231/ to view the results.
beam_PostCommit_Python_Xlang_Gcp_Dataflow - Build # 230 - Aborted!
Posted by Apache Jenkins Server <je...@builds.apache.org>.
beam_PostCommit_Python_Xlang_Gcp_Dataflow - Build # 230 - Aborted:
Check console output at https://ci-beam.apache.org/job/beam_PostCommit_Python_Xlang_Gcp_Dataflow/230/ to view the results.
beam_PostCommit_Python_Xlang_Gcp_Dataflow - Build # 229 - Aborted!
Posted by Apache Jenkins Server <je...@builds.apache.org>.
beam_PostCommit_Python_Xlang_Gcp_Dataflow - Build # 229 - Aborted:
Check console output at https://ci-beam.apache.org/job/beam_PostCommit_Python_Xlang_Gcp_Dataflow/229/ to view the results.
beam_PostCommit_Python_Xlang_Gcp_Dataflow - Build # 228 - Aborted!
Posted by Apache Jenkins Server <je...@builds.apache.org>.
beam_PostCommit_Python_Xlang_Gcp_Dataflow - Build # 228 - Aborted:
Check console output at https://ci-beam.apache.org/job/beam_PostCommit_Python_Xlang_Gcp_Dataflow/228/ to view the results.
beam_PostCommit_Python_Xlang_Gcp_Dataflow - Build # 227 - Aborted!
Posted by Apache Jenkins Server <je...@builds.apache.org>.
beam_PostCommit_Python_Xlang_Gcp_Dataflow - Build # 227 - Aborted:
Check console output at https://ci-beam.apache.org/job/beam_PostCommit_Python_Xlang_Gcp_Dataflow/227/ to view the results.
beam_PostCommit_Python_Xlang_Gcp_Dataflow - Build # 226 - Aborted!
Posted by Apache Jenkins Server <je...@builds.apache.org>.
beam_PostCommit_Python_Xlang_Gcp_Dataflow - Build # 226 - Aborted:
Check console output at https://ci-beam.apache.org/job/beam_PostCommit_Python_Xlang_Gcp_Dataflow/226/ to view the results.
beam_PostCommit_Python_Xlang_Gcp_Dataflow - Build # 225 - Aborted!
Posted by Apache Jenkins Server <je...@builds.apache.org>.
beam_PostCommit_Python_Xlang_Gcp_Dataflow - Build # 225 - Aborted:
Check console output at https://ci-beam.apache.org/job/beam_PostCommit_Python_Xlang_Gcp_Dataflow/225/ to view the results.
beam_PostCommit_Python_Xlang_Gcp_Dataflow - Build # 224 - Aborted!
Posted by Apache Jenkins Server <je...@builds.apache.org>.
beam_PostCommit_Python_Xlang_Gcp_Dataflow - Build # 224 - Aborted:
Check console output at https://ci-beam.apache.org/job/beam_PostCommit_Python_Xlang_Gcp_Dataflow/224/ to view the results.
beam_PostCommit_Python_Xlang_Gcp_Dataflow - Build # 223 - Aborted!
Posted by Apache Jenkins Server <je...@builds.apache.org>.
beam_PostCommit_Python_Xlang_Gcp_Dataflow - Build # 223 - Aborted:
Check console output at https://ci-beam.apache.org/job/beam_PostCommit_Python_Xlang_Gcp_Dataflow/223/ to view the results.
beam_PostCommit_Python_Xlang_Gcp_Dataflow - Build # 222 - Aborted!
Posted by Apache Jenkins Server <je...@builds.apache.org>.
beam_PostCommit_Python_Xlang_Gcp_Dataflow - Build # 222 - Aborted:
Check console output at https://ci-beam.apache.org/job/beam_PostCommit_Python_Xlang_Gcp_Dataflow/222/ to view the results.
beam_PostCommit_Python_Xlang_Gcp_Dataflow - Build # 221 - Aborted!
Posted by Apache Jenkins Server <je...@builds.apache.org>.
beam_PostCommit_Python_Xlang_Gcp_Dataflow - Build # 221 - Aborted:
Check console output at https://ci-beam.apache.org/job/beam_PostCommit_Python_Xlang_Gcp_Dataflow/221/ to view the results.
beam_PostCommit_Python_Xlang_Gcp_Dataflow - Build # 220 - Aborted!
Posted by Apache Jenkins Server <je...@builds.apache.org>.
beam_PostCommit_Python_Xlang_Gcp_Dataflow - Build # 220 - Aborted:
Check console output at https://ci-beam.apache.org/job/beam_PostCommit_Python_Xlang_Gcp_Dataflow/220/ to view the results.
beam_PostCommit_Python_Xlang_Gcp_Dataflow - Build # 219 - Aborted!
Posted by Apache Jenkins Server <je...@builds.apache.org>.
beam_PostCommit_Python_Xlang_Gcp_Dataflow - Build # 219 - Aborted:
Check console output at https://ci-beam.apache.org/job/beam_PostCommit_Python_Xlang_Gcp_Dataflow/219/ to view the results.
beam_PostCommit_Python_Xlang_Gcp_Dataflow - Build # 218 - Aborted!
Posted by Apache Jenkins Server <je...@builds.apache.org>.
beam_PostCommit_Python_Xlang_Gcp_Dataflow - Build # 218 - Aborted:
Check console output at https://ci-beam.apache.org/job/beam_PostCommit_Python_Xlang_Gcp_Dataflow/218/ to view the results.
beam_PostCommit_Python_Xlang_Gcp_Dataflow - Build # 217 - Aborted!
Posted by Apache Jenkins Server <je...@builds.apache.org>.
beam_PostCommit_Python_Xlang_Gcp_Dataflow - Build # 217 - Aborted:
Check console output at https://ci-beam.apache.org/job/beam_PostCommit_Python_Xlang_Gcp_Dataflow/217/ to view the results.
beam_PostCommit_Python_Xlang_Gcp_Dataflow - Build # 216 - Aborted!
Posted by Apache Jenkins Server <je...@builds.apache.org>.
beam_PostCommit_Python_Xlang_Gcp_Dataflow - Build # 216 - Aborted:
Check console output at https://ci-beam.apache.org/job/beam_PostCommit_Python_Xlang_Gcp_Dataflow/216/ to view the results.
beam_PostCommit_Python_Xlang_Gcp_Dataflow - Build # 215 - Aborted!
Posted by Apache Jenkins Server <je...@builds.apache.org>.
beam_PostCommit_Python_Xlang_Gcp_Dataflow - Build # 215 - Aborted:
Check console output at https://ci-beam.apache.org/job/beam_PostCommit_Python_Xlang_Gcp_Dataflow/215/ to view the results.
beam_PostCommit_Python_Xlang_Gcp_Dataflow - Build # 214 - Aborted!
Posted by Apache Jenkins Server <je...@builds.apache.org>.
beam_PostCommit_Python_Xlang_Gcp_Dataflow - Build # 214 - Aborted:
Check console output at https://ci-beam.apache.org/job/beam_PostCommit_Python_Xlang_Gcp_Dataflow/214/ to view the results.
beam_PostCommit_Python_Xlang_Gcp_Dataflow - Build # 213 - Aborted!
Posted by Apache Jenkins Server <je...@builds.apache.org>.
beam_PostCommit_Python_Xlang_Gcp_Dataflow - Build # 213 - Aborted:
Check console output at https://ci-beam.apache.org/job/beam_PostCommit_Python_Xlang_Gcp_Dataflow/213/ to view the results.
beam_PostCommit_Python_Xlang_Gcp_Dataflow - Build # 212 - Aborted!
Posted by Apache Jenkins Server <je...@builds.apache.org>.
beam_PostCommit_Python_Xlang_Gcp_Dataflow - Build # 212 - Aborted:
Check console output at https://ci-beam.apache.org/job/beam_PostCommit_Python_Xlang_Gcp_Dataflow/212/ to view the results.
beam_PostCommit_Python_Xlang_Gcp_Dataflow - Build # 211 - Aborted!
Posted by Apache Jenkins Server <je...@builds.apache.org>.
beam_PostCommit_Python_Xlang_Gcp_Dataflow - Build # 211 - Aborted:
Check console output at https://ci-beam.apache.org/job/beam_PostCommit_Python_Xlang_Gcp_Dataflow/211/ to view the results.
beam_PostCommit_Python_Xlang_Gcp_Dataflow - Build # 210 - Aborted!
Posted by Apache Jenkins Server <je...@builds.apache.org>.
beam_PostCommit_Python_Xlang_Gcp_Dataflow - Build # 210 - Aborted:
Check console output at https://ci-beam.apache.org/job/beam_PostCommit_Python_Xlang_Gcp_Dataflow/210/ to view the results.
beam_PostCommit_Python_Xlang_Gcp_Dataflow - Build # 209 - Aborted!
Posted by Apache Jenkins Server <je...@builds.apache.org>.
beam_PostCommit_Python_Xlang_Gcp_Dataflow - Build # 209 - Aborted:
Check console output at https://ci-beam.apache.org/job/beam_PostCommit_Python_Xlang_Gcp_Dataflow/209/ to view the results.
beam_PostCommit_Python_Xlang_Gcp_Dataflow - Build # 208 - Aborted!
Posted by Apache Jenkins Server <je...@builds.apache.org>.
beam_PostCommit_Python_Xlang_Gcp_Dataflow - Build # 208 - Aborted:
Check console output at https://ci-beam.apache.org/job/beam_PostCommit_Python_Xlang_Gcp_Dataflow/208/ to view the results.