You are viewing a plain text version of this content. The canonical link for it is here.
Posted to yarn-dev@hadoop.apache.org by Apache Jenkins Server <je...@builds.apache.org> on 2016/04/17 07:03:27 UTC
Hadoop-Yarn-trunk - Build # 2027 - Still Failing
See https://builds.apache.org/job/Hadoop-Yarn-trunk/2027/
###################################################################################
########################## LAST 60 LINES OF THE CONSOLE ###########################
[...truncated 9546 lines...]
Tests run: 4, Failures: 0, Errors: 0, Skipped: 0, Time elapsed: 30.345 sec - in org.apache.hadoop.yarn.server.resourcemanager.TestKillApplicationWithRMHA
Results :
Failed tests:
TestContainerResizing.testIncreaseContainerUnreservedWhenApplicationCompleted:812->checkPendingResource:1062 expected:<0> but was:<1024>
TestNodeLabelContainerAllocation.testQueueUsedCapacitiesUpdate:1459->checkQueueUsedCapacity:1240 expected:<0.3> but was:<0.6>
Tests in error:
TestSchedulingPolicy.testIsApplicableTo:116 » test timed out after 1000 milli...
TestAMRestart.testAMRestartNotLostContainerCompleteMsg:948 » test timed out a...
Tests run: 1347, Failures: 2, Errors: 2, Skipped: 3
[INFO] ------------------------------------------------------------------------
[INFO] Reactor Summary:
[INFO]
[INFO] Apache Hadoop YARN ................................ SUCCESS [ 5.930 s]
[INFO] Apache Hadoop YARN API ............................ SUCCESS [06:48 min]
[INFO] Apache Hadoop YARN Common ......................... SUCCESS [05:05 min]
[INFO] Apache Hadoop YARN Server ......................... SUCCESS [ 0.168 s]
[INFO] Apache Hadoop YARN Server Common .................. SUCCESS [01:22 min]
[INFO] Apache Hadoop YARN NodeManager .................... SUCCESS [13:05 min]
[INFO] Apache Hadoop YARN Web Proxy ...................... SUCCESS [ 48.346 s]
[INFO] Apache Hadoop YARN ApplicationHistoryService ...... SUCCESS [05:12 min]
[INFO] Apache Hadoop YARN ResourceManager ................ FAILURE [ 01:31 h]
[INFO] Apache Hadoop YARN Server Tests ................... SKIPPED
[INFO] Apache Hadoop YARN Client ......................... SKIPPED
[INFO] Apache Hadoop YARN SharedCacheManager ............. SKIPPED
[INFO] Apache Hadoop YARN Timeline Plugin Storage ........ SKIPPED
[INFO] Apache Hadoop YARN Applications ................... SKIPPED
[INFO] Apache Hadoop YARN DistributedShell ............... SKIPPED
[INFO] Apache Hadoop YARN Unmanaged Am Launcher .......... SKIPPED
[INFO] Apache Hadoop YARN Site ........................... SKIPPED
[INFO] Apache Hadoop YARN Registry ....................... SKIPPED
[INFO] Apache Hadoop YARN Project ........................ SKIPPED
[INFO] ------------------------------------------------------------------------
[INFO] BUILD FAILURE
[INFO] ------------------------------------------------------------------------
[INFO] Total time: 02:03 h
[INFO] Finished at: 2016-04-17T05:03:28+00:00
[INFO] Final Memory: 63M/524M
[INFO] ------------------------------------------------------------------------
[ERROR] Failed to execute goal org.apache.maven.plugins:maven-surefire-plugin:2.17:test (default-test) on project hadoop-yarn-server-resourcemanager: There was a timeout or other error in the fork -> [Help 1]
[ERROR]
[ERROR] To see the full stack trace of the errors, re-run Maven with the -e switch.
[ERROR] Re-run Maven using the -X switch to enable full debug logging.
[ERROR]
[ERROR] For more information about the errors and possible solutions, please read the following articles:
[ERROR] [Help 1] http://cwiki.apache.org/confluence/display/MAVEN/MojoFailureException
[ERROR]
[ERROR] After correcting the problems, you can resume the build with the command
[ERROR] mvn <goals> -rf :hadoop-yarn-server-resourcemanager
Build step 'Execute shell' marked build as failure
Archiving artifacts
Recording test results
Sending e-mails to: yarn-dev@hadoop.apache.org
Email was triggered for: Failure - Any
Sending email for trigger: Failure - Any
###################################################################################
############################## FAILED TESTS (if any) ##############################
4 tests failed.
FAILED: org.apache.hadoop.yarn.server.resourcemanager.scheduler.capacity.TestContainerResizing.testIncreaseContainerUnreservedWhenApplicationCompleted
Error Message:
expected:<0> but was:<1024>
Stack Trace:
java.lang.AssertionError: expected:<0> but was:<1024>
at org.junit.Assert.fail(Assert.java:88)
at org.junit.Assert.failNotEquals(Assert.java:743)
at org.junit.Assert.assertEquals(Assert.java:118)
at org.junit.Assert.assertEquals(Assert.java:555)
at org.junit.Assert.assertEquals(Assert.java:542)
at org.apache.hadoop.yarn.server.resourcemanager.scheduler.capacity.TestContainerResizing.checkPendingResource(TestContainerResizing.java:1062)
at org.apache.hadoop.yarn.server.resourcemanager.scheduler.capacity.TestContainerResizing.testIncreaseContainerUnreservedWhenApplicationCompleted(TestContainerResizing.java:812)
FAILED: org.apache.hadoop.yarn.server.resourcemanager.scheduler.capacity.TestNodeLabelContainerAllocation.testQueueUsedCapacitiesUpdate
Error Message:
expected:<0.3> but was:<0.6>
Stack Trace:
java.lang.AssertionError: expected:<0.3> but was:<0.6>
at org.junit.Assert.fail(Assert.java:88)
at org.junit.Assert.failNotEquals(Assert.java:743)
at org.junit.Assert.assertEquals(Assert.java:519)
at org.junit.Assert.assertEquals(Assert.java:609)
at org.apache.hadoop.yarn.server.resourcemanager.scheduler.capacity.TestNodeLabelContainerAllocation.checkQueueUsedCapacity(TestNodeLabelContainerAllocation.java:1240)
at org.apache.hadoop.yarn.server.resourcemanager.scheduler.capacity.TestNodeLabelContainerAllocation.testQueueUsedCapacitiesUpdate(TestNodeLabelContainerAllocation.java:1459)
FAILED: org.apache.hadoop.yarn.server.resourcemanager.scheduler.fair.TestSchedulingPolicy.testIsApplicableTo
Error Message:
test timed out after 1000 milliseconds
Stack Trace:
java.lang.Exception: test timed out after 1000 milliseconds
at org.mockito.asm.ClassWriter.visitMethod(ClassWriter.java:684)
at org.mockito.cglib.core.ClassEmitter.begin_method(ClassEmitter.java:139)
at org.mockito.cglib.core.EmitUtils.null_constructor(EmitUtils.java:88)
at org.mockito.cglib.core.KeyFactory$Generator.generateClass(KeyFactory.java:179)
at org.mockito.cglib.core.DefaultGeneratorStrategy.generate(DefaultGeneratorStrategy.java:25)
at org.mockito.cglib.core.AbstractClassGenerator.create(AbstractClassGenerator.java:217)
at org.mockito.cglib.core.KeyFactory$Generator.create(KeyFactory.java:145)
at org.mockito.cglib.core.KeyFactory.create(KeyFactory.java:117)
at org.mockito.cglib.core.KeyFactory.create(KeyFactory.java:109)
at org.mockito.cglib.core.KeyFactory.create(KeyFactory.java:105)
at org.mockito.cglib.proxy.Enhancer.<clinit>(Enhancer.java:70)
at org.mockito.internal.creation.jmock.ClassImposterizer.createProxyClass(ClassImposterizer.java:68)
at org.mockito.internal.creation.jmock.ClassImposterizer.imposterise(ClassImposterizer.java:50)
at org.mockito.internal.util.MockUtil.createMock(MockUtil.java:54)
at org.mockito.internal.MockitoCore.mock(MockitoCore.java:45)
at org.mockito.Mockito.mock(Mockito.java:921)
at org.mockito.Mockito.mock(Mockito.java:816)
at org.apache.hadoop.yarn.server.resourcemanager.scheduler.fair.TestSchedulingPolicy.testIsApplicableTo(TestSchedulingPolicy.java:116)
FAILED: org.apache.hadoop.yarn.server.resourcemanager.applicationsmanager.TestAMRestart.testAMRestartNotLostContainerCompleteMsg
Error Message:
test timed out after 30000 milliseconds
Stack Trace:
java.lang.Exception: test timed out after 30000 milliseconds
at java.lang.Thread.sleep(Native Method)
at org.apache.hadoop.yarn.server.resourcemanager.MockRM.waitForState(MockRM.java:314)
at org.apache.hadoop.yarn.server.resourcemanager.MockRM.waitForState(MockRM.java:299)
at org.apache.hadoop.yarn.server.resourcemanager.MockRM.waitForState(MockRM.java:294)
at org.apache.hadoop.yarn.server.resourcemanager.applicationsmanager.TestAMRestart.testAMRestartNotLostContainerCompleteMsg(TestAMRestart.java:948)