You are viewing a plain text version of this content. The canonical link for it is here.
Posted to dev@lucene.apache.org by Policeman Jenkins Server <je...@thetaphi.de> on 2018/05/28 17:42:52 UTC
[JENKINS] Lucene-Solr-7.x-MacOSX (64bit/jdk-9) - Build # 674 -
Unstable!
Build: https://jenkins.thetaphi.de/job/Lucene-Solr-7.x-MacOSX/674/
Java: 64bit/jdk-9 -XX:+UseCompressedOops -XX:+UseConcMarkSweepGC
1 tests failed.
FAILED: org.apache.solr.cloud.OverseerTaskQueueTest.testPeekElements
Error Message:
Stack Trace:
java.lang.AssertionError
at __randomizedtesting.SeedInfo.seed([47D741316D200685:BAF9FB10BD195298]:0)
at org.junit.Assert.fail(Assert.java:92)
at org.junit.Assert.assertTrue(Assert.java:43)
at org.junit.Assert.assertTrue(Assert.java:54)
at org.apache.solr.cloud.DistributedQueueTest.testPeekElements(DistributedQueueTest.java:265)
at java.base/jdk.internal.reflect.NativeMethodAccessorImpl.invoke0(Native Method)
at java.base/jdk.internal.reflect.NativeMethodAccessorImpl.invoke(NativeMethodAccessorImpl.java:62)
at java.base/jdk.internal.reflect.DelegatingMethodAccessorImpl.invoke(DelegatingMethodAccessorImpl.java:43)
at java.base/java.lang.reflect.Method.invoke(Method.java:564)
at com.carrotsearch.randomizedtesting.RandomizedRunner.invoke(RandomizedRunner.java:1737)
at com.carrotsearch.randomizedtesting.RandomizedRunner$8.evaluate(RandomizedRunner.java:934)
at com.carrotsearch.randomizedtesting.RandomizedRunner$9.evaluate(RandomizedRunner.java:970)
at com.carrotsearch.randomizedtesting.RandomizedRunner$10.evaluate(RandomizedRunner.java:984)
at com.carrotsearch.randomizedtesting.rules.SystemPropertiesRestoreRule$1.evaluate(SystemPropertiesRestoreRule.java:57)
at org.apache.lucene.util.TestRuleSetupTeardownChained$1.evaluate(TestRuleSetupTeardownChained.java:49)
at org.apache.lucene.util.AbstractBeforeAfterRule$1.evaluate(AbstractBeforeAfterRule.java:45)
at org.apache.lucene.util.TestRuleThreadAndTestName$1.evaluate(TestRuleThreadAndTestName.java:48)
at org.apache.lucene.util.TestRuleIgnoreAfterMaxFailures$1.evaluate(TestRuleIgnoreAfterMaxFailures.java:64)
at org.apache.lucene.util.TestRuleMarkFailure$1.evaluate(TestRuleMarkFailure.java:47)
at com.carrotsearch.randomizedtesting.rules.StatementAdapter.evaluate(StatementAdapter.java:36)
at com.carrotsearch.randomizedtesting.ThreadLeakControl$StatementRunner.run(ThreadLeakControl.java:368)
at com.carrotsearch.randomizedtesting.ThreadLeakControl.forkTimeoutingTask(ThreadLeakControl.java:817)
at com.carrotsearch.randomizedtesting.ThreadLeakControl$3.evaluate(ThreadLeakControl.java:468)
at com.carrotsearch.randomizedtesting.RandomizedRunner.runSingleTest(RandomizedRunner.java:943)
at com.carrotsearch.randomizedtesting.RandomizedRunner$5.evaluate(RandomizedRunner.java:829)
at com.carrotsearch.randomizedtesting.RandomizedRunner$6.evaluate(RandomizedRunner.java:879)
at com.carrotsearch.randomizedtesting.RandomizedRunner$7.evaluate(RandomizedRunner.java:890)
at com.carrotsearch.randomizedtesting.rules.StatementAdapter.evaluate(StatementAdapter.java:36)
at com.carrotsearch.randomizedtesting.rules.SystemPropertiesRestoreRule$1.evaluate(SystemPropertiesRestoreRule.java:57)
at org.apache.lucene.util.AbstractBeforeAfterRule$1.evaluate(AbstractBeforeAfterRule.java:45)
at com.carrotsearch.randomizedtesting.rules.StatementAdapter.evaluate(StatementAdapter.java:36)
at org.apache.lucene.util.TestRuleStoreClassName$1.evaluate(TestRuleStoreClassName.java:41)
at com.carrotsearch.randomizedtesting.rules.NoShadowingOrOverridesOnMethodsRule$1.evaluate(NoShadowingOrOverridesOnMethodsRule.java:40)
at com.carrotsearch.randomizedtesting.rules.NoShadowingOrOverridesOnMethodsRule$1.evaluate(NoShadowingOrOverridesOnMethodsRule.java:40)
at com.carrotsearch.randomizedtesting.rules.StatementAdapter.evaluate(StatementAdapter.java:36)
at com.carrotsearch.randomizedtesting.rules.StatementAdapter.evaluate(StatementAdapter.java:36)
at org.apache.lucene.util.TestRuleAssertionsRequired$1.evaluate(TestRuleAssertionsRequired.java:53)
at org.apache.lucene.util.TestRuleMarkFailure$1.evaluate(TestRuleMarkFailure.java:47)
at org.apache.lucene.util.TestRuleIgnoreAfterMaxFailures$1.evaluate(TestRuleIgnoreAfterMaxFailures.java:64)
at org.apache.lucene.util.TestRuleIgnoreTestSuites$1.evaluate(TestRuleIgnoreTestSuites.java:54)
at com.carrotsearch.randomizedtesting.rules.StatementAdapter.evaluate(StatementAdapter.java:36)
at com.carrotsearch.randomizedtesting.ThreadLeakControl$StatementRunner.run(ThreadLeakControl.java:368)
at java.base/java.lang.Thread.run(Thread.java:844)
Build Log:
[...truncated 1821 lines...]
[junit4] JVM J1: stderr was not empty, see: /Users/jenkins/workspace/Lucene-Solr-7.x-MacOSX/lucene/build/core/test/temp/junit4-J1-20180528_161018_84712372224710800752075.syserr
[junit4] >>> JVM J1 emitted unexpected output (verbatim) ----
[junit4] Java HotSpot(TM) 64-Bit Server VM warning: Option UseConcMarkSweepGC was deprecated in version 9.0 and will likely be removed in a future release.
[junit4] <<< JVM J1: EOF ----
[junit4] JVM J0: stderr was not empty, see: /Users/jenkins/workspace/Lucene-Solr-7.x-MacOSX/lucene/build/core/test/temp/junit4-J0-20180528_161018_84714771648732482175318.syserr
[junit4] >>> JVM J0 emitted unexpected output (verbatim) ----
[junit4] Java HotSpot(TM) 64-Bit Server VM warning: Option UseConcMarkSweepGC was deprecated in version 9.0 and will likely be removed in a future release.
[junit4] <<< JVM J0: EOF ----
[...truncated 290 lines...]
[junit4] JVM J0: stderr was not empty, see: /Users/jenkins/workspace/Lucene-Solr-7.x-MacOSX/lucene/build/test-framework/test/temp/junit4-J0-20180528_161839_67615498557895483793706.syserr
[junit4] >>> JVM J0 emitted unexpected output (verbatim) ----
[junit4] Java HotSpot(TM) 64-Bit Server VM warning: Option UseConcMarkSweepGC was deprecated in version 9.0 and will likely be removed in a future release.
[junit4] <<< JVM J0: EOF ----
[junit4] JVM J1: stderr was not empty, see: /Users/jenkins/workspace/Lucene-Solr-7.x-MacOSX/lucene/build/test-framework/test/temp/junit4-J1-20180528_161839_67610706513290462997729.syserr
[junit4] >>> JVM J1 emitted unexpected output (verbatim) ----
[junit4] Java HotSpot(TM) 64-Bit Server VM warning: Option UseConcMarkSweepGC was deprecated in version 9.0 and will likely be removed in a future release.
[junit4] <<< JVM J1: EOF ----
[...truncated 1074 lines...]
[junit4] JVM J0: stderr was not empty, see: /Users/jenkins/workspace/Lucene-Solr-7.x-MacOSX/lucene/build/analysis/common/test/temp/junit4-J0-20180528_161942_575219432425138108968.syserr
[junit4] >>> JVM J0 emitted unexpected output (verbatim) ----
[junit4] Java HotSpot(TM) 64-Bit Server VM warning: Option UseConcMarkSweepGC was deprecated in version 9.0 and will likely be removed in a future release.
[junit4] <<< JVM J0: EOF ----
[...truncated 3 lines...]
[junit4] JVM J1: stderr was not empty, see: /Users/jenkins/workspace/Lucene-Solr-7.x-MacOSX/lucene/build/analysis/common/test/temp/junit4-J1-20180528_161942_5763790358720563404512.syserr
[junit4] >>> JVM J1 emitted unexpected output (verbatim) ----
[junit4] Java HotSpot(TM) 64-Bit Server VM warning: Option UseConcMarkSweepGC was deprecated in version 9.0 and will likely be removed in a future release.
[junit4] <<< JVM J1: EOF ----
[...truncated 254 lines...]
[junit4] JVM J1: stderr was not empty, see: /Users/jenkins/workspace/Lucene-Solr-7.x-MacOSX/lucene/build/analysis/icu/test/temp/junit4-J1-20180528_162158_2089714029369676732448.syserr
[junit4] >>> JVM J1 emitted unexpected output (verbatim) ----
[junit4] Java HotSpot(TM) 64-Bit Server VM warning: Option UseConcMarkSweepGC was deprecated in version 9.0 and will likely be removed in a future release.
[junit4] <<< JVM J1: EOF ----
[...truncated 5 lines...]
[junit4] JVM J0: stderr was not empty, see: /Users/jenkins/workspace/Lucene-Solr-7.x-MacOSX/lucene/build/analysis/icu/test/temp/junit4-J0-20180528_162158_20815730633695517871222.syserr
[junit4] >>> JVM J0 emitted unexpected output (verbatim) ----
[junit4] Java HotSpot(TM) 64-Bit Server VM warning: Option UseConcMarkSweepGC was deprecated in version 9.0 and will likely be removed in a future release.
[junit4] <<< JVM J0: EOF ----
[...truncated 253 lines...]
[junit4] JVM J0: stderr was not empty, see: /Users/jenkins/workspace/Lucene-Solr-7.x-MacOSX/lucene/build/analysis/kuromoji/test/temp/junit4-J0-20180528_162213_9394513723229843865084.syserr
[junit4] >>> JVM J0 emitted unexpected output (verbatim) ----
[junit4] Java HotSpot(TM) 64-Bit Server VM warning: Option UseConcMarkSweepGC was deprecated in version 9.0 and will likely be removed in a future release.
[junit4] <<< JVM J0: EOF ----
[...truncated 3 lines...]
[junit4] JVM J1: stderr was not empty, see: /Users/jenkins/workspace/Lucene-Solr-7.x-MacOSX/lucene/build/analysis/kuromoji/test/temp/junit4-J1-20180528_162213_939480629807986631582.syserr
[junit4] >>> JVM J1 emitted unexpected output (verbatim) ----
[junit4] Java HotSpot(TM) 64-Bit Server VM warning: Option UseConcMarkSweepGC was deprecated in version 9.0 and will likely be removed in a future release.
[junit4] <<< JVM J1: EOF ----
[...truncated 162 lines...]
[junit4] JVM J0: stderr was not empty, see: /Users/jenkins/workspace/Lucene-Solr-7.x-MacOSX/lucene/build/analysis/morfologik/test/temp/junit4-J0-20180528_162247_56315880024723424013114.syserr
[junit4] >>> JVM J0 emitted unexpected output (verbatim) ----
[junit4] Java HotSpot(TM) 64-Bit Server VM warning: Option UseConcMarkSweepGC was deprecated in version 9.0 and will likely be removed in a future release.
[junit4] <<< JVM J0: EOF ----
[...truncated 3 lines...]
[junit4] JVM J1: stderr was not empty, see: /Users/jenkins/workspace/Lucene-Solr-7.x-MacOSX/lucene/build/analysis/morfologik/test/temp/junit4-J1-20180528_162247_5631902330884180749379.syserr
[junit4] >>> JVM J1 emitted unexpected output (verbatim) ----
[junit4] Java HotSpot(TM) 64-Bit Server VM warning: Option UseConcMarkSweepGC was deprecated in version 9.0 and will likely be removed in a future release.
[junit4] <<< JVM J1: EOF ----
[...truncated 207 lines...]
[junit4] JVM J1: stderr was not empty, see: /Users/jenkins/workspace/Lucene-Solr-7.x-MacOSX/lucene/build/analysis/nori/test/temp/junit4-J1-20180528_162253_5488163914142447336680.syserr
[junit4] >>> JVM J1 emitted unexpected output (verbatim) ----
[junit4] Java HotSpot(TM) 64-Bit Server VM warning: Option UseConcMarkSweepGC was deprecated in version 9.0 and will likely be removed in a future release.
[junit4] <<< JVM J1: EOF ----
[...truncated 3 lines...]
[junit4] JVM J0: stderr was not empty, see: /Users/jenkins/workspace/Lucene-Solr-7.x-MacOSX/lucene/build/analysis/nori/test/temp/junit4-J0-20180528_162253_54810453837342940003294.syserr
[junit4] >>> JVM J0 emitted unexpected output (verbatim) ----
[junit4] Java HotSpot(TM) 64-Bit Server VM warning: Option UseConcMarkSweepGC was deprecated in version 9.0 and will likely be removed in a future release.
[junit4] <<< JVM J0: EOF ----
[...truncated 171 lines...]
[junit4] JVM J1: stderr was not empty, see: /Users/jenkins/workspace/Lucene-Solr-7.x-MacOSX/lucene/build/analysis/opennlp/test/temp/junit4-J1-20180528_162303_23714695780920181187235.syserr
[junit4] >>> JVM J1 emitted unexpected output (verbatim) ----
[junit4] Java HotSpot(TM) 64-Bit Server VM warning: Option UseConcMarkSweepGC was deprecated in version 9.0 and will likely be removed in a future release.
[junit4] <<< JVM J1: EOF ----
[junit4] JVM J0: stderr was not empty, see: /Users/jenkins/workspace/Lucene-Solr-7.x-MacOSX/lucene/build/analysis/opennlp/test/temp/junit4-J0-20180528_162303_23712756596287129881265.syserr
[junit4] >>> JVM J0 emitted unexpected output (verbatim) ----
[junit4] Java HotSpot(TM) 64-Bit Server VM warning: Option UseConcMarkSweepGC was deprecated in version 9.0 and will likely be removed in a future release.
[junit4] <<< JVM J0: EOF ----
[...truncated 176 lines...]
[junit4] JVM J1: stderr was not empty, see: /Users/jenkins/workspace/Lucene-Solr-7.x-MacOSX/lucene/build/analysis/phonetic/test/temp/junit4-J1-20180528_162307_42113230122034123635820.syserr
[junit4] >>> JVM J1 emitted unexpected output (verbatim) ----
[junit4] Java HotSpot(TM) 64-Bit Server VM warning: Option UseConcMarkSweepGC was deprecated in version 9.0 and will likely be removed in a future release.
[junit4] <<< JVM J1: EOF ----
[...truncated 3 lines...]
[junit4] JVM J0: stderr was not empty, see: /Users/jenkins/workspace/Lucene-Solr-7.x-MacOSX/lucene/build/analysis/phonetic/test/temp/junit4-J0-20180528_162307_4211580330692727525230.syserr
[junit4] >>> JVM J0 emitted unexpected output (verbatim) ----
[junit4] Java HotSpot(TM) 64-Bit Server VM warning: Option UseConcMarkSweepGC was deprecated in version 9.0 and will likely be removed in a future release.
[junit4] <<< JVM J0: EOF ----
[...truncated 159 lines...]
[junit4] JVM J1: stderr was not empty, see: /Users/jenkins/workspace/Lucene-Solr-7.x-MacOSX/lucene/build/analysis/smartcn/test/temp/junit4-J1-20180528_162315_59913049976534851192265.syserr
[junit4] >>> JVM J1 emitted unexpected output (verbatim) ----
[junit4] Java HotSpot(TM) 64-Bit Server VM warning: Option UseConcMarkSweepGC was deprecated in version 9.0 and will likely be removed in a future release.
[junit4] <<< JVM J1: EOF ----
[...truncated 3 lines...]
[junit4] JVM J0: stderr was not empty, see: /Users/jenkins/workspace/Lucene-Solr-7.x-MacOSX/lucene/build/analysis/smartcn/test/temp/junit4-J0-20180528_162315_5997637302594202435394.syserr
[junit4] >>> JVM J0 emitted unexpected output (verbatim) ----
[junit4] Java HotSpot(TM) 64-Bit Server VM warning: Option UseConcMarkSweepGC was deprecated in version 9.0 and will likely be removed in a future release.
[junit4] <<< JVM J0: EOF ----
[...truncated 167 lines...]
[junit4] JVM J1: stderr was not empty, see: /Users/jenkins/workspace/Lucene-Solr-7.x-MacOSX/lucene/build/analysis/stempel/test/temp/junit4-J1-20180528_162321_3882118018230809890028.syserr
[junit4] >>> JVM J1 emitted unexpected output (verbatim) ----
[junit4] Java HotSpot(TM) 64-Bit Server VM warning: Option UseConcMarkSweepGC was deprecated in version 9.0 and will likely be removed in a future release.
[junit4] <<< JVM J1: EOF ----
[junit4] JVM J0: stderr was not empty, see: /Users/jenkins/workspace/Lucene-Solr-7.x-MacOSX/lucene/build/analysis/stempel/test/temp/junit4-J0-20180528_162321_3888765810991545970977.syserr
[junit4] >>> JVM J0 emitted unexpected output (verbatim) ----
[junit4] Java HotSpot(TM) 64-Bit Server VM warning: Option UseConcMarkSweepGC was deprecated in version 9.0 and will likely be removed in a future release.
[junit4] <<< JVM J0: EOF ----
[...truncated 175 lines...]
[junit4] JVM J0: stderr was not empty, see: /Users/jenkins/workspace/Lucene-Solr-7.x-MacOSX/lucene/build/analysis/uima/test/temp/junit4-J0-20180528_162325_1662895890061007456873.syserr
[junit4] >>> JVM J0 emitted unexpected output (verbatim) ----
[junit4] Java HotSpot(TM) 64-Bit Server VM warning: Option UseConcMarkSweepGC was deprecated in version 9.0 and will likely be removed in a future release.
[junit4] <<< JVM J0: EOF ----
[...truncated 221 lines...]
[junit4] JVM J0: stderr was not empty, see: /Users/jenkins/workspace/Lucene-Solr-7.x-MacOSX/lucene/build/backward-codecs/test/temp/junit4-J0-20180528_162338_79610823943759715395826.syserr
[junit4] >>> JVM J0 emitted unexpected output (verbatim) ----
[junit4] Java HotSpot(TM) 64-Bit Server VM warning: Option UseConcMarkSweepGC was deprecated in version 9.0 and will likely be removed in a future release.
[junit4] <<< JVM J0: EOF ----
[...truncated 9 lines...]
[junit4] JVM J1: stderr was not empty, see: /Users/jenkins/workspace/Lucene-Solr-7.x-MacOSX/lucene/build/backward-codecs/test/temp/junit4-J1-20180528_162338_7964291265558837439970.syserr
[junit4] >>> JVM J1 emitted unexpected output (verbatim) ----
[junit4] Java HotSpot(TM) 64-Bit Server VM warning: Option UseConcMarkSweepGC was deprecated in version 9.0 and will likely be removed in a future release.
[junit4] <<< JVM J1: EOF ----
[...truncated 1415 lines...]
[junit4] JVM J1: stderr was not empty, see: /Users/jenkins/workspace/Lucene-Solr-7.x-MacOSX/lucene/build/benchmark/test/temp/junit4-J1-20180528_162545_134316383397201317327.syserr
[junit4] >>> JVM J1 emitted unexpected output (verbatim) ----
[junit4] Java HotSpot(TM) 64-Bit Server VM warning: Option UseConcMarkSweepGC was deprecated in version 9.0 and will likely be removed in a future release.
[junit4] <<< JVM J1: EOF ----
[junit4] JVM J0: stderr was not empty, see: /Users/jenkins/workspace/Lucene-Solr-7.x-MacOSX/lucene/build/benchmark/test/temp/junit4-J0-20180528_162545_1346344442895504559419.syserr
[junit4] >>> JVM J0 emitted unexpected output (verbatim) ----
[junit4] Java HotSpot(TM) 64-Bit Server VM warning: Option UseConcMarkSweepGC was deprecated in version 9.0 and will likely be removed in a future release.
[junit4] <<< JVM J0: EOF ----
[...truncated 254 lines...]
[junit4] JVM J0: stderr was not empty, see: /Users/jenkins/workspace/Lucene-Solr-7.x-MacOSX/lucene/build/classification/test/temp/junit4-J0-20180528_162558_74910790169006932734931.syserr
[junit4] >>> JVM J0 emitted unexpected output (verbatim) ----
[junit4] Java HotSpot(TM) 64-Bit Server VM warning: Option UseConcMarkSweepGC was deprecated in version 9.0 and will likely be removed in a future release.
[junit4] <<< JVM J0: EOF ----
[junit4] JVM J1: stderr was not empty, see: /Users/jenkins/workspace/Lucene-Solr-7.x-MacOSX/lucene/build/classification/test/temp/junit4-J1-20180528_162558_7493353284277001611456.syserr
[junit4] >>> JVM J1 emitted unexpected output (verbatim) ----
[junit4] Java HotSpot(TM) 64-Bit Server VM warning: Option UseConcMarkSweepGC was deprecated in version 9.0 and will likely be removed in a future release.
[junit4] <<< JVM J1: EOF ----
[...truncated 270 lines...]
[junit4] JVM J1: stderr was not empty, see: /Users/jenkins/workspace/Lucene-Solr-7.x-MacOSX/lucene/build/codecs/test/temp/junit4-J1-20180528_162614_3597381559678495921920.syserr
[junit4] >>> JVM J1 emitted unexpected output (verbatim) ----
[junit4] Java HotSpot(TM) 64-Bit Server VM warning: Option UseConcMarkSweepGC was deprecated in version 9.0 and will likely be removed in a future release.
[junit4] <<< JVM J1: EOF ----
[junit4] JVM J0: stderr was not empty, see: /Users/jenkins/workspace/Lucene-Solr-7.x-MacOSX/lucene/build/codecs/test/temp/junit4-J0-20180528_162614_35616120156384177978899.syserr
[junit4] >>> JVM J0 emitted unexpected output (verbatim) ----
[junit4] Java HotSpot(TM) 64-Bit Server VM warning: Option UseConcMarkSweepGC was deprecated in version 9.0 and will likely be removed in a future release.
[junit4] <<< JVM J0: EOF ----
[...truncated 232 lines...]
[junit4] JVM J0: stderr was not empty, see: /Users/jenkins/workspace/Lucene-Solr-7.x-MacOSX/lucene/build/demo/test/temp/junit4-J0-20180528_162745_71115693324330402903155.syserr
[junit4] >>> JVM J0 emitted unexpected output (verbatim) ----
[junit4] Java HotSpot(TM) 64-Bit Server VM warning: Option UseConcMarkSweepGC was deprecated in version 9.0 and will likely be removed in a future release.
[junit4] <<< JVM J0: EOF ----
[junit4] JVM J1: stderr was not empty, see: /Users/jenkins/workspace/Lucene-Solr-7.x-MacOSX/lucene/build/demo/test/temp/junit4-J1-20180528_162745_7128906544693529460363.syserr
[junit4] >>> JVM J1 emitted unexpected output (verbatim) ----
[junit4] Java HotSpot(TM) 64-Bit Server VM warning: Option UseConcMarkSweepGC was deprecated in version 9.0 and will likely be removed in a future release.
[junit4] <<< JVM J1: EOF ----
[...truncated 173 lines...]
[junit4] JVM J0: stderr was not empty, see: /Users/jenkins/workspace/Lucene-Solr-7.x-MacOSX/lucene/build/expressions/test/temp/junit4-J0-20180528_162749_645651571216172165990.syserr
[junit4] >>> JVM J0 emitted unexpected output (verbatim) ----
[junit4] Java HotSpot(TM) 64-Bit Server VM warning: Option UseConcMarkSweepGC was deprecated in version 9.0 and will likely be removed in a future release.
[junit4] <<< JVM J0: EOF ----
[...truncated 3 lines...]
[junit4] JVM J1: stderr was not empty, see: /Users/jenkins/workspace/Lucene-Solr-7.x-MacOSX/lucene/build/expressions/test/temp/junit4-J1-20180528_162749_64717129942151349232814.syserr
[junit4] >>> JVM J1 emitted unexpected output (verbatim) ----
[junit4] Java HotSpot(TM) 64-Bit Server VM warning: Option UseConcMarkSweepGC was deprecated in version 9.0 and will likely be removed in a future release.
[junit4] <<< JVM J1: EOF ----
[...truncated 232 lines...]
[junit4] JVM J0: stderr was not empty, see: /Users/jenkins/workspace/Lucene-Solr-7.x-MacOSX/lucene/build/facet/test/temp/junit4-J0-20180528_162755_9703158904274818363962.syserr
[junit4] >>> JVM J0 emitted unexpected output (verbatim) ----
[junit4] Java HotSpot(TM) 64-Bit Server VM warning: Option UseConcMarkSweepGC was deprecated in version 9.0 and will likely be removed in a future release.
[junit4] <<< JVM J0: EOF ----
[...truncated 3 lines...]
[junit4] JVM J1: stderr was not empty, see: /Users/jenkins/workspace/Lucene-Solr-7.x-MacOSX/lucene/build/facet/test/temp/junit4-J1-20180528_162755_9705413159112983225953.syserr
[junit4] >>> JVM J1 emitted unexpected output (verbatim) ----
[junit4] Java HotSpot(TM) 64-Bit Server VM warning: Option UseConcMarkSweepGC was deprecated in version 9.0 and will likely be removed in a future release.
[junit4] <<< JVM J1: EOF ----
[...truncated 182 lines...]
[junit4] JVM J1: stderr was not empty, see: /Users/jenkins/workspace/Lucene-Solr-7.x-MacOSX/lucene/build/grouping/test/temp/junit4-J1-20180528_162824_6635029512684142741109.syserr
[junit4] >>> JVM J1 emitted unexpected output (verbatim) ----
[junit4] Java HotSpot(TM) 64-Bit Server VM warning: Option UseConcMarkSweepGC was deprecated in version 9.0 and will likely be removed in a future release.
[junit4] <<< JVM J1: EOF ----
[...truncated 3 lines...]
[junit4] JVM J0: stderr was not empty, see: /Users/jenkins/workspace/Lucene-Solr-7.x-MacOSX/lucene/build/grouping/test/temp/junit4-J0-20180528_162824_663589743336346995951.syserr
[junit4] >>> JVM J0 emitted unexpected output (verbatim) ----
[junit4] Java HotSpot(TM) 64-Bit Server VM warning: Option UseConcMarkSweepGC was deprecated in version 9.0 and will likely be removed in a future release.
[junit4] <<< JVM J0: EOF ----
[...truncated 258 lines...]
[junit4] JVM J1: stderr was not empty, see: /Users/jenkins/workspace/Lucene-Solr-7.x-MacOSX/lucene/build/highlighter/test/temp/junit4-J1-20180528_162834_21311283279875044246222.syserr
[junit4] >>> JVM J1 emitted unexpected output (verbatim) ----
[junit4] Java HotSpot(TM) 64-Bit Server VM warning: Option UseConcMarkSweepGC was deprecated in version 9.0 and will likely be removed in a future release.
[junit4] <<< JVM J1: EOF ----
[junit4] JVM J0: stderr was not empty, see: /Users/jenkins/workspace/Lucene-Solr-7.x-MacOSX/lucene/build/highlighter/test/temp/junit4-J0-20180528_162834_2131535701634500604337.syserr
[junit4] >>> JVM J0 emitted unexpected output (verbatim) ----
[junit4] Java HotSpot(TM) 64-Bit Server VM warning: Option UseConcMarkSweepGC was deprecated in version 9.0 and will likely be removed in a future release.
[junit4] <<< JVM J0: EOF ----
[...truncated 163 lines...]
[junit4] JVM J1: stderr was not empty, see: /Users/jenkins/workspace/Lucene-Solr-7.x-MacOSX/lucene/build/join/test/temp/junit4-J1-20180528_162850_87914779432148372708399.syserr
[junit4] >>> JVM J1 emitted unexpected output (verbatim) ----
[junit4] Java HotSpot(TM) 64-Bit Server VM warning: Option UseConcMarkSweepGC was deprecated in version 9.0 and will likely be removed in a future release.
[junit4] <<< JVM J1: EOF ----
[...truncated 6 lines...]
[junit4] JVM J0: stderr was not empty, see: /Users/jenkins/workspace/Lucene-Solr-7.x-MacOSX/lucene/build/join/test/temp/junit4-J0-20180528_162850_8787244337595884199774.syserr
[junit4] >>> JVM J0 emitted unexpected output (verbatim) ----
[junit4] Java HotSpot(TM) 64-Bit Server VM warning: Option UseConcMarkSweepGC was deprecated in version 9.0 and will likely be removed in a future release.
[junit4] <<< JVM J0: EOF ----
[...truncated 153 lines...]
[junit4] JVM J0: stderr was not empty, see: /Users/jenkins/workspace/Lucene-Solr-7.x-MacOSX/lucene/build/memory/test/temp/junit4-J0-20180528_162904_3127214453553426031772.syserr
[junit4] >>> JVM J0 emitted unexpected output (verbatim) ----
[junit4] Java HotSpot(TM) 64-Bit Server VM warning: Option UseConcMarkSweepGC was deprecated in version 9.0 and will likely be removed in a future release.
[junit4] <<< JVM J0: EOF ----
[...truncated 3 lines...]
[junit4] JVM J1: stderr was not empty, see: /Users/jenkins/workspace/Lucene-Solr-7.x-MacOSX/lucene/build/memory/test/temp/junit4-J1-20180528_162904_31218353484621532014605.syserr
[junit4] >>> JVM J1 emitted unexpected output (verbatim) ----
[junit4] Java HotSpot(TM) 64-Bit Server VM warning: Option UseConcMarkSweepGC was deprecated in version 9.0 and will likely be removed in a future release.
[junit4] <<< JVM J1: EOF ----
[...truncated 191 lines...]
[junit4] JVM J0: stderr was not empty, see: /Users/jenkins/workspace/Lucene-Solr-7.x-MacOSX/lucene/build/misc/test/temp/junit4-J0-20180528_162911_16212704061936761824251.syserr
[junit4] >>> JVM J0 emitted unexpected output (verbatim) ----
[junit4] Java HotSpot(TM) 64-Bit Server VM warning: Option UseConcMarkSweepGC was deprecated in version 9.0 and will likely be removed in a future release.
[junit4] <<< JVM J0: EOF ----
[...truncated 3 lines...]
[junit4] JVM J1: stderr was not empty, see: /Users/jenkins/workspace/Lucene-Solr-7.x-MacOSX/lucene/build/misc/test/temp/junit4-J1-20180528_162911_1622610285755449539705.syserr
[junit4] >>> JVM J1 emitted unexpected output (verbatim) ----
[junit4] Java HotSpot(TM) 64-Bit Server VM warning: Option UseConcMarkSweepGC was deprecated in version 9.0 and will likely be removed in a future release.
[junit4] <<< JVM J1: EOF ----
[...truncated 338 lines...]
[junit4] JVM J1: stderr was not empty, see: /Users/jenkins/workspace/Lucene-Solr-7.x-MacOSX/lucene/build/queries/test/temp/junit4-J1-20180528_162929_5096426058317055159197.syserr
[junit4] >>> JVM J1 emitted unexpected output (verbatim) ----
[junit4] Java HotSpot(TM) 64-Bit Server VM warning: Option UseConcMarkSweepGC was deprecated in version 9.0 and will likely be removed in a future release.
[junit4] <<< JVM J1: EOF ----
[...truncated 3 lines...]
[junit4] JVM J0: stderr was not empty, see: /Users/jenkins/workspace/Lucene-Solr-7.x-MacOSX/lucene/build/queries/test/temp/junit4-J0-20180528_162929_509323576811124864425.syserr
[junit4] >>> JVM J0 emitted unexpected output (verbatim) ----
[junit4] Java HotSpot(TM) 64-Bit Server VM warning: Option UseConcMarkSweepGC was deprecated in version 9.0 and will likely be removed in a future release.
[junit4] <<< JVM J0: EOF ----
[...truncated 229 lines...]
[junit4] JVM J1: stderr was not empty, see: /Users/jenkins/workspace/Lucene-Solr-7.x-MacOSX/lucene/build/queryparser/test/temp/junit4-J1-20180528_162939_203799640301186313662.syserr
[junit4] >>> JVM J1 emitted unexpected output (verbatim) ----
[junit4] Java HotSpot(TM) 64-Bit Server VM warning: Option UseConcMarkSweepGC was deprecated in version 9.0 and will likely be removed in a future release.
[junit4] <<< JVM J1: EOF ----
[...truncated 3 lines...]
[junit4] JVM J0: stderr was not empty, see: /Users/jenkins/workspace/Lucene-Solr-7.x-MacOSX/lucene/build/queryparser/test/temp/junit4-J0-20180528_162939_20318118805198318861814.syserr
[junit4] >>> JVM J0 emitted unexpected output (verbatim) ----
[junit4] Java HotSpot(TM) 64-Bit Server VM warning: Option UseConcMarkSweepGC was deprecated in version 9.0 and will likely be removed in a future release.
[junit4] <<< JVM J0: EOF ----
[...truncated 192 lines...]
[junit4] JVM J1: stderr was not empty, see: /Users/jenkins/workspace/Lucene-Solr-7.x-MacOSX/lucene/build/replicator/test/temp/junit4-J1-20180528_162948_2211375582243688333670.syserr
[junit4] >>> JVM J1 emitted unexpected output (verbatim) ----
[junit4] Java HotSpot(TM) 64-Bit Server VM warning: Option UseConcMarkSweepGC was deprecated in version 9.0 and will likely be removed in a future release.
[junit4] <<< JVM J1: EOF ----
[...truncated 23 lines...]
[junit4] JVM J0: stderr was not empty, see: /Users/jenkins/workspace/Lucene-Solr-7.x-MacOSX/lucene/build/replicator/test/temp/junit4-J0-20180528_162948_22115471517746798024914.syserr
[junit4] >>> JVM J0 emitted unexpected output (verbatim) ----
[junit4] Java HotSpot(TM) 64-Bit Server VM warning: Option UseConcMarkSweepGC was deprecated in version 9.0 and will likely be removed in a future release.
[junit4] <<< JVM J0: EOF ----
[...truncated 213 lines...]
[junit4] JVM J1: stderr was not empty, see: /Users/jenkins/workspace/Lucene-Solr-7.x-MacOSX/lucene/build/sandbox/test/temp/junit4-J1-20180528_163001_8922555084223852375732.syserr
[junit4] >>> JVM J1 emitted unexpected output (verbatim) ----
[junit4] Java HotSpot(TM) 64-Bit Server VM warning: Option UseConcMarkSweepGC was deprecated in version 9.0 and will likely be removed in a future release.
[junit4] <<< JVM J1: EOF ----
[...truncated 21 lines...]
[junit4] JVM J0: stderr was not empty, see: /Users/jenkins/workspace/Lucene-Solr-7.x-MacOSX/lucene/build/sandbox/test/temp/junit4-J0-20180528_163001_89217469185577555884888.syserr
[junit4] >>> JVM J0 emitted unexpected output (verbatim) ----
[junit4] Java HotSpot(TM) 64-Bit Server VM warning: Option UseConcMarkSweepGC was deprecated in version 9.0 and will likely be removed in a future release.
[junit4] <<< JVM J0: EOF ----
[...truncated 320 lines...]
[junit4] JVM J1: stderr was not empty, see: /Users/jenkins/workspace/Lucene-Solr-7.x-MacOSX/lucene/build/spatial-extras/test/temp/junit4-J1-20180528_163054_8044042463886407439019.syserr
[junit4] >>> JVM J1 emitted unexpected output (verbatim) ----
[junit4] Java HotSpot(TM) 64-Bit Server VM warning: Option UseConcMarkSweepGC was deprecated in version 9.0 and will likely be removed in a future release.
[junit4] <<< JVM J1: EOF ----
[...truncated 3 lines...]
[junit4] JVM J0: stderr was not empty, see: /Users/jenkins/workspace/Lucene-Solr-7.x-MacOSX/lucene/build/spatial-extras/test/temp/junit4-J0-20180528_163054_8049769449975398660849.syserr
[junit4] >>> JVM J0 emitted unexpected output (verbatim) ----
[junit4] Java HotSpot(TM) 64-Bit Server VM warning: Option UseConcMarkSweepGC was deprecated in version 9.0 and will likely be removed in a future release.
[junit4] <<< JVM J0: EOF ----
[...truncated 151 lines...]
[junit4] JVM J0: stderr was not empty, see: /Users/jenkins/workspace/Lucene-Solr-7.x-MacOSX/lucene/build/spatial/test/temp/junit4-J0-20180528_163124_9377273572874804753428.syserr
[junit4] >>> JVM J0 emitted unexpected output (verbatim) ----
[junit4] Java HotSpot(TM) 64-Bit Server VM warning: Option UseConcMarkSweepGC was deprecated in version 9.0 and will likely be removed in a future release.
[junit4] <<< JVM J0: EOF ----
[...truncated 186 lines...]
[junit4] JVM J0: stderr was not empty, see: /Users/jenkins/workspace/Lucene-Solr-7.x-MacOSX/lucene/build/spatial3d/test/temp/junit4-J0-20180528_163127_29716103560556378018968.syserr
[junit4] >>> JVM J0 emitted unexpected output (verbatim) ----
[junit4] Java HotSpot(TM) 64-Bit Server VM warning: Option UseConcMarkSweepGC was deprecated in version 9.0 and will likely be removed in a future release.
[junit4] <<< JVM J0: EOF ----
[...truncated 5 lines...]
[junit4] JVM J1: stderr was not empty, see: /Users/jenkins/workspace/Lucene-Solr-7.x-MacOSX/lucene/build/spatial3d/test/temp/junit4-J1-20180528_163127_29816490480056441793634.syserr
[junit4] >>> JVM J1 emitted unexpected output (verbatim) ----
[junit4] Java HotSpot(TM) 64-Bit Server VM warning: Option UseConcMarkSweepGC was deprecated in version 9.0 and will likely be removed in a future release.
[junit4] <<< JVM J1: EOF ----
[...truncated 267 lines...]
[junit4] JVM J1: stderr was not empty, see: /Users/jenkins/workspace/Lucene-Solr-7.x-MacOSX/lucene/build/suggest/test/temp/junit4-J1-20180528_163151_7233788857068218486482.syserr
[junit4] JVM J0: stderr was not empty, see: /Users/jenkins/workspace/Lucene-Solr-7.x-MacOSX/lucene/build/suggest/test/temp/junit4-J0-20180528_163151_723651410650401859620.syserr
[junit4] >>> JVM J1 emitted unexpected output (verbatim) ----
[junit4] Java HotSpot(TM) 64-Bit Server VM warning: Option UseConcMarkSweepGC was deprecated in version 9.0 and will likely be removed in a future release.
[junit4] <<< JVM J1: EOF ----
[...truncated 1794 lines...]
[junit4] Suite: org.apache.solr.cloud.OverseerTaskQueueTest
[junit4] 2> Creating dataDir: /Users/jenkins/workspace/Lucene-Solr-7.x-MacOSX/solr/build/solr-core/test/J1/temp/solr.cloud.OverseerTaskQueueTest_47D741316D200685-001/init-core-data-001
[junit4] 2> 93507 WARN (SUITE-OverseerTaskQueueTest-seed#[47D741316D200685]-worker) [ ] o.a.s.SolrTestCaseJ4 startTrackingSearchers: numOpens=2 numCloses=2
[junit4] 2> 93507 INFO (SUITE-OverseerTaskQueueTest-seed#[47D741316D200685]-worker) [ ] o.a.s.SolrTestCaseJ4 Using PointFields (NUMERIC_POINTS_SYSPROP=true) w/NUMERIC_DOCVALUES_SYSPROP=false
[junit4] 2> 93509 INFO (SUITE-OverseerTaskQueueTest-seed#[47D741316D200685]-worker) [ ] o.a.s.SolrTestCaseJ4 Randomized ssl (false) and clientAuth (false) via: @org.apache.solr.util.RandomizeSSL(reason="", value=0.0/0.0, ssl=0.0/0.0, clientAuth=0.0/0.0) w/ MAC_OS_X supressed clientAuth
[junit4] 2> 93509 INFO (SUITE-OverseerTaskQueueTest-seed#[47D741316D200685]-worker) [ ] o.a.s.SolrTestCaseJ4 SecureRandom sanity checks: test.solr.allowed.securerandom=null & java.security.egd=file:/dev/./urandom
[junit4] 2> 93511 INFO (TEST-OverseerTaskQueueTest.testDistributedQueueCache-seed#[47D741316D200685]) [ ] o.a.s.SolrTestCaseJ4 ###Starting testDistributedQueueCache
[junit4] 2> 93511 INFO (TEST-OverseerTaskQueueTest.testDistributedQueueCache-seed#[47D741316D200685]) [ ] o.a.s.c.ZkTestServer STARTING ZK TEST SERVER
[junit4] 2> 93511 INFO (Thread-91) [ ] o.a.s.c.ZkTestServer client port:0.0.0.0/0.0.0.0:0
[junit4] 2> 93511 INFO (Thread-91) [ ] o.a.s.c.ZkTestServer Starting server
[junit4] 2> 93514 ERROR (Thread-91) [ ] o.a.z.s.ZooKeeperServer ZKShutdownHandler is not registered, so ZooKeeper server won't take any action on ERROR or SHUTDOWN server state changes
[junit4] 2> 93619 INFO (TEST-OverseerTaskQueueTest.testDistributedQueueCache-seed#[47D741316D200685]) [ ] o.a.s.c.ZkTestServer start zk server on port:58712
[junit4] 2> 93631 INFO (zkConnectionManagerCallback-111-thread-1) [ ] o.a.s.c.c.ConnectionManager zkClient has connected
[junit4] 2> 93655 INFO (TEST-OverseerTaskQueueTest.testDistributedQueueCache-seed#[47D741316D200685]) [ ] o.a.s.SolrTestCaseJ4 ###Ending testDistributedQueueCache
[junit4] 2> 93657 ERROR (TEST-OverseerTaskQueueTest.testDistributedQueueCache-seed#[47D741316D200685]) [ ] o.a.z.s.ZooKeeperServer ZKShutdownHandler is not registered, so ZooKeeper server won't take any action on ERROR or SHUTDOWN server state changes
[junit4] 2> 93657 INFO (TEST-OverseerTaskQueueTest.testDistributedQueueCache-seed#[47D741316D200685]) [ ] o.a.s.c.ZkTestServer connecting to 127.0.0.1:58712 58712
[junit4] 2> 93671 INFO (Thread-91) [ ] o.a.s.c.ZkTestServer connecting to 127.0.0.1:58712 58712
[junit4] 2> 94509 INFO (TEST-OverseerTaskQueueTest.testContainsTaskWithRequestId-seed#[47D741316D200685]) [ ] o.a.s.SolrTestCaseJ4 ###Starting testContainsTaskWithRequestId
[junit4] 2> 94509 INFO (TEST-OverseerTaskQueueTest.testContainsTaskWithRequestId-seed#[47D741316D200685]) [ ] o.a.s.c.ZkTestServer STARTING ZK TEST SERVER
[junit4] 2> 94509 INFO (Thread-92) [ ] o.a.s.c.ZkTestServer client port:0.0.0.0/0.0.0.0:0
[junit4] 2> 94509 INFO (Thread-92) [ ] o.a.s.c.ZkTestServer Starting server
[junit4] 2> 94512 ERROR (Thread-92) [ ] o.a.z.s.ZooKeeperServer ZKShutdownHandler is not registered, so ZooKeeper server won't take any action on ERROR or SHUTDOWN server state changes
[junit4] 2> 94623 INFO (TEST-OverseerTaskQueueTest.testContainsTaskWithRequestId-seed#[47D741316D200685]) [ ] o.a.s.c.ZkTestServer start zk server on port:58718
[junit4] 2> 94635 INFO (zkConnectionManagerCallback-114-thread-1) [ ] o.a.s.c.c.ConnectionManager zkClient has connected
[junit4] 2> 94652 INFO (TEST-OverseerTaskQueueTest.testContainsTaskWithRequestId-seed#[47D741316D200685]) [ ] o.a.s.SolrTestCaseJ4 ###Ending testContainsTaskWithRequestId
[junit4] 2> 94654 ERROR (TEST-OverseerTaskQueueTest.testContainsTaskWithRequestId-seed#[47D741316D200685]) [ ] o.a.z.s.ZooKeeperServer ZKShutdownHandler is not registered, so ZooKeeper server won't take any action on ERROR or SHUTDOWN server state changes
[junit4] 2> 94655 INFO (TEST-OverseerTaskQueueTest.testContainsTaskWithRequestId-seed#[47D741316D200685]) [ ] o.a.s.c.ZkTestServer connecting to 127.0.0.1:58718 58718
[junit4] 2> 94763 INFO (Thread-92) [ ] o.a.s.c.ZkTestServer connecting to 127.0.0.1:58718 58718
[junit4] 2> 94847 INFO (TEST-OverseerTaskQueueTest.testDistributedQueue-seed#[47D741316D200685]) [ ] o.a.s.SolrTestCaseJ4 ###Starting testDistributedQueue
[junit4] 2> 94848 INFO (TEST-OverseerTaskQueueTest.testDistributedQueue-seed#[47D741316D200685]) [ ] o.a.s.c.ZkTestServer STARTING ZK TEST SERVER
[junit4] 2> 94848 INFO (Thread-93) [ ] o.a.s.c.ZkTestServer client port:0.0.0.0/0.0.0.0:0
[junit4] 2> 94848 INFO (Thread-93) [ ] o.a.s.c.ZkTestServer Starting server
[junit4] 2> 94851 ERROR (Thread-93) [ ] o.a.z.s.ZooKeeperServer ZKShutdownHandler is not registered, so ZooKeeper server won't take any action on ERROR or SHUTDOWN server state changes
[junit4] 2> 94958 INFO (TEST-OverseerTaskQueueTest.testDistributedQueue-seed#[47D741316D200685]) [ ] o.a.s.c.ZkTestServer start zk server on port:58722
[junit4] 2> 94969 INFO (zkConnectionManagerCallback-117-thread-1) [ ] o.a.s.c.c.ConnectionManager zkClient has connected
[junit4] 2> 97010 INFO (TEST-OverseerTaskQueueTest.testDistributedQueue-seed#[47D741316D200685]) [ ] o.a.s.SolrTestCaseJ4 ###Ending testDistributedQueue
[junit4] 2> 97012 ERROR (TEST-OverseerTaskQueueTest.testDistributedQueue-seed#[47D741316D200685]) [ ] o.a.z.s.ZooKeeperServer ZKShutdownHandler is not registered, so ZooKeeper server won't take any action on ERROR or SHUTDOWN server state changes
[junit4] 2> 97012 INFO (TEST-OverseerTaskQueueTest.testDistributedQueue-seed#[47D741316D200685]) [ ] o.a.s.c.ZkTestServer connecting to 127.0.0.1:58722 58722
[junit4] 2> 97036 INFO (Thread-93) [ ] o.a.s.c.ZkTestServer connecting to 127.0.0.1:58722 58722
[junit4] 2> 97148 INFO (TEST-OverseerTaskQueueTest.testLocallyOffer-seed#[47D741316D200685]) [ ] o.a.s.SolrTestCaseJ4 ###Starting testLocallyOffer
[junit4] 2> 97148 INFO (TEST-OverseerTaskQueueTest.testLocallyOffer-seed#[47D741316D200685]) [ ] o.a.s.c.ZkTestServer STARTING ZK TEST SERVER
[junit4] 2> 97149 INFO (Thread-96) [ ] o.a.s.c.ZkTestServer client port:0.0.0.0/0.0.0.0:0
[junit4] 2> 97149 INFO (Thread-96) [ ] o.a.s.c.ZkTestServer Starting server
[junit4] 2> 97151 ERROR (Thread-96) [ ] o.a.z.s.ZooKeeperServer ZKShutdownHandler is not registered, so ZooKeeper server won't take any action on ERROR or SHUTDOWN server state changes
[junit4] 2> 97253 INFO (TEST-OverseerTaskQueueTest.testLocallyOffer-seed#[47D741316D200685]) [ ] o.a.s.c.ZkTestServer start zk server on port:58732
[junit4] 2> 97263 INFO (zkConnectionManagerCallback-120-thread-1) [ ] o.a.s.c.c.ConnectionManager zkClient has connected
[junit4] 2> 97779 INFO (TEST-OverseerTaskQueueTest.testLocallyOffer-seed#[47D741316D200685]) [ ] o.a.s.SolrTestCaseJ4 ###Ending testLocallyOffer
[junit4] 2> 97782 ERROR (TEST-OverseerTaskQueueTest.testLocallyOffer-seed#[47D741316D200685]) [ ] o.a.z.s.ZooKeeperServer ZKShutdownHandler is not registered, so ZooKeeper server won't take any action on ERROR or SHUTDOWN server state changes
[junit4] 2> 97782 INFO (TEST-OverseerTaskQueueTest.testLocallyOffer-seed#[47D741316D200685]) [ ] o.a.s.c.ZkTestServer connecting to 127.0.0.1:58732 58732
[junit4] 2> 97796 INFO (Thread-96) [ ] o.a.s.c.ZkTestServer connecting to 127.0.0.1:58732 58732
[junit4] 2> 98305 INFO (TEST-OverseerTaskQueueTest.testLeakChildWatcher-seed#[47D741316D200685]) [ ] o.a.s.SolrTestCaseJ4 ###Starting testLeakChildWatcher
[junit4] 2> 98306 INFO (TEST-OverseerTaskQueueTest.testLeakChildWatcher-seed#[47D741316D200685]) [ ] o.a.s.c.ZkTestServer STARTING ZK TEST SERVER
[junit4] 2> 98307 INFO (Thread-97) [ ] o.a.s.c.ZkTestServer client port:0.0.0.0/0.0.0.0:0
[junit4] 2> 98307 INFO (Thread-97) [ ] o.a.s.c.ZkTestServer Starting server
[junit4] 2> 98309 ERROR (Thread-97) [ ] o.a.z.s.ZooKeeperServer ZKShutdownHandler is not registered, so ZooKeeper server won't take any action on ERROR or SHUTDOWN server state changes
[junit4] 2> 98409 INFO (TEST-OverseerTaskQueueTest.testLeakChildWatcher-seed#[47D741316D200685]) [ ] o.a.s.c.ZkTestServer start zk server on port:58734
[junit4] 2> 98420 INFO (zkConnectionManagerCallback-123-thread-1) [ ] o.a.s.c.c.ConnectionManager zkClient has connected
[junit4] 2> 98562 INFO (TEST-OverseerTaskQueueTest.testLeakChildWatcher-seed#[47D741316D200685]) [ ] o.a.s.SolrTestCaseJ4 ###Ending testLeakChildWatcher
[junit4] 2> 98564 ERROR (TEST-OverseerTaskQueueTest.testLeakChildWatcher-seed#[47D741316D200685]) [ ] o.a.z.s.ZooKeeperServer ZKShutdownHandler is not registered, so ZooKeeper server won't take any action on ERROR or SHUTDOWN server state changes
[junit4] 2> 98565 INFO (TEST-OverseerTaskQueueTest.testLeakChildWatcher-seed#[47D741316D200685]) [ ] o.a.s.c.ZkTestServer connecting to 127.0.0.1:58734 58734
[junit4] 2> 98583 INFO (Thread-97) [ ] o.a.s.c.ZkTestServer connecting to 127.0.0.1:58734 58734
[junit4] 2> 98715 INFO (TEST-OverseerTaskQueueTest.testDistributedQueueBlocking-seed#[47D741316D200685]) [ ] o.a.s.SolrTestCaseJ4 ###Starting testDistributedQueueBlocking
[junit4] 2> 98716 INFO (TEST-OverseerTaskQueueTest.testDistributedQueueBlocking-seed#[47D741316D200685]) [ ] o.a.s.c.ZkTestServer STARTING ZK TEST SERVER
[junit4] 2> 98716 INFO (Thread-98) [ ] o.a.s.c.ZkTestServer client port:0.0.0.0/0.0.0.0:0
[junit4] 2> 98716 INFO (Thread-98) [ ] o.a.s.c.ZkTestServer Starting server
[junit4] 2> 98718 ERROR (Thread-98) [ ] o.a.z.s.ZooKeeperServer ZKShutdownHandler is not registered, so ZooKeeper server won't take any action on ERROR or SHUTDOWN server state changes
[junit4] 2> 98817 INFO (TEST-OverseerTaskQueueTest.testDistributedQueueBlocking-seed#[47D741316D200685]) [ ] o.a.s.c.ZkTestServer start zk server on port:58736
[junit4] 2> 98827 INFO (zkConnectionManagerCallback-126-thread-1) [ ] o.a.s.c.c.ConnectionManager zkClient has connected
[junit4] 2> 100066 WARN (zkConnectionManagerCallback-126-thread-1) [ ] o.a.s.c.c.ConnectionManager Watcher org.apache.solr.common.cloud.ConnectionManager@275b5b6a name: ZooKeeperConnection Watcher:127.0.0.1:58736/solr got event WatchedEvent state:Disconnected type:None path:null path: null type: None
[junit4] 2> 100066 WARN (zkConnectionManagerCallback-126-thread-1) [ ] o.a.s.c.c.ConnectionManager zkClient has disconnected
[junit4] 2> 101408 WARN (TEST-OverseerTaskQueueTest.testDistributedQueueBlocking-seed#[47D741316D200685]-SendThread(127.0.0.1:58736)) [ ] o.a.z.ClientCnxn Unable to reconnect to ZooKeeper service, session 0x10029db46b80000 has expired
[junit4] 2> 101409 WARN (zkConnectionManagerCallback-126-thread-1) [ ] o.a.s.c.c.ConnectionManager Watcher org.apache.solr.common.cloud.ConnectionManager@275b5b6a name: ZooKeeperConnection Watcher:127.0.0.1:58736/solr got event WatchedEvent state:Expired type:None path:null path: null type: None
[junit4] 2> 101409 WARN (zkConnectionManagerCallback-126-thread-1) [ ] o.a.s.c.c.ConnectionManager Our previous ZooKeeper session was expired. Attempting to reconnect to recover relationship with ZooKeeper...
[junit4] 2> 101419 WARN (zkConnectionManagerCallback-126-thread-1) [ ] o.a.s.c.c.DefaultConnectionStrategy Connection expired - starting a new one...
[junit4] 2> 101421 INFO (zkConnectionManagerCallback-126-thread-1-EventThread) [ ] o.a.s.c.c.ConnectionManager zkClient has connected
[junit4] 2> 101421 INFO (zkConnectionManagerCallback-126-thread-1) [ ] o.a.s.c.c.ConnectionManager Connection with ZooKeeper reestablished.
[junit4] 2> 101421 INFO (zkConnectionManagerCallback-126-thread-1) [ ] o.a.s.c.c.DefaultConnectionStrategy Reconnected to ZooKeeper
[junit4] 2> 101421 INFO (zkConnectionManagerCallback-126-thread-1) [ ] o.a.s.c.c.ConnectionManager zkClient Connected:true
[junit4] 2> 102598 INFO (TEST-OverseerTaskQueueTest.testDistributedQueueBlocking-seed#[47D741316D200685]) [ ] o.a.s.SolrTestCaseJ4 ###Ending testDistributedQueueBlocking
[junit4] 2> 102599 ERROR (TEST-OverseerTaskQueueTest.testDistributedQueueBlocking-seed#[47D741316D200685]) [ ] o.a.z.s.ZooKeeperServer ZKShutdownHandler is not registered, so ZooKeeper server won't take any action on ERROR or SHUTDOWN server state changes
[junit4] 2> 102600 INFO (TEST-OverseerTaskQueueTest.testDistributedQueueBlocking-seed#[47D741316D200685]) [ ] o.a.s.c.ZkTestServer connecting to 127.0.0.1:58736 58736
[junit4] 2> 102707 INFO (Thread-98) [ ] o.a.s.c.ZkTestServer connecting to 127.0.0.1:58736 58736
[junit4] 2> 102832 WARN (Thread-98) [ ] o.a.s.c.ZkTestServer Watch limit violations:
[junit4] 2> Maximum concurrent children watches above limit:
[junit4] 2>
[junit4] 2> 2 /solr/distqueue/test
[junit4] 2>
[junit4] 2> 102834 INFO (TEST-OverseerTaskQueueTest.testPeekElements-seed#[47D741316D200685]) [ ] o.a.s.SolrTestCaseJ4 ###Starting testPeekElements
[junit4] 2> 102835 INFO (TEST-OverseerTaskQueueTest.testPeekElements-seed#[47D741316D200685]) [ ] o.a.s.c.ZkTestServer STARTING ZK TEST SERVER
[junit4] 2> 102836 INFO (Thread-99) [ ] o.a.s.c.ZkTestServer client port:0.0.0.0/0.0.0.0:0
[junit4] 2> 102836 INFO (Thread-99) [ ] o.a.s.c.ZkTestServer Starting server
[junit4] 2> 102837 ERROR (Thread-99) [ ] o.a.z.s.ZooKeeperServer ZKShutdownHandler is not registered, so ZooKeeper server won't take any action on ERROR or SHUTDOWN server state changes
[junit4] 2> 102936 INFO (TEST-OverseerTaskQueueTest.testPeekElements-seed#[47D741316D200685]) [ ] o.a.s.c.ZkTestServer start zk server on port:58754
[junit4] 2> 102946 INFO (zkConnectionManagerCallback-129-thread-1) [ ] o.a.s.c.c.ConnectionManager zkClient has connected
[junit4] 2> 104993 INFO (TEST-OverseerTaskQueueTest.testPeekElements-seed#[47D741316D200685]) [ ] o.a.s.SolrTestCaseJ4 ###Ending testPeekElements
[junit4] 2> 104995 ERROR (TEST-OverseerTaskQueueTest.testPeekElements-seed#[47D741316D200685]) [ ] o.a.z.s.ZooKeeperServer ZKShutdownHandler is not registered, so ZooKeeper server won't take any action on ERROR or SHUTDOWN server state changes
[junit4] 2> 104995 INFO (TEST-OverseerTaskQueueTest.testPeekElements-seed#[47D741316D200685]) [ ] o.a.s.c.ZkTestServer connecting to 127.0.0.1:58754 58754
[junit4] 2> 105019 INFO (Thread-99) [ ] o.a.s.c.ZkTestServer connecting to 127.0.0.1:58754 58754
[junit4] 2> NOTE: reproduce with: ant test -Dtestcase=OverseerTaskQueueTest -Dtests.method=testPeekElements -Dtests.seed=47D741316D200685 -Dtests.slow=true -Dtests.locale=smn -Dtests.timezone=Asia/Vladivostok -Dtests.asserts=true -Dtests.file.encoding=US-ASCII
[junit4] FAILURE 3.23s J1 | OverseerTaskQueueTest.testPeekElements <<<
[junit4] > Throwable #1: java.lang.AssertionError
[junit4] > at __randomizedtesting.SeedInfo.seed([47D741316D200685:BAF9FB10BD195298]:0)
[junit4] > at org.apache.solr.cloud.DistributedQueueTest.testPeekElements(DistributedQueueTest.java:265)
[junit4] > at java.base/jdk.internal.reflect.NativeMethodAccessorImpl.invoke0(Native Method)
[junit4] > at java.base/jdk.internal.reflect.NativeMethodAccessorImpl.invoke(NativeMethodAccessorImpl.java:62)
[junit4] > at java.base/jdk.internal.reflect.DelegatingMethodAccessorImpl.invoke(DelegatingMethodAccessorImpl.java:43)
[junit4] > at java.base/java.lang.reflect.Method.invoke(Method.java:564)
[junit4] > at java.base/java.lang.Thread.run(Thread.java:844)
[junit4] 2> NOTE: leaving temporary files on disk at: /Users/jenkins/workspace/Lucene-Solr-7.x-MacOSX/solr/build/solr-core/test/J1/temp/solr.cloud.OverseerTaskQueueTest_47D741316D200685-001
[junit4] 2> NOTE: test params are: codec=Asserting(Lucene70): {}, docValues:{}, maxPointsInLeafNode=104, maxMBSortInHeap=6.526180030805497, sim=RandomSimilarity(queryNorm=false): {}, locale=smn, timezone=Asia/Vladivostok
[junit4] 2> NOTE: Mac OS X 10.11.6 x86_64/Oracle Corporation 9 (64-bit)/cpus=3,threads=1,free=66512376,total=115462144
[junit4] 2> NOTE: All tests run in this JVM: [LeaderFailoverAfterPartitionTest, MergeStrategyTest, SearchRateTriggerTest, TermVectorComponentTest, DisMaxRequestHandlerTest, OverseerTaskQueueTest]
[junit4] Completed [33/808 (1!)] on J1 in 12.57s, 7 tests, 1 failure <<< FAILURES!
[...truncated 2778 lines...]
[junit4] JVM J1: stderr was not empty, see: /Users/jenkins/workspace/Lucene-Solr-7.x-MacOSX/solr/build/solr-core/test/temp/junit4-J1-20180528_163306_8953756912177393695128.syserr
[junit4] >>> JVM J1 emitted unexpected output (verbatim) ----
[junit4] Java HotSpot(TM) 64-Bit Server VM warning: Option UseConcMarkSweepGC was deprecated in version 9.0 and will likely be removed in a future release.
[junit4] <<< JVM J1: EOF ----
[...truncated 3 lines...]
[junit4] JVM J0: stderr was not empty, see: /Users/jenkins/workspace/Lucene-Solr-7.x-MacOSX/solr/build/solr-core/test/temp/junit4-J0-20180528_163306_89516553146811342548052.syserr
[junit4] >>> JVM J0 emitted unexpected output (verbatim) ----
[junit4] Java HotSpot(TM) 64-Bit Server VM warning: Option UseConcMarkSweepGC was deprecated in version 9.0 and will likely be removed in a future release.
[junit4] <<< JVM J0: EOF ----
[...truncated 945 lines...]
[junit4] JVM J1: stderr was not empty, see: /Users/jenkins/workspace/Lucene-Solr-7.x-MacOSX/solr/build/solr-solrj/test/temp/junit4-J1-20180528_172319_4185945168565035994755.syserr
[junit4] >>> JVM J1 emitted unexpected output (verbatim) ----
[junit4] Java HotSpot(TM) 64-Bit Server VM warning: Option UseConcMarkSweepGC was deprecated in version 9.0 and will likely be removed in a future release.
[junit4] <<< JVM J1: EOF ----
[...truncated 3 lines...]
[junit4] JVM J0: stderr was not empty, see: /Users/jenkins/workspace/Lucene-Solr-7.x-MacOSX/solr/build/solr-solrj/test/temp/junit4-J0-20180528_172319_4184100876248726509161.syserr
[junit4] >>> JVM J0 emitted unexpected output (verbatim) ----
[junit4] Java HotSpot(TM) 64-Bit Server VM warning: Option UseConcMarkSweepGC was deprecated in version 9.0 and will likely be removed in a future release.
[junit4] <<< JVM J0: EOF ----
[...truncated 1599 lines...]
[junit4] JVM J0: stderr was not empty, see: /Users/jenkins/workspace/Lucene-Solr-7.x-MacOSX/solr/build/contrib/solr-analysis-extras/test/temp/junit4-J0-20180528_172707_0824941755017154252851.syserr
[junit4] >>> JVM J0 emitted unexpected output (verbatim) ----
[junit4] Java HotSpot(TM) 64-Bit Server VM warning: Option UseConcMarkSweepGC was deprecated in version 9.0 and will likely be removed in a future release.
[junit4] <<< JVM J0: EOF ----
[...truncated 3 lines...]
[junit4] JVM J1: stderr was not empty, see: /Users/jenkins/workspace/Lucene-Solr-7.x-MacOSX/solr/build/contrib/solr-analysis-extras/test/temp/junit4-J1-20180528_172707_0828247491559457145662.syserr
[junit4] >>> JVM J1 emitted unexpected output (verbatim) ----
[junit4] Java HotSpot(TM) 64-Bit Server VM warning: Option UseConcMarkSweepGC was deprecated in version 9.0 and will likely be removed in a future release.
[junit4] <<< JVM J1: EOF ----
[...truncated 791 lines...]
[junit4] JVM J1: stderr was not empty, see: /Users/jenkins/workspace/Lucene-Solr-7.x-MacOSX/solr/build/contrib/solr-analytics/test/temp/junit4-J1-20180528_172721_3271702038088234607910.syserr
[junit4] >>> JVM J1 emitted unexpected output (verbatim) ----
[junit4] Java HotSpot(TM) 64-Bit Server VM warning: Option UseConcMarkSweepGC was deprecated in version 9.0 and will likely be removed in a future release.
[junit4] <<< JVM J1: EOF ----
[...truncated 3 lines...]
[junit4] JVM J0: stderr was not empty, see: /Users/jenkins/workspace/Lucene-Solr-7.x-MacOSX/solr/build/contrib/solr-analytics/test/temp/junit4-J0-20180528_172721_32714159691247532915356.syserr
[junit4] >>> JVM J0 emitted unexpected output (verbatim) ----
[junit4] Java HotSpot(TM) 64-Bit Server VM warning: Option UseConcMarkSweepGC was deprecated in version 9.0 and will likely be removed in a future release.
[junit4] <<< JVM J0: EOF ----
[...truncated 562 lines...]
[junit4] JVM J1: stderr was not empty, see: /Users/jenkins/workspace/Lucene-Solr-7.x-MacOSX/solr/build/contrib/solr-clustering/test/temp/junit4-J1-20180528_172824_6823946800054945072448.syserr
[junit4] >>> JVM J1 emitted unexpected output (verbatim) ----
[junit4] Java HotSpot(TM) 64-Bit Server VM warning: Option UseConcMarkSweepGC was deprecated in version 9.0 and will likely be removed in a future release.
[junit4] <<< JVM J1: EOF ----
[...truncated 3 lines...]
[junit4] JVM J0: stderr was not empty, see: /Users/jenkins/workspace/Lucene-Solr-7.x-MacOSX/solr/build/contrib/solr-clustering/test/temp/junit4-J0-20180528_172824_68215331621538592919537.syserr
[junit4] >>> JVM J0 emitted unexpected output (verbatim) ----
[junit4] Java HotSpot(TM) 64-Bit Server VM warning: Option UseConcMarkSweepGC was deprecated in version 9.0 and will likely be removed in a future release.
[junit4] <<< JVM J0: EOF ----
[...truncated 1278 lines...]
[junit4] JVM J1: stderr was not empty, see: /Users/jenkins/workspace/Lucene-Solr-7.x-MacOSX/solr/build/contrib/solr-dataimporthandler-extras/test/temp/junit4-J1-20180528_172848_44712310672399380376132.syserr
[junit4] >>> JVM J1 emitted unexpected output (verbatim) ----
[junit4] Java HotSpot(TM) 64-Bit Server VM warning: Option UseConcMarkSweepGC was deprecated in version 9.0 and will likely be removed in a future release.
[junit4] <<< JVM J1: EOF ----
[...truncated 3 lines...]
[junit4] JVM J0: stderr was not empty, see: /Users/jenkins/workspace/Lucene-Solr-7.x-MacOSX/solr/build/contrib/solr-dataimporthandler-extras/test/temp/junit4-J0-20180528_172848_4476404565748326328629.syserr
[junit4] >>> JVM J0 emitted unexpected output (verbatim) ----
[junit4] Java HotSpot(TM) 64-Bit Server VM warning: Option UseConcMarkSweepGC was deprecated in version 9.0 and will likely be removed in a future release.
[junit4] <<< JVM J0: EOF ----
[...truncated 658 lines...]
[junit4] JVM J0: stderr was not empty, see: /Users/jenkins/workspace/Lucene-Solr-7.x-MacOSX/solr/build/contrib/solr-dataimporthandler/test/temp/junit4-J0-20180528_172900_91416695588266140740309.syserr
[junit4] >>> JVM J0 emitted unexpected output (verbatim) ----
[junit4] Java HotSpot(TM) 64-Bit Server VM warning: Option UseConcMarkSweepGC was deprecated in version 9.0 and will likely be removed in a future release.
[junit4] <<< JVM J0: EOF ----
[junit4] JVM J1: stderr was not empty, see: /Users/jenkins/workspace/Lucene-Solr-7.x-MacOSX/solr/build/contrib/solr-dataimporthandler/test/temp/junit4-J1-20180528_172900_91411337360177912306041.syserr
[junit4] >>> JVM J1 emitted unexpected output (verbatim) ----
[junit4] Java HotSpot(TM) 64-Bit Server VM warning: Option UseConcMarkSweepGC was deprecated in version 9.0 and will likely be removed in a future release.
[junit4] <<< JVM J1: EOF ----
[...truncated 567 lines...]
[junit4] JVM J0: stderr was not empty, see: /Users/jenkins/workspace/Lucene-Solr-7.x-MacOSX/solr/build/contrib/solr-cell/test/temp/junit4-J0-20180528_172930_2838350978409248039226.syserr
[junit4] >>> JVM J0 emitted unexpected output (verbatim) ----
[junit4] Java HotSpot(TM) 64-Bit Server VM warning: Option UseConcMarkSweepGC was deprecated in version 9.0 and will likely be removed in a future release.
[junit4] <<< JVM J0: EOF ----
[...truncated 3 lines...]
[junit4] JVM J1: stderr was not empty, see: /Users/jenkins/workspace/Lucene-Solr-7.x-MacOSX/solr/build/contrib/solr-cell/test/temp/junit4-J1-20180528_172930_28317772499257494709608.syserr
[junit4] >>> JVM J1 emitted unexpected output (verbatim) ----
[junit4] Java HotSpot(TM) 64-Bit Server VM warning: Option UseConcMarkSweepGC was deprecated in version 9.0 and will likely be removed in a future release.
[junit4] <<< JVM J1: EOF ----
[...truncated 570 lines...]
[junit4] JVM J0: stderr was not empty, see: /Users/jenkins/workspace/Lucene-Solr-7.x-MacOSX/solr/build/contrib/solr-langid/test/temp/junit4-J0-20180528_172947_37714777656459098855273.syserr
[junit4] >>> JVM J0 emitted unexpected output (verbatim) ----
[junit4] Java HotSpot(TM) 64-Bit Server VM warning: Option UseConcMarkSweepGC was deprecated in version 9.0 and will likely be removed in a future release.
[junit4] <<< JVM J0: EOF ----
[...truncated 3 lines...]
[junit4] JVM J1: stderr was not empty, see: /Users/jenkins/workspace/Lucene-Solr-7.x-MacOSX/solr/build/contrib/solr-langid/test/temp/junit4-J1-20180528_172947_3779569294507855077706.syserr
[junit4] >>> JVM J1 emitted unexpected output (verbatim) ----
[junit4] Java HotSpot(TM) 64-Bit Server VM warning: Option UseConcMarkSweepGC was deprecated in version 9.0 and will likely be removed in a future release.
[junit4] <<< JVM J1: EOF ----
[...truncated 670 lines...]
[junit4] JVM J0: stderr was not empty, see: /Users/jenkins/workspace/Lucene-Solr-7.x-MacOSX/solr/build/contrib/solr-ltr/test/temp/junit4-J0-20180528_172959_55218066621432381500088.syserr
[junit4] >>> JVM J0 emitted unexpected output (verbatim) ----
[junit4] Java HotSpot(TM) 64-Bit Server VM warning: Option UseConcMarkSweepGC was deprecated in version 9.0 and will likely be removed in a future release.
[junit4] <<< JVM J0: EOF ----
[...truncated 3 lines...]
[junit4] JVM J1: stderr was not empty, see: /Users/jenkins/workspace/Lucene-Solr-7.x-MacOSX/solr/build/contrib/solr-ltr/test/temp/junit4-J1-20180528_172959_5533778723460090299595.syserr
[junit4] >>> JVM J1 emitted unexpected output (verbatim) ----
[junit4] Java HotSpot(TM) 64-Bit Server VM warning: Option UseConcMarkSweepGC was deprecated in version 9.0 and will likely be removed in a future release.
[junit4] <<< JVM J1: EOF ----
[...truncated 568 lines...]
[junit4] JVM J1: stderr was not empty, see: /Users/jenkins/workspace/Lucene-Solr-7.x-MacOSX/solr/build/contrib/solr-prometheus-exporter/test/temp/junit4-J1-20180528_173033_5369617246264066770039.syserr
[junit4] >>> JVM J1 emitted unexpected output (verbatim) ----
[junit4] Java HotSpot(TM) 64-Bit Server VM warning: Option UseConcMarkSweepGC was deprecated in version 9.0 and will likely be removed in a future release.
[junit4] <<< JVM J1: EOF ----
[junit4] JVM J0: stderr was not empty, see: /Users/jenkins/workspace/Lucene-Solr-7.x-MacOSX/solr/build/contrib/solr-prometheus-exporter/test/temp/junit4-J0-20180528_173033_536790501440636688509.syserr
[junit4] >>> JVM J0 emitted unexpected output (verbatim) ----
[junit4] Java HotSpot(TM) 64-Bit Server VM warning: Option UseConcMarkSweepGC was deprecated in version 9.0 and will likely be removed in a future release.
[junit4] <<< JVM J0: EOF ----
[...truncated 607 lines...]
[junit4] JVM J1: stderr was not empty, see: /Users/jenkins/workspace/Lucene-Solr-7.x-MacOSX/solr/build/contrib/solr-uima/test/temp/junit4-J1-20180528_173057_36216675461560588568700.syserr
[junit4] >>> JVM J1 emitted unexpected output (verbatim) ----
[junit4] Java HotSpot(TM) 64-Bit Server VM warning: Option UseConcMarkSweepGC was deprecated in version 9.0 and will likely be removed in a future release.
[junit4] <<< JVM J1: EOF ----
[...truncated 3 lines...]
[junit4] JVM J0: stderr was not empty, see: /Users/jenkins/workspace/Lucene-Solr-7.x-MacOSX/solr/build/contrib/solr-uima/test/temp/junit4-J0-20180528_173057_36212744164363635507605.syserr
[junit4] >>> JVM J0 emitted unexpected output (verbatim) ----
[junit4] Java HotSpot(TM) 64-Bit Server VM warning: Option UseConcMarkSweepGC was deprecated in version 9.0 and will likely be removed in a future release.
[junit4] <<< JVM J0: EOF ----
[...truncated 557 lines...]
[junit4] JVM J0: stderr was not empty, see: /Users/jenkins/workspace/Lucene-Solr-7.x-MacOSX/solr/build/contrib/solr-velocity/test/temp/junit4-J0-20180528_173119_3104281903559045536506.syserr
[junit4] >>> JVM J0 emitted unexpected output (verbatim) ----
[junit4] Java HotSpot(TM) 64-Bit Server VM warning: Option UseConcMarkSweepGC was deprecated in version 9.0 and will likely be removed in a future release.
[junit4] <<< JVM J0: EOF ----
[...truncated 34357 lines...]
[repro] Jenkins log URL: https://jenkins.thetaphi.de/job/Lucene-Solr-7.x-MacOSX/674/consoleText
[repro] Revision: 9533b93e84277ceee9471bc42564443c4a86e816
[repro] Ant options: "-Dargs=-XX:+UseCompressedOops -XX:+UseConcMarkSweepGC"
[repro] Repro line: ant test -Dtestcase=OverseerTaskQueueTest -Dtests.method=testPeekElements -Dtests.seed=47D741316D200685 -Dtests.slow=true -Dtests.locale=smn -Dtests.timezone=Asia/Vladivostok -Dtests.asserts=true -Dtests.file.encoding=US-ASCII
[repro] ant clean
[...truncated 6 lines...]
[repro] Test suites by module:
[repro] solr/core
[repro] OverseerTaskQueueTest
[repro] ant compile-test
[...truncated 3342 lines...]
[repro] ant test-nocompile -Dtests.dups=5 -Dtests.maxfailures=5 -Dtests.class="*.OverseerTaskQueueTest" -Dtests.showOutput=onerror "-Dargs=-XX:+UseCompressedOops -XX:+UseConcMarkSweepGC" -Dtests.seed=47D741316D200685 -Dtests.slow=true -Dtests.locale=smn -Dtests.timezone=Asia/Vladivostok -Dtests.asserts=true -Dtests.file.encoding=US-ASCII
[...truncated 72 lines...]
[junit4] JVM J0: stderr was not empty, see: /Users/jenkins/workspace/Lucene-Solr-7.x-MacOSX/solr/build/solr-core/test/temp/junit4-J0-20180528_173917_88416339550402093986180.syserr
[junit4] >>> JVM J0 emitted unexpected output (verbatim) ----
[junit4] Java HotSpot(TM) 64-Bit Server VM warning: Option UseConcMarkSweepGC was deprecated in version 9.0 and will likely be removed in a future release.
[junit4] <<< JVM J0: EOF ----
[...truncated 10 lines...]
[junit4] JVM J1: stderr was not empty, see: /Users/jenkins/workspace/Lucene-Solr-7.x-MacOSX/solr/build/solr-core/test/temp/junit4-J1-20180528_173917_8849032615249700127962.syserr
[junit4] >>> JVM J1 emitted unexpected output (verbatim) ----
[junit4] Java HotSpot(TM) 64-Bit Server VM warning: Option UseConcMarkSweepGC was deprecated in version 9.0 and will likely be removed in a future release.
[junit4] <<< JVM J1: EOF ----
[...truncated 21 lines...]
[repro] Failures:
[repro] 0/5 failed: org.apache.solr.cloud.OverseerTaskQueueTest
[repro] Exiting with code 0
[...truncated 70 lines...]
[JENKINS] Lucene-Solr-7.x-MacOSX (64bit/jdk1.8.0) - Build # 675 -
Still Unstable!
Posted by Policeman Jenkins Server <je...@thetaphi.de>.
Build: https://jenkins.thetaphi.de/job/Lucene-Solr-7.x-MacOSX/675/
Java: 64bit/jdk1.8.0 -XX:-UseCompressedOops -XX:+UseG1GC
9 tests failed.
FAILED: org.apache.solr.cloud.autoscaling.IndexSizeTriggerTest.testSplitIntegration
Error Message:
last state: DocCollection(testSplitIntegration_collection//clusterstate.json/48)={ "replicationFactor":"2", "pullReplicas":"0", "router":{"name":"compositeId"}, "maxShardsPerNode":"2", "autoAddReplicas":"false", "nrtReplicas":"2", "tlogReplicas":"0", "autoCreated":"true", "shards":{ "shard2":{ "replicas":{ "core_node3":{ "core":"testSplitIntegration_collection_shard2_replica_n3", "leader":"true", "SEARCHER.searcher.maxDoc":11, "SEARCHER.searcher.deletedDocs":0, "INDEX.sizeInBytes":1, "node_name":"127.0.0.1:10001_solr", "state":"active", "type":"NRT", "SEARCHER.searcher.numDocs":11}, "core_node4":{ "core":"testSplitIntegration_collection_shard2_replica_n4", "SEARCHER.searcher.maxDoc":11, "SEARCHER.searcher.deletedDocs":0, "INDEX.sizeInBytes":1, "node_name":"127.0.0.1:10000_solr", "state":"active", "type":"NRT", "SEARCHER.searcher.numDocs":11}}, "range":"0-7fffffff", "state":"active"}, "shard1":{ "stateTimestamp":"1527778875353205950", "replicas":{ "core_node1":{ "core":"testSplitIntegration_collection_shard1_replica_n1", "leader":"true", "SEARCHER.searcher.maxDoc":14, "SEARCHER.searcher.deletedDocs":0, "INDEX.sizeInBytes":1, "node_name":"127.0.0.1:10001_solr", "state":"active", "type":"NRT", "SEARCHER.searcher.numDocs":14}, "core_node2":{ "core":"testSplitIntegration_collection_shard1_replica_n2", "SEARCHER.searcher.maxDoc":14, "SEARCHER.searcher.deletedDocs":0, "INDEX.sizeInBytes":1, "node_name":"127.0.0.1:10000_solr", "state":"active", "type":"NRT", "SEARCHER.searcher.numDocs":14}}, "range":"80000000-ffffffff", "state":"inactive"}, "shard1_1":{ "parent":"shard1", "stateTimestamp":"1527778875377338700", "range":"c0000000-ffffffff", "state":"active", "replicas":{ "core_node10":{ "leader":"true", "core":"testSplitIntegration_collection_shard1_1_replica1", "SEARCHER.searcher.maxDoc":7, "SEARCHER.searcher.deletedDocs":0, "INDEX.sizeInBytes":1, "node_name":"127.0.0.1:10000_solr", "base_url":"http://127.0.0.1:10000/solr", "state":"active", "type":"NRT", "SEARCHER.searcher.numDocs":7}, "core_node9":{ "core":"testSplitIntegration_collection_shard1_1_replica0", "SEARCHER.searcher.maxDoc":7, "SEARCHER.searcher.deletedDocs":0, "INDEX.sizeInBytes":1, "node_name":"127.0.0.1:10001_solr", "base_url":"http://127.0.0.1:10001/solr", "state":"active", "type":"NRT", "SEARCHER.searcher.numDocs":7}}}, "shard1_0":{ "parent":"shard1", "stateTimestamp":"1527778875376842250", "range":"80000000-bfffffff", "state":"active", "replicas":{ "core_node7":{ "leader":"true", "core":"testSplitIntegration_collection_shard1_0_replica0", "SEARCHER.searcher.maxDoc":7, "SEARCHER.searcher.deletedDocs":0, "INDEX.sizeInBytes":1, "node_name":"127.0.0.1:10001_solr", "base_url":"http://127.0.0.1:10001/solr", "state":"active", "type":"NRT", "SEARCHER.searcher.numDocs":7}, "core_node8":{ "core":"testSplitIntegration_collection_shard1_0_replica1", "SEARCHER.searcher.maxDoc":7, "SEARCHER.searcher.deletedDocs":0, "INDEX.sizeInBytes":1, "node_name":"127.0.0.1:10000_solr", "base_url":"http://127.0.0.1:10000/solr", "state":"active", "type":"NRT", "SEARCHER.searcher.numDocs":7}}}}}
Stack Trace:
java.util.concurrent.TimeoutException: last state: DocCollection(testSplitIntegration_collection//clusterstate.json/48)={
"replicationFactor":"2",
"pullReplicas":"0",
"router":{"name":"compositeId"},
"maxShardsPerNode":"2",
"autoAddReplicas":"false",
"nrtReplicas":"2",
"tlogReplicas":"0",
"autoCreated":"true",
"shards":{
"shard2":{
"replicas":{
"core_node3":{
"core":"testSplitIntegration_collection_shard2_replica_n3",
"leader":"true",
"SEARCHER.searcher.maxDoc":11,
"SEARCHER.searcher.deletedDocs":0,
"INDEX.sizeInBytes":1,
"node_name":"127.0.0.1:10001_solr",
"state":"active",
"type":"NRT",
"SEARCHER.searcher.numDocs":11},
"core_node4":{
"core":"testSplitIntegration_collection_shard2_replica_n4",
"SEARCHER.searcher.maxDoc":11,
"SEARCHER.searcher.deletedDocs":0,
"INDEX.sizeInBytes":1,
"node_name":"127.0.0.1:10000_solr",
"state":"active",
"type":"NRT",
"SEARCHER.searcher.numDocs":11}},
"range":"0-7fffffff",
"state":"active"},
"shard1":{
"stateTimestamp":"1527778875353205950",
"replicas":{
"core_node1":{
"core":"testSplitIntegration_collection_shard1_replica_n1",
"leader":"true",
"SEARCHER.searcher.maxDoc":14,
"SEARCHER.searcher.deletedDocs":0,
"INDEX.sizeInBytes":1,
"node_name":"127.0.0.1:10001_solr",
"state":"active",
"type":"NRT",
"SEARCHER.searcher.numDocs":14},
"core_node2":{
"core":"testSplitIntegration_collection_shard1_replica_n2",
"SEARCHER.searcher.maxDoc":14,
"SEARCHER.searcher.deletedDocs":0,
"INDEX.sizeInBytes":1,
"node_name":"127.0.0.1:10000_solr",
"state":"active",
"type":"NRT",
"SEARCHER.searcher.numDocs":14}},
"range":"80000000-ffffffff",
"state":"inactive"},
"shard1_1":{
"parent":"shard1",
"stateTimestamp":"1527778875377338700",
"range":"c0000000-ffffffff",
"state":"active",
"replicas":{
"core_node10":{
"leader":"true",
"core":"testSplitIntegration_collection_shard1_1_replica1",
"SEARCHER.searcher.maxDoc":7,
"SEARCHER.searcher.deletedDocs":0,
"INDEX.sizeInBytes":1,
"node_name":"127.0.0.1:10000_solr",
"base_url":"http://127.0.0.1:10000/solr",
"state":"active",
"type":"NRT",
"SEARCHER.searcher.numDocs":7},
"core_node9":{
"core":"testSplitIntegration_collection_shard1_1_replica0",
"SEARCHER.searcher.maxDoc":7,
"SEARCHER.searcher.deletedDocs":0,
"INDEX.sizeInBytes":1,
"node_name":"127.0.0.1:10001_solr",
"base_url":"http://127.0.0.1:10001/solr",
"state":"active",
"type":"NRT",
"SEARCHER.searcher.numDocs":7}}},
"shard1_0":{
"parent":"shard1",
"stateTimestamp":"1527778875376842250",
"range":"80000000-bfffffff",
"state":"active",
"replicas":{
"core_node7":{
"leader":"true",
"core":"testSplitIntegration_collection_shard1_0_replica0",
"SEARCHER.searcher.maxDoc":7,
"SEARCHER.searcher.deletedDocs":0,
"INDEX.sizeInBytes":1,
"node_name":"127.0.0.1:10001_solr",
"base_url":"http://127.0.0.1:10001/solr",
"state":"active",
"type":"NRT",
"SEARCHER.searcher.numDocs":7},
"core_node8":{
"core":"testSplitIntegration_collection_shard1_0_replica1",
"SEARCHER.searcher.maxDoc":7,
"SEARCHER.searcher.deletedDocs":0,
"INDEX.sizeInBytes":1,
"node_name":"127.0.0.1:10000_solr",
"base_url":"http://127.0.0.1:10000/solr",
"state":"active",
"type":"NRT",
"SEARCHER.searcher.numDocs":7}}}}}
at __randomizedtesting.SeedInfo.seed([866ED146DF1B2332:BFE06806F0E4EACC]:0)
at org.apache.solr.cloud.CloudTestUtils.waitForState(CloudTestUtils.java:111)
at org.apache.solr.cloud.autoscaling.IndexSizeTriggerTest.testSplitIntegration(IndexSizeTriggerTest.java:299)
at sun.reflect.NativeMethodAccessorImpl.invoke0(Native Method)
at sun.reflect.NativeMethodAccessorImpl.invoke(NativeMethodAccessorImpl.java:62)
at sun.reflect.DelegatingMethodAccessorImpl.invoke(DelegatingMethodAccessorImpl.java:43)
at java.lang.reflect.Method.invoke(Method.java:498)
at com.carrotsearch.randomizedtesting.RandomizedRunner.invoke(RandomizedRunner.java:1737)
at com.carrotsearch.randomizedtesting.RandomizedRunner$8.evaluate(RandomizedRunner.java:934)
at com.carrotsearch.randomizedtesting.RandomizedRunner$9.evaluate(RandomizedRunner.java:970)
at com.carrotsearch.randomizedtesting.RandomizedRunner$10.evaluate(RandomizedRunner.java:984)
at com.carrotsearch.randomizedtesting.rules.SystemPropertiesRestoreRule$1.evaluate(SystemPropertiesRestoreRule.java:57)
at org.apache.lucene.util.TestRuleSetupTeardownChained$1.evaluate(TestRuleSetupTeardownChained.java:49)
at org.apache.lucene.util.AbstractBeforeAfterRule$1.evaluate(AbstractBeforeAfterRule.java:45)
at org.apache.lucene.util.TestRuleThreadAndTestName$1.evaluate(TestRuleThreadAndTestName.java:48)
at org.apache.lucene.util.TestRuleIgnoreAfterMaxFailures$1.evaluate(TestRuleIgnoreAfterMaxFailures.java:64)
at org.apache.lucene.util.TestRuleMarkFailure$1.evaluate(TestRuleMarkFailure.java:47)
at com.carrotsearch.randomizedtesting.rules.StatementAdapter.evaluate(StatementAdapter.java:36)
at com.carrotsearch.randomizedtesting.ThreadLeakControl$StatementRunner.run(ThreadLeakControl.java:368)
at com.carrotsearch.randomizedtesting.ThreadLeakControl.forkTimeoutingTask(ThreadLeakControl.java:817)
at com.carrotsearch.randomizedtesting.ThreadLeakControl$3.evaluate(ThreadLeakControl.java:468)
at com.carrotsearch.randomizedtesting.RandomizedRunner.runSingleTest(RandomizedRunner.java:943)
at com.carrotsearch.randomizedtesting.RandomizedRunner$5.evaluate(RandomizedRunner.java:829)
at com.carrotsearch.randomizedtesting.RandomizedRunner$6.evaluate(RandomizedRunner.java:879)
at com.carrotsearch.randomizedtesting.RandomizedRunner$7.evaluate(RandomizedRunner.java:890)
at com.carrotsearch.randomizedtesting.rules.StatementAdapter.evaluate(StatementAdapter.java:36)
at com.carrotsearch.randomizedtesting.rules.SystemPropertiesRestoreRule$1.evaluate(SystemPropertiesRestoreRule.java:57)
at org.apache.lucene.util.AbstractBeforeAfterRule$1.evaluate(AbstractBeforeAfterRule.java:45)
at com.carrotsearch.randomizedtesting.rules.StatementAdapter.evaluate(StatementAdapter.java:36)
at org.apache.lucene.util.TestRuleStoreClassName$1.evaluate(TestRuleStoreClassName.java:41)
at com.carrotsearch.randomizedtesting.rules.NoShadowingOrOverridesOnMethodsRule$1.evaluate(NoShadowingOrOverridesOnMethodsRule.java:40)
at com.carrotsearch.randomizedtesting.rules.NoShadowingOrOverridesOnMethodsRule$1.evaluate(NoShadowingOrOverridesOnMethodsRule.java:40)
at com.carrotsearch.randomizedtesting.rules.StatementAdapter.evaluate(StatementAdapter.java:36)
at com.carrotsearch.randomizedtesting.rules.StatementAdapter.evaluate(StatementAdapter.java:36)
at com.carrotsearch.randomizedtesting.rules.StatementAdapter.evaluate(StatementAdapter.java:36)
at org.apache.lucene.util.TestRuleAssertionsRequired$1.evaluate(TestRuleAssertionsRequired.java:53)
at org.apache.lucene.util.TestRuleMarkFailure$1.evaluate(TestRuleMarkFailure.java:47)
at org.apache.lucene.util.TestRuleIgnoreAfterMaxFailures$1.evaluate(TestRuleIgnoreAfterMaxFailures.java:64)
at org.apache.lucene.util.TestRuleIgnoreTestSuites$1.evaluate(TestRuleIgnoreTestSuites.java:54)
at com.carrotsearch.randomizedtesting.rules.StatementAdapter.evaluate(StatementAdapter.java:36)
at com.carrotsearch.randomizedtesting.ThreadLeakControl$StatementRunner.run(ThreadLeakControl.java:368)
at java.lang.Thread.run(Thread.java:748)
FAILED: org.apache.solr.cloud.autoscaling.IndexSizeTriggerTest.testMergeIntegration
Error Message:
did not finish processing in time
Stack Trace:
java.lang.AssertionError: did not finish processing in time
at __randomizedtesting.SeedInfo.seed([866ED146DF1B2332:D5D793F63D0AB6C8]:0)
at org.junit.Assert.fail(Assert.java:93)
at org.junit.Assert.assertTrue(Assert.java:43)
at org.apache.solr.cloud.autoscaling.IndexSizeTriggerTest.testMergeIntegration(IndexSizeTriggerTest.java:404)
at sun.reflect.NativeMethodAccessorImpl.invoke0(Native Method)
at sun.reflect.NativeMethodAccessorImpl.invoke(NativeMethodAccessorImpl.java:62)
at sun.reflect.DelegatingMethodAccessorImpl.invoke(DelegatingMethodAccessorImpl.java:43)
at java.lang.reflect.Method.invoke(Method.java:498)
at com.carrotsearch.randomizedtesting.RandomizedRunner.invoke(RandomizedRunner.java:1737)
at com.carrotsearch.randomizedtesting.RandomizedRunner$8.evaluate(RandomizedRunner.java:934)
at com.carrotsearch.randomizedtesting.RandomizedRunner$9.evaluate(RandomizedRunner.java:970)
at com.carrotsearch.randomizedtesting.RandomizedRunner$10.evaluate(RandomizedRunner.java:984)
at com.carrotsearch.randomizedtesting.rules.SystemPropertiesRestoreRule$1.evaluate(SystemPropertiesRestoreRule.java:57)
at org.apache.lucene.util.TestRuleSetupTeardownChained$1.evaluate(TestRuleSetupTeardownChained.java:49)
at org.apache.lucene.util.AbstractBeforeAfterRule$1.evaluate(AbstractBeforeAfterRule.java:45)
at org.apache.lucene.util.TestRuleThreadAndTestName$1.evaluate(TestRuleThreadAndTestName.java:48)
at org.apache.lucene.util.TestRuleIgnoreAfterMaxFailures$1.evaluate(TestRuleIgnoreAfterMaxFailures.java:64)
at org.apache.lucene.util.TestRuleMarkFailure$1.evaluate(TestRuleMarkFailure.java:47)
at com.carrotsearch.randomizedtesting.rules.StatementAdapter.evaluate(StatementAdapter.java:36)
at com.carrotsearch.randomizedtesting.ThreadLeakControl$StatementRunner.run(ThreadLeakControl.java:368)
at com.carrotsearch.randomizedtesting.ThreadLeakControl.forkTimeoutingTask(ThreadLeakControl.java:817)
at com.carrotsearch.randomizedtesting.ThreadLeakControl$3.evaluate(ThreadLeakControl.java:468)
at com.carrotsearch.randomizedtesting.RandomizedRunner.runSingleTest(RandomizedRunner.java:943)
at com.carrotsearch.randomizedtesting.RandomizedRunner$5.evaluate(RandomizedRunner.java:829)
at com.carrotsearch.randomizedtesting.RandomizedRunner$6.evaluate(RandomizedRunner.java:879)
at com.carrotsearch.randomizedtesting.RandomizedRunner$7.evaluate(RandomizedRunner.java:890)
at com.carrotsearch.randomizedtesting.rules.StatementAdapter.evaluate(StatementAdapter.java:36)
at com.carrotsearch.randomizedtesting.rules.SystemPropertiesRestoreRule$1.evaluate(SystemPropertiesRestoreRule.java:57)
at org.apache.lucene.util.AbstractBeforeAfterRule$1.evaluate(AbstractBeforeAfterRule.java:45)
at com.carrotsearch.randomizedtesting.rules.StatementAdapter.evaluate(StatementAdapter.java:36)
at org.apache.lucene.util.TestRuleStoreClassName$1.evaluate(TestRuleStoreClassName.java:41)
at com.carrotsearch.randomizedtesting.rules.NoShadowingOrOverridesOnMethodsRule$1.evaluate(NoShadowingOrOverridesOnMethodsRule.java:40)
at com.carrotsearch.randomizedtesting.rules.NoShadowingOrOverridesOnMethodsRule$1.evaluate(NoShadowingOrOverridesOnMethodsRule.java:40)
at com.carrotsearch.randomizedtesting.rules.StatementAdapter.evaluate(StatementAdapter.java:36)
at com.carrotsearch.randomizedtesting.rules.StatementAdapter.evaluate(StatementAdapter.java:36)
at com.carrotsearch.randomizedtesting.rules.StatementAdapter.evaluate(StatementAdapter.java:36)
at org.apache.lucene.util.TestRuleAssertionsRequired$1.evaluate(TestRuleAssertionsRequired.java:53)
at org.apache.lucene.util.TestRuleMarkFailure$1.evaluate(TestRuleMarkFailure.java:47)
at org.apache.lucene.util.TestRuleIgnoreAfterMaxFailures$1.evaluate(TestRuleIgnoreAfterMaxFailures.java:64)
at org.apache.lucene.util.TestRuleIgnoreTestSuites$1.evaluate(TestRuleIgnoreTestSuites.java:54)
at com.carrotsearch.randomizedtesting.rules.StatementAdapter.evaluate(StatementAdapter.java:36)
at com.carrotsearch.randomizedtesting.ThreadLeakControl$StatementRunner.run(ThreadLeakControl.java:368)
at java.lang.Thread.run(Thread.java:748)
FAILED: org.apache.solr.cloud.autoscaling.IndexSizeTriggerTest.testSplitIntegration
Error Message:
last state: DocCollection(testSplitIntegration_collection//clusterstate.json/51)={ "replicationFactor":"2", "pullReplicas":"0", "router":{"name":"compositeId"}, "maxShardsPerNode":"2", "autoAddReplicas":"false", "nrtReplicas":"2", "tlogReplicas":"0", "autoCreated":"true", "shards":{ "shard2":{ "replicas":{ "core_node3":{ "core":"testSplitIntegration_collection_shard2_replica_n3", "leader":"true", "SEARCHER.searcher.maxDoc":11, "SEARCHER.searcher.deletedDocs":0, "INDEX.sizeInBytes":1, "node_name":"127.0.0.1:10002_solr", "state":"active", "type":"NRT", "SEARCHER.searcher.numDocs":11}, "core_node4":{ "core":"testSplitIntegration_collection_shard2_replica_n4", "SEARCHER.searcher.maxDoc":11, "SEARCHER.searcher.deletedDocs":0, "INDEX.sizeInBytes":1, "node_name":"127.0.0.1:10003_solr", "state":"active", "type":"NRT", "SEARCHER.searcher.numDocs":11}}, "range":"0-7fffffff", "state":"active"}, "shard1":{ "stateTimestamp":"1527779153270831400", "replicas":{ "core_node1":{ "core":"testSplitIntegration_collection_shard1_replica_n1", "leader":"true", "SEARCHER.searcher.maxDoc":14, "SEARCHER.searcher.deletedDocs":0, "INDEX.sizeInBytes":1, "node_name":"127.0.0.1:10002_solr", "state":"active", "type":"NRT", "SEARCHER.searcher.numDocs":14}, "core_node2":{ "core":"testSplitIntegration_collection_shard1_replica_n2", "SEARCHER.searcher.maxDoc":14, "SEARCHER.searcher.deletedDocs":0, "INDEX.sizeInBytes":1, "node_name":"127.0.0.1:10003_solr", "state":"active", "type":"NRT", "SEARCHER.searcher.numDocs":14}}, "range":"80000000-ffffffff", "state":"inactive"}, "shard1_1":{ "parent":"shard1", "stateTimestamp":"1527779153273556950", "range":"c0000000-ffffffff", "state":"active", "replicas":{ "core_node10":{ "leader":"true", "core":"testSplitIntegration_collection_shard1_1_replica1", "SEARCHER.searcher.maxDoc":7, "SEARCHER.searcher.deletedDocs":0, "INDEX.sizeInBytes":1, "node_name":"127.0.0.1:10002_solr", "base_url":"http://127.0.0.1:10002/solr", "state":"active", "type":"NRT", "SEARCHER.searcher.numDocs":7}, "core_node9":{ "core":"testSplitIntegration_collection_shard1_1_replica0", "SEARCHER.searcher.maxDoc":7, "SEARCHER.searcher.deletedDocs":0, "INDEX.sizeInBytes":1, "node_name":"127.0.0.1:10003_solr", "base_url":"http://127.0.0.1:10003/solr", "state":"active", "type":"NRT", "SEARCHER.searcher.numDocs":7}}}, "shard1_0":{ "parent":"shard1", "stateTimestamp":"1527779153273282550", "range":"80000000-bfffffff", "state":"active", "replicas":{ "core_node7":{ "leader":"true", "core":"testSplitIntegration_collection_shard1_0_replica0", "SEARCHER.searcher.maxDoc":7, "SEARCHER.searcher.deletedDocs":0, "INDEX.sizeInBytes":1, "node_name":"127.0.0.1:10003_solr", "base_url":"http://127.0.0.1:10003/solr", "state":"active", "type":"NRT", "SEARCHER.searcher.numDocs":7}, "core_node8":{ "core":"testSplitIntegration_collection_shard1_0_replica1", "SEARCHER.searcher.maxDoc":7, "SEARCHER.searcher.deletedDocs":0, "INDEX.sizeInBytes":1, "node_name":"127.0.0.1:10002_solr", "base_url":"http://127.0.0.1:10002/solr", "state":"active", "type":"NRT", "SEARCHER.searcher.numDocs":7}}}}}
Stack Trace:
java.util.concurrent.TimeoutException: last state: DocCollection(testSplitIntegration_collection//clusterstate.json/51)={
"replicationFactor":"2",
"pullReplicas":"0",
"router":{"name":"compositeId"},
"maxShardsPerNode":"2",
"autoAddReplicas":"false",
"nrtReplicas":"2",
"tlogReplicas":"0",
"autoCreated":"true",
"shards":{
"shard2":{
"replicas":{
"core_node3":{
"core":"testSplitIntegration_collection_shard2_replica_n3",
"leader":"true",
"SEARCHER.searcher.maxDoc":11,
"SEARCHER.searcher.deletedDocs":0,
"INDEX.sizeInBytes":1,
"node_name":"127.0.0.1:10002_solr",
"state":"active",
"type":"NRT",
"SEARCHER.searcher.numDocs":11},
"core_node4":{
"core":"testSplitIntegration_collection_shard2_replica_n4",
"SEARCHER.searcher.maxDoc":11,
"SEARCHER.searcher.deletedDocs":0,
"INDEX.sizeInBytes":1,
"node_name":"127.0.0.1:10003_solr",
"state":"active",
"type":"NRT",
"SEARCHER.searcher.numDocs":11}},
"range":"0-7fffffff",
"state":"active"},
"shard1":{
"stateTimestamp":"1527779153270831400",
"replicas":{
"core_node1":{
"core":"testSplitIntegration_collection_shard1_replica_n1",
"leader":"true",
"SEARCHER.searcher.maxDoc":14,
"SEARCHER.searcher.deletedDocs":0,
"INDEX.sizeInBytes":1,
"node_name":"127.0.0.1:10002_solr",
"state":"active",
"type":"NRT",
"SEARCHER.searcher.numDocs":14},
"core_node2":{
"core":"testSplitIntegration_collection_shard1_replica_n2",
"SEARCHER.searcher.maxDoc":14,
"SEARCHER.searcher.deletedDocs":0,
"INDEX.sizeInBytes":1,
"node_name":"127.0.0.1:10003_solr",
"state":"active",
"type":"NRT",
"SEARCHER.searcher.numDocs":14}},
"range":"80000000-ffffffff",
"state":"inactive"},
"shard1_1":{
"parent":"shard1",
"stateTimestamp":"1527779153273556950",
"range":"c0000000-ffffffff",
"state":"active",
"replicas":{
"core_node10":{
"leader":"true",
"core":"testSplitIntegration_collection_shard1_1_replica1",
"SEARCHER.searcher.maxDoc":7,
"SEARCHER.searcher.deletedDocs":0,
"INDEX.sizeInBytes":1,
"node_name":"127.0.0.1:10002_solr",
"base_url":"http://127.0.0.1:10002/solr",
"state":"active",
"type":"NRT",
"SEARCHER.searcher.numDocs":7},
"core_node9":{
"core":"testSplitIntegration_collection_shard1_1_replica0",
"SEARCHER.searcher.maxDoc":7,
"SEARCHER.searcher.deletedDocs":0,
"INDEX.sizeInBytes":1,
"node_name":"127.0.0.1:10003_solr",
"base_url":"http://127.0.0.1:10003/solr",
"state":"active",
"type":"NRT",
"SEARCHER.searcher.numDocs":7}}},
"shard1_0":{
"parent":"shard1",
"stateTimestamp":"1527779153273282550",
"range":"80000000-bfffffff",
"state":"active",
"replicas":{
"core_node7":{
"leader":"true",
"core":"testSplitIntegration_collection_shard1_0_replica0",
"SEARCHER.searcher.maxDoc":7,
"SEARCHER.searcher.deletedDocs":0,
"INDEX.sizeInBytes":1,
"node_name":"127.0.0.1:10003_solr",
"base_url":"http://127.0.0.1:10003/solr",
"state":"active",
"type":"NRT",
"SEARCHER.searcher.numDocs":7},
"core_node8":{
"core":"testSplitIntegration_collection_shard1_0_replica1",
"SEARCHER.searcher.maxDoc":7,
"SEARCHER.searcher.deletedDocs":0,
"INDEX.sizeInBytes":1,
"node_name":"127.0.0.1:10002_solr",
"base_url":"http://127.0.0.1:10002/solr",
"state":"active",
"type":"NRT",
"SEARCHER.searcher.numDocs":7}}}}}
at __randomizedtesting.SeedInfo.seed([866ED146DF1B2332:BFE06806F0E4EACC]:0)
at org.apache.solr.cloud.CloudTestUtils.waitForState(CloudTestUtils.java:111)
at org.apache.solr.cloud.autoscaling.IndexSizeTriggerTest.testSplitIntegration(IndexSizeTriggerTest.java:299)
at sun.reflect.NativeMethodAccessorImpl.invoke0(Native Method)
at sun.reflect.NativeMethodAccessorImpl.invoke(NativeMethodAccessorImpl.java:62)
at sun.reflect.DelegatingMethodAccessorImpl.invoke(DelegatingMethodAccessorImpl.java:43)
at java.lang.reflect.Method.invoke(Method.java:498)
at com.carrotsearch.randomizedtesting.RandomizedRunner.invoke(RandomizedRunner.java:1737)
at com.carrotsearch.randomizedtesting.RandomizedRunner$8.evaluate(RandomizedRunner.java:934)
at com.carrotsearch.randomizedtesting.RandomizedRunner$9.evaluate(RandomizedRunner.java:970)
at com.carrotsearch.randomizedtesting.RandomizedRunner$10.evaluate(RandomizedRunner.java:984)
at com.carrotsearch.randomizedtesting.rules.SystemPropertiesRestoreRule$1.evaluate(SystemPropertiesRestoreRule.java:57)
at org.apache.lucene.util.TestRuleSetupTeardownChained$1.evaluate(TestRuleSetupTeardownChained.java:49)
at org.apache.lucene.util.AbstractBeforeAfterRule$1.evaluate(AbstractBeforeAfterRule.java:45)
at org.apache.lucene.util.TestRuleThreadAndTestName$1.evaluate(TestRuleThreadAndTestName.java:48)
at org.apache.lucene.util.TestRuleIgnoreAfterMaxFailures$1.evaluate(TestRuleIgnoreAfterMaxFailures.java:64)
at org.apache.lucene.util.TestRuleMarkFailure$1.evaluate(TestRuleMarkFailure.java:47)
at com.carrotsearch.randomizedtesting.rules.StatementAdapter.evaluate(StatementAdapter.java:36)
at com.carrotsearch.randomizedtesting.ThreadLeakControl$StatementRunner.run(ThreadLeakControl.java:368)
at com.carrotsearch.randomizedtesting.ThreadLeakControl.forkTimeoutingTask(ThreadLeakControl.java:817)
at com.carrotsearch.randomizedtesting.ThreadLeakControl$3.evaluate(ThreadLeakControl.java:468)
at com.carrotsearch.randomizedtesting.RandomizedRunner.runSingleTest(RandomizedRunner.java:943)
at com.carrotsearch.randomizedtesting.RandomizedRunner$5.evaluate(RandomizedRunner.java:829)
at com.carrotsearch.randomizedtesting.RandomizedRunner$6.evaluate(RandomizedRunner.java:879)
at com.carrotsearch.randomizedtesting.RandomizedRunner$7.evaluate(RandomizedRunner.java:890)
at com.carrotsearch.randomizedtesting.rules.StatementAdapter.evaluate(StatementAdapter.java:36)
at com.carrotsearch.randomizedtesting.rules.SystemPropertiesRestoreRule$1.evaluate(SystemPropertiesRestoreRule.java:57)
at org.apache.lucene.util.AbstractBeforeAfterRule$1.evaluate(AbstractBeforeAfterRule.java:45)
at com.carrotsearch.randomizedtesting.rules.StatementAdapter.evaluate(StatementAdapter.java:36)
at org.apache.lucene.util.TestRuleStoreClassName$1.evaluate(TestRuleStoreClassName.java:41)
at com.carrotsearch.randomizedtesting.rules.NoShadowingOrOverridesOnMethodsRule$1.evaluate(NoShadowingOrOverridesOnMethodsRule.java:40)
at com.carrotsearch.randomizedtesting.rules.NoShadowingOrOverridesOnMethodsRule$1.evaluate(NoShadowingOrOverridesOnMethodsRule.java:40)
at com.carrotsearch.randomizedtesting.rules.StatementAdapter.evaluate(StatementAdapter.java:36)
at com.carrotsearch.randomizedtesting.rules.StatementAdapter.evaluate(StatementAdapter.java:36)
at com.carrotsearch.randomizedtesting.rules.StatementAdapter.evaluate(StatementAdapter.java:36)
at org.apache.lucene.util.TestRuleAssertionsRequired$1.evaluate(TestRuleAssertionsRequired.java:53)
at org.apache.lucene.util.TestRuleMarkFailure$1.evaluate(TestRuleMarkFailure.java:47)
at org.apache.lucene.util.TestRuleIgnoreAfterMaxFailures$1.evaluate(TestRuleIgnoreAfterMaxFailures.java:64)
at org.apache.lucene.util.TestRuleIgnoreTestSuites$1.evaluate(TestRuleIgnoreTestSuites.java:54)
at com.carrotsearch.randomizedtesting.rules.StatementAdapter.evaluate(StatementAdapter.java:36)
at com.carrotsearch.randomizedtesting.ThreadLeakControl$StatementRunner.run(ThreadLeakControl.java:368)
at java.lang.Thread.run(Thread.java:748)
FAILED: org.apache.solr.cloud.autoscaling.IndexSizeTriggerTest.testMergeIntegration
Error Message:
did not finish processing in time
Stack Trace:
java.lang.AssertionError: did not finish processing in time
at __randomizedtesting.SeedInfo.seed([866ED146DF1B2332:D5D793F63D0AB6C8]:0)
at org.junit.Assert.fail(Assert.java:93)
at org.junit.Assert.assertTrue(Assert.java:43)
at org.apache.solr.cloud.autoscaling.IndexSizeTriggerTest.testMergeIntegration(IndexSizeTriggerTest.java:404)
at sun.reflect.NativeMethodAccessorImpl.invoke0(Native Method)
at sun.reflect.NativeMethodAccessorImpl.invoke(NativeMethodAccessorImpl.java:62)
at sun.reflect.DelegatingMethodAccessorImpl.invoke(DelegatingMethodAccessorImpl.java:43)
at java.lang.reflect.Method.invoke(Method.java:498)
at com.carrotsearch.randomizedtesting.RandomizedRunner.invoke(RandomizedRunner.java:1737)
at com.carrotsearch.randomizedtesting.RandomizedRunner$8.evaluate(RandomizedRunner.java:934)
at com.carrotsearch.randomizedtesting.RandomizedRunner$9.evaluate(RandomizedRunner.java:970)
at com.carrotsearch.randomizedtesting.RandomizedRunner$10.evaluate(RandomizedRunner.java:984)
at com.carrotsearch.randomizedtesting.rules.SystemPropertiesRestoreRule$1.evaluate(SystemPropertiesRestoreRule.java:57)
at org.apache.lucene.util.TestRuleSetupTeardownChained$1.evaluate(TestRuleSetupTeardownChained.java:49)
at org.apache.lucene.util.AbstractBeforeAfterRule$1.evaluate(AbstractBeforeAfterRule.java:45)
at org.apache.lucene.util.TestRuleThreadAndTestName$1.evaluate(TestRuleThreadAndTestName.java:48)
at org.apache.lucene.util.TestRuleIgnoreAfterMaxFailures$1.evaluate(TestRuleIgnoreAfterMaxFailures.java:64)
at org.apache.lucene.util.TestRuleMarkFailure$1.evaluate(TestRuleMarkFailure.java:47)
at com.carrotsearch.randomizedtesting.rules.StatementAdapter.evaluate(StatementAdapter.java:36)
at com.carrotsearch.randomizedtesting.ThreadLeakControl$StatementRunner.run(ThreadLeakControl.java:368)
at com.carrotsearch.randomizedtesting.ThreadLeakControl.forkTimeoutingTask(ThreadLeakControl.java:817)
at com.carrotsearch.randomizedtesting.ThreadLeakControl$3.evaluate(ThreadLeakControl.java:468)
at com.carrotsearch.randomizedtesting.RandomizedRunner.runSingleTest(RandomizedRunner.java:943)
at com.carrotsearch.randomizedtesting.RandomizedRunner$5.evaluate(RandomizedRunner.java:829)
at com.carrotsearch.randomizedtesting.RandomizedRunner$6.evaluate(RandomizedRunner.java:879)
at com.carrotsearch.randomizedtesting.RandomizedRunner$7.evaluate(RandomizedRunner.java:890)
at com.carrotsearch.randomizedtesting.rules.StatementAdapter.evaluate(StatementAdapter.java:36)
at com.carrotsearch.randomizedtesting.rules.SystemPropertiesRestoreRule$1.evaluate(SystemPropertiesRestoreRule.java:57)
at org.apache.lucene.util.AbstractBeforeAfterRule$1.evaluate(AbstractBeforeAfterRule.java:45)
at com.carrotsearch.randomizedtesting.rules.StatementAdapter.evaluate(StatementAdapter.java:36)
at org.apache.lucene.util.TestRuleStoreClassName$1.evaluate(TestRuleStoreClassName.java:41)
at com.carrotsearch.randomizedtesting.rules.NoShadowingOrOverridesOnMethodsRule$1.evaluate(NoShadowingOrOverridesOnMethodsRule.java:40)
at com.carrotsearch.randomizedtesting.rules.NoShadowingOrOverridesOnMethodsRule$1.evaluate(NoShadowingOrOverridesOnMethodsRule.java:40)
at com.carrotsearch.randomizedtesting.rules.StatementAdapter.evaluate(StatementAdapter.java:36)
at com.carrotsearch.randomizedtesting.rules.StatementAdapter.evaluate(StatementAdapter.java:36)
at com.carrotsearch.randomizedtesting.rules.StatementAdapter.evaluate(StatementAdapter.java:36)
at org.apache.lucene.util.TestRuleAssertionsRequired$1.evaluate(TestRuleAssertionsRequired.java:53)
at org.apache.lucene.util.TestRuleMarkFailure$1.evaluate(TestRuleMarkFailure.java:47)
at org.apache.lucene.util.TestRuleIgnoreAfterMaxFailures$1.evaluate(TestRuleIgnoreAfterMaxFailures.java:64)
at org.apache.lucene.util.TestRuleIgnoreTestSuites$1.evaluate(TestRuleIgnoreTestSuites.java:54)
at com.carrotsearch.randomizedtesting.rules.StatementAdapter.evaluate(StatementAdapter.java:36)
at com.carrotsearch.randomizedtesting.ThreadLeakControl$StatementRunner.run(ThreadLeakControl.java:368)
at java.lang.Thread.run(Thread.java:748)
FAILED: org.apache.solr.cloud.autoscaling.IndexSizeTriggerTest.testSplitIntegration
Error Message:
last state: DocCollection(testSplitIntegration_collection//clusterstate.json/43)={ "replicationFactor":"2", "pullReplicas":"0", "router":{"name":"compositeId"}, "maxShardsPerNode":"2", "autoAddReplicas":"false", "nrtReplicas":"2", "tlogReplicas":"0", "autoCreated":"true", "shards":{ "shard2":{ "replicas":{ "core_node3":{ "core":"testSplitIntegration_collection_shard2_replica_n3", "leader":"true", "SEARCHER.searcher.maxDoc":11, "SEARCHER.searcher.deletedDocs":0, "INDEX.sizeInBytes":1, "node_name":"127.0.0.1:10002_solr", "state":"active", "type":"NRT", "SEARCHER.searcher.numDocs":11}, "core_node4":{ "core":"testSplitIntegration_collection_shard2_replica_n4", "SEARCHER.searcher.maxDoc":11, "SEARCHER.searcher.deletedDocs":0, "INDEX.sizeInBytes":1, "node_name":"127.0.0.1:10003_solr", "state":"active", "type":"NRT", "SEARCHER.searcher.numDocs":11}}, "range":"0-7fffffff", "state":"active"}, "shard1":{ "stateTimestamp":"1527779443912447750", "replicas":{ "core_node1":{ "core":"testSplitIntegration_collection_shard1_replica_n1", "leader":"true", "SEARCHER.searcher.maxDoc":14, "SEARCHER.searcher.deletedDocs":0, "INDEX.sizeInBytes":1, "node_name":"127.0.0.1:10002_solr", "state":"active", "type":"NRT", "SEARCHER.searcher.numDocs":14}, "core_node2":{ "core":"testSplitIntegration_collection_shard1_replica_n2", "SEARCHER.searcher.maxDoc":14, "SEARCHER.searcher.deletedDocs":0, "INDEX.sizeInBytes":1, "node_name":"127.0.0.1:10003_solr", "state":"active", "type":"NRT", "SEARCHER.searcher.numDocs":14}}, "range":"80000000-ffffffff", "state":"inactive"}, "shard1_1":{ "parent":"shard1", "stateTimestamp":"1527779443913443500", "range":"c0000000-ffffffff", "state":"active", "replicas":{ "core_node10":{ "leader":"true", "core":"testSplitIntegration_collection_shard1_1_replica1", "SEARCHER.searcher.maxDoc":7, "SEARCHER.searcher.deletedDocs":0, "INDEX.sizeInBytes":1, "node_name":"127.0.0.1:10002_solr", "base_url":"http://127.0.0.1:10002/solr", "state":"active", "type":"NRT", "SEARCHER.searcher.numDocs":7}, "core_node9":{ "core":"testSplitIntegration_collection_shard1_1_replica0", "SEARCHER.searcher.maxDoc":7, "SEARCHER.searcher.deletedDocs":0, "INDEX.sizeInBytes":1, "node_name":"127.0.0.1:10003_solr", "base_url":"http://127.0.0.1:10003/solr", "state":"active", "type":"NRT", "SEARCHER.searcher.numDocs":7}}}, "shard1_0":{ "parent":"shard1", "stateTimestamp":"1527779443912937150", "range":"80000000-bfffffff", "state":"active", "replicas":{ "core_node7":{ "leader":"true", "core":"testSplitIntegration_collection_shard1_0_replica0", "SEARCHER.searcher.maxDoc":7, "SEARCHER.searcher.deletedDocs":0, "INDEX.sizeInBytes":1, "node_name":"127.0.0.1:10003_solr", "base_url":"http://127.0.0.1:10003/solr", "state":"active", "type":"NRT", "SEARCHER.searcher.numDocs":7}, "core_node8":{ "core":"testSplitIntegration_collection_shard1_0_replica1", "SEARCHER.searcher.maxDoc":7, "SEARCHER.searcher.deletedDocs":0, "INDEX.sizeInBytes":1, "node_name":"127.0.0.1:10002_solr", "base_url":"http://127.0.0.1:10002/solr", "state":"active", "type":"NRT", "SEARCHER.searcher.numDocs":7}}}}}
Stack Trace:
java.util.concurrent.TimeoutException: last state: DocCollection(testSplitIntegration_collection//clusterstate.json/43)={
"replicationFactor":"2",
"pullReplicas":"0",
"router":{"name":"compositeId"},
"maxShardsPerNode":"2",
"autoAddReplicas":"false",
"nrtReplicas":"2",
"tlogReplicas":"0",
"autoCreated":"true",
"shards":{
"shard2":{
"replicas":{
"core_node3":{
"core":"testSplitIntegration_collection_shard2_replica_n3",
"leader":"true",
"SEARCHER.searcher.maxDoc":11,
"SEARCHER.searcher.deletedDocs":0,
"INDEX.sizeInBytes":1,
"node_name":"127.0.0.1:10002_solr",
"state":"active",
"type":"NRT",
"SEARCHER.searcher.numDocs":11},
"core_node4":{
"core":"testSplitIntegration_collection_shard2_replica_n4",
"SEARCHER.searcher.maxDoc":11,
"SEARCHER.searcher.deletedDocs":0,
"INDEX.sizeInBytes":1,
"node_name":"127.0.0.1:10003_solr",
"state":"active",
"type":"NRT",
"SEARCHER.searcher.numDocs":11}},
"range":"0-7fffffff",
"state":"active"},
"shard1":{
"stateTimestamp":"1527779443912447750",
"replicas":{
"core_node1":{
"core":"testSplitIntegration_collection_shard1_replica_n1",
"leader":"true",
"SEARCHER.searcher.maxDoc":14,
"SEARCHER.searcher.deletedDocs":0,
"INDEX.sizeInBytes":1,
"node_name":"127.0.0.1:10002_solr",
"state":"active",
"type":"NRT",
"SEARCHER.searcher.numDocs":14},
"core_node2":{
"core":"testSplitIntegration_collection_shard1_replica_n2",
"SEARCHER.searcher.maxDoc":14,
"SEARCHER.searcher.deletedDocs":0,
"INDEX.sizeInBytes":1,
"node_name":"127.0.0.1:10003_solr",
"state":"active",
"type":"NRT",
"SEARCHER.searcher.numDocs":14}},
"range":"80000000-ffffffff",
"state":"inactive"},
"shard1_1":{
"parent":"shard1",
"stateTimestamp":"1527779443913443500",
"range":"c0000000-ffffffff",
"state":"active",
"replicas":{
"core_node10":{
"leader":"true",
"core":"testSplitIntegration_collection_shard1_1_replica1",
"SEARCHER.searcher.maxDoc":7,
"SEARCHER.searcher.deletedDocs":0,
"INDEX.sizeInBytes":1,
"node_name":"127.0.0.1:10002_solr",
"base_url":"http://127.0.0.1:10002/solr",
"state":"active",
"type":"NRT",
"SEARCHER.searcher.numDocs":7},
"core_node9":{
"core":"testSplitIntegration_collection_shard1_1_replica0",
"SEARCHER.searcher.maxDoc":7,
"SEARCHER.searcher.deletedDocs":0,
"INDEX.sizeInBytes":1,
"node_name":"127.0.0.1:10003_solr",
"base_url":"http://127.0.0.1:10003/solr",
"state":"active",
"type":"NRT",
"SEARCHER.searcher.numDocs":7}}},
"shard1_0":{
"parent":"shard1",
"stateTimestamp":"1527779443912937150",
"range":"80000000-bfffffff",
"state":"active",
"replicas":{
"core_node7":{
"leader":"true",
"core":"testSplitIntegration_collection_shard1_0_replica0",
"SEARCHER.searcher.maxDoc":7,
"SEARCHER.searcher.deletedDocs":0,
"INDEX.sizeInBytes":1,
"node_name":"127.0.0.1:10003_solr",
"base_url":"http://127.0.0.1:10003/solr",
"state":"active",
"type":"NRT",
"SEARCHER.searcher.numDocs":7},
"core_node8":{
"core":"testSplitIntegration_collection_shard1_0_replica1",
"SEARCHER.searcher.maxDoc":7,
"SEARCHER.searcher.deletedDocs":0,
"INDEX.sizeInBytes":1,
"node_name":"127.0.0.1:10002_solr",
"base_url":"http://127.0.0.1:10002/solr",
"state":"active",
"type":"NRT",
"SEARCHER.searcher.numDocs":7}}}}}
at __randomizedtesting.SeedInfo.seed([866ED146DF1B2332:BFE06806F0E4EACC]:0)
at org.apache.solr.cloud.CloudTestUtils.waitForState(CloudTestUtils.java:111)
at org.apache.solr.cloud.autoscaling.IndexSizeTriggerTest.testSplitIntegration(IndexSizeTriggerTest.java:299)
at sun.reflect.NativeMethodAccessorImpl.invoke0(Native Method)
at sun.reflect.NativeMethodAccessorImpl.invoke(NativeMethodAccessorImpl.java:62)
at sun.reflect.DelegatingMethodAccessorImpl.invoke(DelegatingMethodAccessorImpl.java:43)
at java.lang.reflect.Method.invoke(Method.java:498)
at com.carrotsearch.randomizedtesting.RandomizedRunner.invoke(RandomizedRunner.java:1737)
at com.carrotsearch.randomizedtesting.RandomizedRunner$8.evaluate(RandomizedRunner.java:934)
at com.carrotsearch.randomizedtesting.RandomizedRunner$9.evaluate(RandomizedRunner.java:970)
at com.carrotsearch.randomizedtesting.RandomizedRunner$10.evaluate(RandomizedRunner.java:984)
at com.carrotsearch.randomizedtesting.rules.SystemPropertiesRestoreRule$1.evaluate(SystemPropertiesRestoreRule.java:57)
at org.apache.lucene.util.TestRuleSetupTeardownChained$1.evaluate(TestRuleSetupTeardownChained.java:49)
at org.apache.lucene.util.AbstractBeforeAfterRule$1.evaluate(AbstractBeforeAfterRule.java:45)
at org.apache.lucene.util.TestRuleThreadAndTestName$1.evaluate(TestRuleThreadAndTestName.java:48)
at org.apache.lucene.util.TestRuleIgnoreAfterMaxFailures$1.evaluate(TestRuleIgnoreAfterMaxFailures.java:64)
at org.apache.lucene.util.TestRuleMarkFailure$1.evaluate(TestRuleMarkFailure.java:47)
at com.carrotsearch.randomizedtesting.rules.StatementAdapter.evaluate(StatementAdapter.java:36)
at com.carrotsearch.randomizedtesting.ThreadLeakControl$StatementRunner.run(ThreadLeakControl.java:368)
at com.carrotsearch.randomizedtesting.ThreadLeakControl.forkTimeoutingTask(ThreadLeakControl.java:817)
at com.carrotsearch.randomizedtesting.ThreadLeakControl$3.evaluate(ThreadLeakControl.java:468)
at com.carrotsearch.randomizedtesting.RandomizedRunner.runSingleTest(RandomizedRunner.java:943)
at com.carrotsearch.randomizedtesting.RandomizedRunner$5.evaluate(RandomizedRunner.java:829)
at com.carrotsearch.randomizedtesting.RandomizedRunner$6.evaluate(RandomizedRunner.java:879)
at com.carrotsearch.randomizedtesting.RandomizedRunner$7.evaluate(RandomizedRunner.java:890)
at com.carrotsearch.randomizedtesting.rules.StatementAdapter.evaluate(StatementAdapter.java:36)
at com.carrotsearch.randomizedtesting.rules.SystemPropertiesRestoreRule$1.evaluate(SystemPropertiesRestoreRule.java:57)
at org.apache.lucene.util.AbstractBeforeAfterRule$1.evaluate(AbstractBeforeAfterRule.java:45)
at com.carrotsearch.randomizedtesting.rules.StatementAdapter.evaluate(StatementAdapter.java:36)
at org.apache.lucene.util.TestRuleStoreClassName$1.evaluate(TestRuleStoreClassName.java:41)
at com.carrotsearch.randomizedtesting.rules.NoShadowingOrOverridesOnMethodsRule$1.evaluate(NoShadowingOrOverridesOnMethodsRule.java:40)
at com.carrotsearch.randomizedtesting.rules.NoShadowingOrOverridesOnMethodsRule$1.evaluate(NoShadowingOrOverridesOnMethodsRule.java:40)
at com.carrotsearch.randomizedtesting.rules.StatementAdapter.evaluate(StatementAdapter.java:36)
at com.carrotsearch.randomizedtesting.rules.StatementAdapter.evaluate(StatementAdapter.java:36)
at com.carrotsearch.randomizedtesting.rules.StatementAdapter.evaluate(StatementAdapter.java:36)
at org.apache.lucene.util.TestRuleAssertionsRequired$1.evaluate(TestRuleAssertionsRequired.java:53)
at org.apache.lucene.util.TestRuleMarkFailure$1.evaluate(TestRuleMarkFailure.java:47)
at org.apache.lucene.util.TestRuleIgnoreAfterMaxFailures$1.evaluate(TestRuleIgnoreAfterMaxFailures.java:64)
at org.apache.lucene.util.TestRuleIgnoreTestSuites$1.evaluate(TestRuleIgnoreTestSuites.java:54)
at com.carrotsearch.randomizedtesting.rules.StatementAdapter.evaluate(StatementAdapter.java:36)
at com.carrotsearch.randomizedtesting.ThreadLeakControl$StatementRunner.run(ThreadLeakControl.java:368)
at java.lang.Thread.run(Thread.java:748)
FAILED: org.apache.solr.cloud.autoscaling.IndexSizeTriggerTest.testMergeIntegration
Error Message:
did not finish processing in time
Stack Trace:
java.lang.AssertionError: did not finish processing in time
at __randomizedtesting.SeedInfo.seed([866ED146DF1B2332:D5D793F63D0AB6C8]:0)
at org.junit.Assert.fail(Assert.java:93)
at org.junit.Assert.assertTrue(Assert.java:43)
at org.apache.solr.cloud.autoscaling.IndexSizeTriggerTest.testMergeIntegration(IndexSizeTriggerTest.java:404)
at sun.reflect.NativeMethodAccessorImpl.invoke0(Native Method)
at sun.reflect.NativeMethodAccessorImpl.invoke(NativeMethodAccessorImpl.java:62)
at sun.reflect.DelegatingMethodAccessorImpl.invoke(DelegatingMethodAccessorImpl.java:43)
at java.lang.reflect.Method.invoke(Method.java:498)
at com.carrotsearch.randomizedtesting.RandomizedRunner.invoke(RandomizedRunner.java:1737)
at com.carrotsearch.randomizedtesting.RandomizedRunner$8.evaluate(RandomizedRunner.java:934)
at com.carrotsearch.randomizedtesting.RandomizedRunner$9.evaluate(RandomizedRunner.java:970)
at com.carrotsearch.randomizedtesting.RandomizedRunner$10.evaluate(RandomizedRunner.java:984)
at com.carrotsearch.randomizedtesting.rules.SystemPropertiesRestoreRule$1.evaluate(SystemPropertiesRestoreRule.java:57)
at org.apache.lucene.util.TestRuleSetupTeardownChained$1.evaluate(TestRuleSetupTeardownChained.java:49)
at org.apache.lucene.util.AbstractBeforeAfterRule$1.evaluate(AbstractBeforeAfterRule.java:45)
at org.apache.lucene.util.TestRuleThreadAndTestName$1.evaluate(TestRuleThreadAndTestName.java:48)
at org.apache.lucene.util.TestRuleIgnoreAfterMaxFailures$1.evaluate(TestRuleIgnoreAfterMaxFailures.java:64)
at org.apache.lucene.util.TestRuleMarkFailure$1.evaluate(TestRuleMarkFailure.java:47)
at com.carrotsearch.randomizedtesting.rules.StatementAdapter.evaluate(StatementAdapter.java:36)
at com.carrotsearch.randomizedtesting.ThreadLeakControl$StatementRunner.run(ThreadLeakControl.java:368)
at com.carrotsearch.randomizedtesting.ThreadLeakControl.forkTimeoutingTask(ThreadLeakControl.java:817)
at com.carrotsearch.randomizedtesting.ThreadLeakControl$3.evaluate(ThreadLeakControl.java:468)
at com.carrotsearch.randomizedtesting.RandomizedRunner.runSingleTest(RandomizedRunner.java:943)
at com.carrotsearch.randomizedtesting.RandomizedRunner$5.evaluate(RandomizedRunner.java:829)
at com.carrotsearch.randomizedtesting.RandomizedRunner$6.evaluate(RandomizedRunner.java:879)
at com.carrotsearch.randomizedtesting.RandomizedRunner$7.evaluate(RandomizedRunner.java:890)
at com.carrotsearch.randomizedtesting.rules.StatementAdapter.evaluate(StatementAdapter.java:36)
at com.carrotsearch.randomizedtesting.rules.SystemPropertiesRestoreRule$1.evaluate(SystemPropertiesRestoreRule.java:57)
at org.apache.lucene.util.AbstractBeforeAfterRule$1.evaluate(AbstractBeforeAfterRule.java:45)
at com.carrotsearch.randomizedtesting.rules.StatementAdapter.evaluate(StatementAdapter.java:36)
at org.apache.lucene.util.TestRuleStoreClassName$1.evaluate(TestRuleStoreClassName.java:41)
at com.carrotsearch.randomizedtesting.rules.NoShadowingOrOverridesOnMethodsRule$1.evaluate(NoShadowingOrOverridesOnMethodsRule.java:40)
at com.carrotsearch.randomizedtesting.rules.NoShadowingOrOverridesOnMethodsRule$1.evaluate(NoShadowingOrOverridesOnMethodsRule.java:40)
at com.carrotsearch.randomizedtesting.rules.StatementAdapter.evaluate(StatementAdapter.java:36)
at com.carrotsearch.randomizedtesting.rules.StatementAdapter.evaluate(StatementAdapter.java:36)
at com.carrotsearch.randomizedtesting.rules.StatementAdapter.evaluate(StatementAdapter.java:36)
at org.apache.lucene.util.TestRuleAssertionsRequired$1.evaluate(TestRuleAssertionsRequired.java:53)
at org.apache.lucene.util.TestRuleMarkFailure$1.evaluate(TestRuleMarkFailure.java:47)
at org.apache.lucene.util.TestRuleIgnoreAfterMaxFailures$1.evaluate(TestRuleIgnoreAfterMaxFailures.java:64)
at org.apache.lucene.util.TestRuleIgnoreTestSuites$1.evaluate(TestRuleIgnoreTestSuites.java:54)
at com.carrotsearch.randomizedtesting.rules.StatementAdapter.evaluate(StatementAdapter.java:36)
at com.carrotsearch.randomizedtesting.ThreadLeakControl$StatementRunner.run(ThreadLeakControl.java:368)
at java.lang.Thread.run(Thread.java:748)
FAILED: org.apache.solr.cloud.autoscaling.IndexSizeTriggerTest.testTrigger
Error Message:
number of ops expected:<2> but was:<1>
Stack Trace:
java.lang.AssertionError: number of ops expected:<2> but was:<1>
at __randomizedtesting.SeedInfo.seed([866ED146DF1B2332:E5A5E7C446D4501F]:0)
at org.junit.Assert.fail(Assert.java:93)
at org.junit.Assert.failNotEquals(Assert.java:647)
at org.junit.Assert.assertEquals(Assert.java:128)
at org.junit.Assert.assertEquals(Assert.java:472)
at org.apache.solr.cloud.autoscaling.IndexSizeTriggerTest.testTrigger(IndexSizeTriggerTest.java:187)
at sun.reflect.NativeMethodAccessorImpl.invoke0(Native Method)
at sun.reflect.NativeMethodAccessorImpl.invoke(NativeMethodAccessorImpl.java:62)
at sun.reflect.DelegatingMethodAccessorImpl.invoke(DelegatingMethodAccessorImpl.java:43)
at java.lang.reflect.Method.invoke(Method.java:498)
at com.carrotsearch.randomizedtesting.RandomizedRunner.invoke(RandomizedRunner.java:1737)
at com.carrotsearch.randomizedtesting.RandomizedRunner$8.evaluate(RandomizedRunner.java:934)
at com.carrotsearch.randomizedtesting.RandomizedRunner$9.evaluate(RandomizedRunner.java:970)
at com.carrotsearch.randomizedtesting.RandomizedRunner$10.evaluate(RandomizedRunner.java:984)
at com.carrotsearch.randomizedtesting.rules.SystemPropertiesRestoreRule$1.evaluate(SystemPropertiesRestoreRule.java:57)
at org.apache.lucene.util.TestRuleSetupTeardownChained$1.evaluate(TestRuleSetupTeardownChained.java:49)
at org.apache.lucene.util.AbstractBeforeAfterRule$1.evaluate(AbstractBeforeAfterRule.java:45)
at org.apache.lucene.util.TestRuleThreadAndTestName$1.evaluate(TestRuleThreadAndTestName.java:48)
at org.apache.lucene.util.TestRuleIgnoreAfterMaxFailures$1.evaluate(TestRuleIgnoreAfterMaxFailures.java:64)
at org.apache.lucene.util.TestRuleMarkFailure$1.evaluate(TestRuleMarkFailure.java:47)
at com.carrotsearch.randomizedtesting.rules.StatementAdapter.evaluate(StatementAdapter.java:36)
at com.carrotsearch.randomizedtesting.ThreadLeakControl$StatementRunner.run(ThreadLeakControl.java:368)
at com.carrotsearch.randomizedtesting.ThreadLeakControl.forkTimeoutingTask(ThreadLeakControl.java:817)
at com.carrotsearch.randomizedtesting.ThreadLeakControl$3.evaluate(ThreadLeakControl.java:468)
at com.carrotsearch.randomizedtesting.RandomizedRunner.runSingleTest(RandomizedRunner.java:943)
at com.carrotsearch.randomizedtesting.RandomizedRunner$5.evaluate(RandomizedRunner.java:829)
at com.carrotsearch.randomizedtesting.RandomizedRunner$6.evaluate(RandomizedRunner.java:879)
at com.carrotsearch.randomizedtesting.RandomizedRunner$7.evaluate(RandomizedRunner.java:890)
at com.carrotsearch.randomizedtesting.rules.StatementAdapter.evaluate(StatementAdapter.java:36)
at com.carrotsearch.randomizedtesting.rules.SystemPropertiesRestoreRule$1.evaluate(SystemPropertiesRestoreRule.java:57)
at org.apache.lucene.util.AbstractBeforeAfterRule$1.evaluate(AbstractBeforeAfterRule.java:45)
at com.carrotsearch.randomizedtesting.rules.StatementAdapter.evaluate(StatementAdapter.java:36)
at org.apache.lucene.util.TestRuleStoreClassName$1.evaluate(TestRuleStoreClassName.java:41)
at com.carrotsearch.randomizedtesting.rules.NoShadowingOrOverridesOnMethodsRule$1.evaluate(NoShadowingOrOverridesOnMethodsRule.java:40)
at com.carrotsearch.randomizedtesting.rules.NoShadowingOrOverridesOnMethodsRule$1.evaluate(NoShadowingOrOverridesOnMethodsRule.java:40)
at com.carrotsearch.randomizedtesting.rules.StatementAdapter.evaluate(StatementAdapter.java:36)
at com.carrotsearch.randomizedtesting.rules.StatementAdapter.evaluate(StatementAdapter.java:36)
at com.carrotsearch.randomizedtesting.rules.StatementAdapter.evaluate(StatementAdapter.java:36)
at org.apache.lucene.util.TestRuleAssertionsRequired$1.evaluate(TestRuleAssertionsRequired.java:53)
at org.apache.lucene.util.TestRuleMarkFailure$1.evaluate(TestRuleMarkFailure.java:47)
at org.apache.lucene.util.TestRuleIgnoreAfterMaxFailures$1.evaluate(TestRuleIgnoreAfterMaxFailures.java:64)
at org.apache.lucene.util.TestRuleIgnoreTestSuites$1.evaluate(TestRuleIgnoreTestSuites.java:54)
at com.carrotsearch.randomizedtesting.rules.StatementAdapter.evaluate(StatementAdapter.java:36)
at com.carrotsearch.randomizedtesting.ThreadLeakControl$StatementRunner.run(ThreadLeakControl.java:368)
at java.lang.Thread.run(Thread.java:748)
FAILED: org.apache.solr.cloud.autoscaling.IndexSizeTriggerTest.testSplitIntegration
Error Message:
last state: DocCollection(testSplitIntegration_collection//clusterstate.json/40)={ "replicationFactor":"2", "pullReplicas":"0", "router":{"name":"compositeId"}, "maxShardsPerNode":"2", "autoAddReplicas":"false", "nrtReplicas":"2", "tlogReplicas":"0", "autoCreated":"true", "shards":{ "shard2":{ "replicas":{ "core_node3":{ "core":"testSplitIntegration_collection_shard2_replica_n3", "leader":"true", "SEARCHER.searcher.maxDoc":11, "SEARCHER.searcher.deletedDocs":0, "INDEX.sizeInBytes":1, "node_name":"127.0.0.1:10001_solr", "state":"active", "type":"NRT", "SEARCHER.searcher.numDocs":11}, "core_node4":{ "core":"testSplitIntegration_collection_shard2_replica_n4", "SEARCHER.searcher.maxDoc":11, "SEARCHER.searcher.deletedDocs":0, "INDEX.sizeInBytes":1, "node_name":"127.0.0.1:10000_solr", "state":"active", "type":"NRT", "SEARCHER.searcher.numDocs":11}}, "range":"0-7fffffff", "state":"active"}, "shard1":{ "stateTimestamp":"1527774330610223450", "replicas":{ "core_node1":{ "core":"testSplitIntegration_collection_shard1_replica_n1", "leader":"true", "SEARCHER.searcher.maxDoc":14, "SEARCHER.searcher.deletedDocs":0, "INDEX.sizeInBytes":1, "node_name":"127.0.0.1:10001_solr", "state":"active", "type":"NRT", "SEARCHER.searcher.numDocs":14}, "core_node2":{ "core":"testSplitIntegration_collection_shard1_replica_n2", "SEARCHER.searcher.maxDoc":14, "SEARCHER.searcher.deletedDocs":0, "INDEX.sizeInBytes":1, "node_name":"127.0.0.1:10000_solr", "state":"active", "type":"NRT", "SEARCHER.searcher.numDocs":14}}, "range":"80000000-ffffffff", "state":"inactive"}, "shard1_1":{ "parent":"shard1", "stateTimestamp":"1527774330632757500", "range":"c0000000-ffffffff", "state":"active", "replicas":{ "core_node10":{ "leader":"true", "core":"testSplitIntegration_collection_shard1_1_replica1", "SEARCHER.searcher.maxDoc":7, "SEARCHER.searcher.deletedDocs":0, "INDEX.sizeInBytes":1, "node_name":"127.0.0.1:10000_solr", "base_url":"http://127.0.0.1:10000/solr", "state":"active", "type":"NRT", "SEARCHER.searcher.numDocs":7}, "core_node9":{ "core":"testSplitIntegration_collection_shard1_1_replica0", "SEARCHER.searcher.maxDoc":7, "SEARCHER.searcher.deletedDocs":0, "INDEX.sizeInBytes":1, "node_name":"127.0.0.1:10001_solr", "base_url":"http://127.0.0.1:10001/solr", "state":"active", "type":"NRT", "SEARCHER.searcher.numDocs":7}}}, "shard1_0":{ "parent":"shard1", "stateTimestamp":"1527774330632545100", "range":"80000000-bfffffff", "state":"active", "replicas":{ "core_node7":{ "leader":"true", "core":"testSplitIntegration_collection_shard1_0_replica0", "SEARCHER.searcher.maxDoc":7, "SEARCHER.searcher.deletedDocs":0, "INDEX.sizeInBytes":1, "node_name":"127.0.0.1:10001_solr", "base_url":"http://127.0.0.1:10001/solr", "state":"active", "type":"NRT", "SEARCHER.searcher.numDocs":7}, "core_node8":{ "core":"testSplitIntegration_collection_shard1_0_replica1", "SEARCHER.searcher.maxDoc":7, "SEARCHER.searcher.deletedDocs":0, "INDEX.sizeInBytes":1, "node_name":"127.0.0.1:10000_solr", "base_url":"http://127.0.0.1:10000/solr", "state":"active", "type":"NRT", "SEARCHER.searcher.numDocs":7}}}}}
Stack Trace:
java.util.concurrent.TimeoutException: last state: DocCollection(testSplitIntegration_collection//clusterstate.json/40)={
"replicationFactor":"2",
"pullReplicas":"0",
"router":{"name":"compositeId"},
"maxShardsPerNode":"2",
"autoAddReplicas":"false",
"nrtReplicas":"2",
"tlogReplicas":"0",
"autoCreated":"true",
"shards":{
"shard2":{
"replicas":{
"core_node3":{
"core":"testSplitIntegration_collection_shard2_replica_n3",
"leader":"true",
"SEARCHER.searcher.maxDoc":11,
"SEARCHER.searcher.deletedDocs":0,
"INDEX.sizeInBytes":1,
"node_name":"127.0.0.1:10001_solr",
"state":"active",
"type":"NRT",
"SEARCHER.searcher.numDocs":11},
"core_node4":{
"core":"testSplitIntegration_collection_shard2_replica_n4",
"SEARCHER.searcher.maxDoc":11,
"SEARCHER.searcher.deletedDocs":0,
"INDEX.sizeInBytes":1,
"node_name":"127.0.0.1:10000_solr",
"state":"active",
"type":"NRT",
"SEARCHER.searcher.numDocs":11}},
"range":"0-7fffffff",
"state":"active"},
"shard1":{
"stateTimestamp":"1527774330610223450",
"replicas":{
"core_node1":{
"core":"testSplitIntegration_collection_shard1_replica_n1",
"leader":"true",
"SEARCHER.searcher.maxDoc":14,
"SEARCHER.searcher.deletedDocs":0,
"INDEX.sizeInBytes":1,
"node_name":"127.0.0.1:10001_solr",
"state":"active",
"type":"NRT",
"SEARCHER.searcher.numDocs":14},
"core_node2":{
"core":"testSplitIntegration_collection_shard1_replica_n2",
"SEARCHER.searcher.maxDoc":14,
"SEARCHER.searcher.deletedDocs":0,
"INDEX.sizeInBytes":1,
"node_name":"127.0.0.1:10000_solr",
"state":"active",
"type":"NRT",
"SEARCHER.searcher.numDocs":14}},
"range":"80000000-ffffffff",
"state":"inactive"},
"shard1_1":{
"parent":"shard1",
"stateTimestamp":"1527774330632757500",
"range":"c0000000-ffffffff",
"state":"active",
"replicas":{
"core_node10":{
"leader":"true",
"core":"testSplitIntegration_collection_shard1_1_replica1",
"SEARCHER.searcher.maxDoc":7,
"SEARCHER.searcher.deletedDocs":0,
"INDEX.sizeInBytes":1,
"node_name":"127.0.0.1:10000_solr",
"base_url":"http://127.0.0.1:10000/solr",
"state":"active",
"type":"NRT",
"SEARCHER.searcher.numDocs":7},
"core_node9":{
"core":"testSplitIntegration_collection_shard1_1_replica0",
"SEARCHER.searcher.maxDoc":7,
"SEARCHER.searcher.deletedDocs":0,
"INDEX.sizeInBytes":1,
"node_name":"127.0.0.1:10001_solr",
"base_url":"http://127.0.0.1:10001/solr",
"state":"active",
"type":"NRT",
"SEARCHER.searcher.numDocs":7}}},
"shard1_0":{
"parent":"shard1",
"stateTimestamp":"1527774330632545100",
"range":"80000000-bfffffff",
"state":"active",
"replicas":{
"core_node7":{
"leader":"true",
"core":"testSplitIntegration_collection_shard1_0_replica0",
"SEARCHER.searcher.maxDoc":7,
"SEARCHER.searcher.deletedDocs":0,
"INDEX.sizeInBytes":1,
"node_name":"127.0.0.1:10001_solr",
"base_url":"http://127.0.0.1:10001/solr",
"state":"active",
"type":"NRT",
"SEARCHER.searcher.numDocs":7},
"core_node8":{
"core":"testSplitIntegration_collection_shard1_0_replica1",
"SEARCHER.searcher.maxDoc":7,
"SEARCHER.searcher.deletedDocs":0,
"INDEX.sizeInBytes":1,
"node_name":"127.0.0.1:10000_solr",
"base_url":"http://127.0.0.1:10000/solr",
"state":"active",
"type":"NRT",
"SEARCHER.searcher.numDocs":7}}}}}
at __randomizedtesting.SeedInfo.seed([866ED146DF1B2332:BFE06806F0E4EACC]:0)
at org.apache.solr.cloud.CloudTestUtils.waitForState(CloudTestUtils.java:111)
at org.apache.solr.cloud.autoscaling.IndexSizeTriggerTest.testSplitIntegration(IndexSizeTriggerTest.java:299)
at sun.reflect.NativeMethodAccessorImpl.invoke0(Native Method)
at sun.reflect.NativeMethodAccessorImpl.invoke(NativeMethodAccessorImpl.java:62)
at sun.reflect.DelegatingMethodAccessorImpl.invoke(DelegatingMethodAccessorImpl.java:43)
at java.lang.reflect.Method.invoke(Method.java:498)
at com.carrotsearch.randomizedtesting.RandomizedRunner.invoke(RandomizedRunner.java:1737)
at com.carrotsearch.randomizedtesting.RandomizedRunner$8.evaluate(RandomizedRunner.java:934)
at com.carrotsearch.randomizedtesting.RandomizedRunner$9.evaluate(RandomizedRunner.java:970)
at com.carrotsearch.randomizedtesting.RandomizedRunner$10.evaluate(RandomizedRunner.java:984)
at com.carrotsearch.randomizedtesting.rules.SystemPropertiesRestoreRule$1.evaluate(SystemPropertiesRestoreRule.java:57)
at org.apache.lucene.util.TestRuleSetupTeardownChained$1.evaluate(TestRuleSetupTeardownChained.java:49)
at org.apache.lucene.util.AbstractBeforeAfterRule$1.evaluate(AbstractBeforeAfterRule.java:45)
at org.apache.lucene.util.TestRuleThreadAndTestName$1.evaluate(TestRuleThreadAndTestName.java:48)
at org.apache.lucene.util.TestRuleIgnoreAfterMaxFailures$1.evaluate(TestRuleIgnoreAfterMaxFailures.java:64)
at org.apache.lucene.util.TestRuleMarkFailure$1.evaluate(TestRuleMarkFailure.java:47)
at com.carrotsearch.randomizedtesting.rules.StatementAdapter.evaluate(StatementAdapter.java:36)
at com.carrotsearch.randomizedtesting.ThreadLeakControl$StatementRunner.run(ThreadLeakControl.java:368)
at com.carrotsearch.randomizedtesting.ThreadLeakControl.forkTimeoutingTask(ThreadLeakControl.java:817)
at com.carrotsearch.randomizedtesting.ThreadLeakControl$3.evaluate(ThreadLeakControl.java:468)
at com.carrotsearch.randomizedtesting.RandomizedRunner.runSingleTest(RandomizedRunner.java:943)
at com.carrotsearch.randomizedtesting.RandomizedRunner$5.evaluate(RandomizedRunner.java:829)
at com.carrotsearch.randomizedtesting.RandomizedRunner$6.evaluate(RandomizedRunner.java:879)
at com.carrotsearch.randomizedtesting.RandomizedRunner$7.evaluate(RandomizedRunner.java:890)
at com.carrotsearch.randomizedtesting.rules.StatementAdapter.evaluate(StatementAdapter.java:36)
at com.carrotsearch.randomizedtesting.rules.SystemPropertiesRestoreRule$1.evaluate(SystemPropertiesRestoreRule.java:57)
at org.apache.lucene.util.AbstractBeforeAfterRule$1.evaluate(AbstractBeforeAfterRule.java:45)
at com.carrotsearch.randomizedtesting.rules.StatementAdapter.evaluate(StatementAdapter.java:36)
at org.apache.lucene.util.TestRuleStoreClassName$1.evaluate(TestRuleStoreClassName.java:41)
at com.carrotsearch.randomizedtesting.rules.NoShadowingOrOverridesOnMethodsRule$1.evaluate(NoShadowingOrOverridesOnMethodsRule.java:40)
at com.carrotsearch.randomizedtesting.rules.NoShadowingOrOverridesOnMethodsRule$1.evaluate(NoShadowingOrOverridesOnMethodsRule.java:40)
at com.carrotsearch.randomizedtesting.rules.StatementAdapter.evaluate(StatementAdapter.java:36)
at com.carrotsearch.randomizedtesting.rules.StatementAdapter.evaluate(StatementAdapter.java:36)
at com.carrotsearch.randomizedtesting.rules.StatementAdapter.evaluate(StatementAdapter.java:36)
at org.apache.lucene.util.TestRuleAssertionsRequired$1.evaluate(TestRuleAssertionsRequired.java:53)
at org.apache.lucene.util.TestRuleMarkFailure$1.evaluate(TestRuleMarkFailure.java:47)
at org.apache.lucene.util.TestRuleIgnoreAfterMaxFailures$1.evaluate(TestRuleIgnoreAfterMaxFailures.java:64)
at org.apache.lucene.util.TestRuleIgnoreTestSuites$1.evaluate(TestRuleIgnoreTestSuites.java:54)
at com.carrotsearch.randomizedtesting.rules.StatementAdapter.evaluate(StatementAdapter.java:36)
at com.carrotsearch.randomizedtesting.ThreadLeakControl$StatementRunner.run(ThreadLeakControl.java:368)
at java.lang.Thread.run(Thread.java:748)
FAILED: org.apache.solr.cloud.autoscaling.IndexSizeTriggerTest.testMergeIntegration
Error Message:
did not finish processing in time
Stack Trace:
java.lang.AssertionError: did not finish processing in time
at __randomizedtesting.SeedInfo.seed([866ED146DF1B2332:D5D793F63D0AB6C8]:0)
at org.junit.Assert.fail(Assert.java:93)
at org.junit.Assert.assertTrue(Assert.java:43)
at org.apache.solr.cloud.autoscaling.IndexSizeTriggerTest.testMergeIntegration(IndexSizeTriggerTest.java:404)
at sun.reflect.NativeMethodAccessorImpl.invoke0(Native Method)
at sun.reflect.NativeMethodAccessorImpl.invoke(NativeMethodAccessorImpl.java:62)
at sun.reflect.DelegatingMethodAccessorImpl.invoke(DelegatingMethodAccessorImpl.java:43)
at java.lang.reflect.Method.invoke(Method.java:498)
at com.carrotsearch.randomizedtesting.RandomizedRunner.invoke(RandomizedRunner.java:1737)
at com.carrotsearch.randomizedtesting.RandomizedRunner$8.evaluate(RandomizedRunner.java:934)
at com.carrotsearch.randomizedtesting.RandomizedRunner$9.evaluate(RandomizedRunner.java:970)
at com.carrotsearch.randomizedtesting.RandomizedRunner$10.evaluate(RandomizedRunner.java:984)
at com.carrotsearch.randomizedtesting.rules.SystemPropertiesRestoreRule$1.evaluate(SystemPropertiesRestoreRule.java:57)
at org.apache.lucene.util.TestRuleSetupTeardownChained$1.evaluate(TestRuleSetupTeardownChained.java:49)
at org.apache.lucene.util.AbstractBeforeAfterRule$1.evaluate(AbstractBeforeAfterRule.java:45)
at org.apache.lucene.util.TestRuleThreadAndTestName$1.evaluate(TestRuleThreadAndTestName.java:48)
at org.apache.lucene.util.TestRuleIgnoreAfterMaxFailures$1.evaluate(TestRuleIgnoreAfterMaxFailures.java:64)
at org.apache.lucene.util.TestRuleMarkFailure$1.evaluate(TestRuleMarkFailure.java:47)
at com.carrotsearch.randomizedtesting.rules.StatementAdapter.evaluate(StatementAdapter.java:36)
at com.carrotsearch.randomizedtesting.ThreadLeakControl$StatementRunner.run(ThreadLeakControl.java:368)
at com.carrotsearch.randomizedtesting.ThreadLeakControl.forkTimeoutingTask(ThreadLeakControl.java:817)
at com.carrotsearch.randomizedtesting.ThreadLeakControl$3.evaluate(ThreadLeakControl.java:468)
at com.carrotsearch.randomizedtesting.RandomizedRunner.runSingleTest(RandomizedRunner.java:943)
at com.carrotsearch.randomizedtesting.RandomizedRunner$5.evaluate(RandomizedRunner.java:829)
at com.carrotsearch.randomizedtesting.RandomizedRunner$6.evaluate(RandomizedRunner.java:879)
at com.carrotsearch.randomizedtesting.RandomizedRunner$7.evaluate(RandomizedRunner.java:890)
at com.carrotsearch.randomizedtesting.rules.StatementAdapter.evaluate(StatementAdapter.java:36)
at com.carrotsearch.randomizedtesting.rules.SystemPropertiesRestoreRule$1.evaluate(SystemPropertiesRestoreRule.java:57)
at org.apache.lucene.util.AbstractBeforeAfterRule$1.evaluate(AbstractBeforeAfterRule.java:45)
at com.carrotsearch.randomizedtesting.rules.StatementAdapter.evaluate(StatementAdapter.java:36)
at org.apache.lucene.util.TestRuleStoreClassName$1.evaluate(TestRuleStoreClassName.java:41)
at com.carrotsearch.randomizedtesting.rules.NoShadowingOrOverridesOnMethodsRule$1.evaluate(NoShadowingOrOverridesOnMethodsRule.java:40)
at com.carrotsearch.randomizedtesting.rules.NoShadowingOrOverridesOnMethodsRule$1.evaluate(NoShadowingOrOverridesOnMethodsRule.java:40)
at com.carrotsearch.randomizedtesting.rules.StatementAdapter.evaluate(StatementAdapter.java:36)
at com.carrotsearch.randomizedtesting.rules.StatementAdapter.evaluate(StatementAdapter.java:36)
at com.carrotsearch.randomizedtesting.rules.StatementAdapter.evaluate(StatementAdapter.java:36)
at org.apache.lucene.util.TestRuleAssertionsRequired$1.evaluate(TestRuleAssertionsRequired.java:53)
at org.apache.lucene.util.TestRuleMarkFailure$1.evaluate(TestRuleMarkFailure.java:47)
at org.apache.lucene.util.TestRuleIgnoreAfterMaxFailures$1.evaluate(TestRuleIgnoreAfterMaxFailures.java:64)
at org.apache.lucene.util.TestRuleIgnoreTestSuites$1.evaluate(TestRuleIgnoreTestSuites.java:54)
at com.carrotsearch.randomizedtesting.rules.StatementAdapter.evaluate(StatementAdapter.java:36)
at com.carrotsearch.randomizedtesting.ThreadLeakControl$StatementRunner.run(ThreadLeakControl.java:368)
at java.lang.Thread.run(Thread.java:748)
Build Log:
[...truncated 12756 lines...]
[junit4] Suite: org.apache.solr.cloud.autoscaling.IndexSizeTriggerTest
[junit4] 2> Creating dataDir: /Users/jenkins/workspace/Lucene-Solr-7.x-MacOSX/solr/build/solr-core/test/J1/temp/solr.cloud.autoscaling.IndexSizeTriggerTest_866ED146DF1B2332-001/init-core-data-001
[junit4] 2> 432141 INFO (SUITE-IndexSizeTriggerTest-seed#[866ED146DF1B2332]-worker) [ ] o.a.s.c.MiniSolrCloudCluster Starting cluster of 2 servers in /Users/jenkins/workspace/Lucene-Solr-7.x-MacOSX/solr/build/solr-core/test/J1/temp/solr.cloud.autoscaling.IndexSizeTriggerTest_866ED146DF1B2332-001/tempDir-001
[junit4] 2> 432141 INFO (SUITE-IndexSizeTriggerTest-seed#[866ED146DF1B2332]-worker) [ ] o.a.s.c.ZkTestServer STARTING ZK TEST SERVER
[junit4] 2> 432141 INFO (Thread-912) [ ] o.a.s.c.ZkTestServer client port:0.0.0.0/0.0.0.0:0
[junit4] 2> 432141 INFO (Thread-912) [ ] o.a.s.c.ZkTestServer Starting server
[junit4] 2> 432145 ERROR (Thread-912) [ ] o.a.z.s.ZooKeeperServer ZKShutdownHandler is not registered, so ZooKeeper server won't take any action on ERROR or SHUTDOWN server state changes
[junit4] 2> 432242 INFO (SUITE-IndexSizeTriggerTest-seed#[866ED146DF1B2332]-worker) [ ] o.a.s.c.ZkTestServer start zk server on port:50006
[junit4] 2> 432252 INFO (zkConnectionManagerCallback-1421-thread-1) [ ] o.a.s.c.c.ConnectionManager zkClient has connected
[junit4] 2> 432262 INFO (jetty-launcher-1418-thread-1) [ ] o.e.j.s.Server jetty-9.4.10.v20180503; built: 2018-05-03T15:56:21.710Z; git: daa59876e6f384329b122929e70a80934569428c; jvm 1.8.0_172-b11
[junit4] 2> 432262 INFO (jetty-launcher-1418-thread-2) [ ] o.e.j.s.Server jetty-9.4.10.v20180503; built: 2018-05-03T15:56:21.710Z; git: daa59876e6f384329b122929e70a80934569428c; jvm 1.8.0_172-b11
[junit4] 2> 432264 INFO (jetty-launcher-1418-thread-2) [ ] o.e.j.s.session DefaultSessionIdManager workerName=node0
[junit4] 2> 432264 INFO (jetty-launcher-1418-thread-2) [ ] o.e.j.s.session No SessionScavenger set, using defaults
[junit4] 2> 432264 INFO (jetty-launcher-1418-thread-2) [ ] o.e.j.s.session node0 Scavenging every 600000ms
[junit4] 2> 432265 INFO (jetty-launcher-1418-thread-1) [ ] o.e.j.s.session DefaultSessionIdManager workerName=node0
[junit4] 2> 432265 INFO (jetty-launcher-1418-thread-1) [ ] o.e.j.s.session No SessionScavenger set, using defaults
[junit4] 2> 432265 INFO (jetty-launcher-1418-thread-1) [ ] o.e.j.s.session node0 Scavenging every 660000ms
[junit4] 2> 432265 INFO (jetty-launcher-1418-thread-2) [ ] o.e.j.s.h.ContextHandler Started o.e.j.s.ServletContextHandler@9797989{/solr,null,AVAILABLE}
[junit4] 2> 432265 INFO (jetty-launcher-1418-thread-1) [ ] o.e.j.s.h.ContextHandler Started o.e.j.s.ServletContextHandler@4aa9b66e{/solr,null,AVAILABLE}
[junit4] 2> 432267 INFO (jetty-launcher-1418-thread-2) [ ] o.e.j.s.AbstractConnector Started ServerConnector@2ba5d66a{SSL,[ssl, http/1.1]}{127.0.0.1:50008}
[junit4] 2> 432267 INFO (jetty-launcher-1418-thread-1) [ ] o.e.j.s.AbstractConnector Started ServerConnector@21a0cdec{SSL,[ssl, http/1.1]}{127.0.0.1:50009}
[junit4] 2> 432267 INFO (jetty-launcher-1418-thread-2) [ ] o.e.j.s.Server Started @432345ms
[junit4] 2> 432267 INFO (jetty-launcher-1418-thread-1) [ ] o.e.j.s.Server Started @432345ms
[junit4] 2> 432267 INFO (jetty-launcher-1418-thread-2) [ ] o.a.s.c.s.e.JettySolrRunner Jetty properties: {hostContext=/solr, hostPort=50008}
[junit4] 2> 432267 INFO (jetty-launcher-1418-thread-1) [ ] o.a.s.c.s.e.JettySolrRunner Jetty properties: {hostContext=/solr, hostPort=50009}
[junit4] 2> 432267 ERROR (jetty-launcher-1418-thread-1) [ ] o.a.s.u.StartupLoggingUtils Missing Java Option solr.log.dir. Logging may be missing or incomplete.
[junit4] 2> 432267 ERROR (jetty-launcher-1418-thread-2) [ ] o.a.s.u.StartupLoggingUtils Missing Java Option solr.log.dir. Logging may be missing or incomplete.
[junit4] 2> 432267 INFO (jetty-launcher-1418-thread-1) [ ] o.a.s.s.SolrDispatchFilter Using logger factory org.apache.logging.slf4j.Log4jLoggerFactory
[junit4] 2> 432267 INFO (jetty-launcher-1418-thread-2) [ ] o.a.s.s.SolrDispatchFilter Using logger factory org.apache.logging.slf4j.Log4jLoggerFactory
[junit4] 2> 432267 INFO (jetty-launcher-1418-thread-1) [ ] o.a.s.s.SolrDispatchFilter ___ _ Welcome to Apache Solr™ version 7.4.0
[junit4] 2> 432267 INFO (jetty-launcher-1418-thread-2) [ ] o.a.s.s.SolrDispatchFilter ___ _ Welcome to Apache Solr™ version 7.4.0
[junit4] 2> 432267 INFO (jetty-launcher-1418-thread-1) [ ] o.a.s.s.SolrDispatchFilter / __| ___| |_ _ Starting in cloud mode on port null
[junit4] 2> 432267 INFO (jetty-launcher-1418-thread-1) [ ] o.a.s.s.SolrDispatchFilter \__ \/ _ \ | '_| Install dir: null
[junit4] 2> 432267 INFO (jetty-launcher-1418-thread-2) [ ] o.a.s.s.SolrDispatchFilter / __| ___| |_ _ Starting in cloud mode on port null
[junit4] 2> 432267 INFO (jetty-launcher-1418-thread-1) [ ] o.a.s.s.SolrDispatchFilter |___/\___/_|_| Start time: 2018-05-31T13:44:52.552Z
[junit4] 2> 432267 INFO (jetty-launcher-1418-thread-2) [ ] o.a.s.s.SolrDispatchFilter \__ \/ _ \ | '_| Install dir: null
[junit4] 2> 432268 INFO (jetty-launcher-1418-thread-2) [ ] o.a.s.s.SolrDispatchFilter |___/\___/_|_| Start time: 2018-05-31T13:44:52.552Z
[junit4] 2> 432270 INFO (zkConnectionManagerCallback-1425-thread-1) [ ] o.a.s.c.c.ConnectionManager zkClient has connected
[junit4] 2> 432270 INFO (zkConnectionManagerCallback-1423-thread-1) [ ] o.a.s.c.c.ConnectionManager zkClient has connected
[junit4] 2> 432270 INFO (jetty-launcher-1418-thread-2) [ ] o.a.s.s.SolrDispatchFilter solr.xml found in ZooKeeper. Loading...
[junit4] 2> 432270 INFO (jetty-launcher-1418-thread-1) [ ] o.a.s.s.SolrDispatchFilter solr.xml found in ZooKeeper. Loading...
[junit4] 2> 432282 INFO (jetty-launcher-1418-thread-2) [ ] o.a.s.c.ZkContainer Zookeeper client=127.0.0.1:50006/solr
[junit4] 2> 432282 INFO (jetty-launcher-1418-thread-1) [ ] o.a.s.c.ZkContainer Zookeeper client=127.0.0.1:50006/solr
[junit4] 2> 432284 INFO (zkConnectionManagerCallback-1431-thread-1) [ ] o.a.s.c.c.ConnectionManager zkClient has connected
[junit4] 2> 432284 INFO (zkConnectionManagerCallback-1433-thread-1) [ ] o.a.s.c.c.ConnectionManager zkClient has connected
[junit4] 2> 432287 INFO (zkConnectionManagerCallback-1435-thread-1) [ ] o.a.s.c.c.ConnectionManager zkClient has connected
[junit4] 2> 432287 INFO (zkConnectionManagerCallback-1437-thread-1) [ ] o.a.s.c.c.ConnectionManager zkClient has connected
[junit4] 2> 432465 INFO (jetty-launcher-1418-thread-2) [n:127.0.0.1:50008_solr ] o.a.s.c.Overseer Overseer (id=null) closing
[junit4] 2> 432465 INFO (jetty-launcher-1418-thread-1) [n:127.0.0.1:50009_solr ] o.a.s.c.Overseer Overseer (id=null) closing
[junit4] 2> 432466 INFO (jetty-launcher-1418-thread-2) [n:127.0.0.1:50008_solr ] o.a.s.c.OverseerElectionContext I am going to be the leader 127.0.0.1:50008_solr
[junit4] 2> 432467 INFO (jetty-launcher-1418-thread-1) [n:127.0.0.1:50009_solr ] o.a.s.c.ZkController Register node as live in ZooKeeper:/live_nodes/127.0.0.1:50009_solr
[junit4] 2> 432467 INFO (jetty-launcher-1418-thread-2) [n:127.0.0.1:50008_solr ] o.a.s.c.Overseer Overseer (id=72119934702125061-127.0.0.1:50008_solr-n_0000000000) starting
[junit4] 2> 432469 INFO (zkCallback-1434-thread-1) [ ] o.a.s.c.c.ZkStateReader Updated live nodes from ZooKeeper... (0) -> (1)
[junit4] 2> 432476 INFO (zkCallback-1436-thread-1) [ ] o.a.s.c.c.ZkStateReader Updated live nodes from ZooKeeper... (0) -> (1)
[junit4] 2> 432484 INFO (zkConnectionManagerCallback-1446-thread-1) [ ] o.a.s.c.c.ConnectionManager zkClient has connected
[junit4] 2> 432485 INFO (jetty-launcher-1418-thread-2) [n:127.0.0.1:50008_solr ] o.a.s.c.c.ZkStateReader Updated live nodes from ZooKeeper... (0) -> (1)
[junit4] 2> 432487 INFO (jetty-launcher-1418-thread-2) [n:127.0.0.1:50008_solr ] o.a.s.c.s.i.ZkClientClusterStateProvider Cluster at 127.0.0.1:50006/solr ready
[junit4] 2> 432488 DEBUG (OverseerAutoScalingTriggerThread-72119934702125061-127.0.0.1:50008_solr-n_0000000000) [ ] o.a.s.c.a.OverseerTriggerThread Adding .auto_add_replicas and .scheduled_maintenance triggers
[junit4] 2> 432489 DEBUG (OverseerAutoScalingTriggerThread-72119934702125061-127.0.0.1:50008_solr-n_0000000000) [ ] o.a.s.c.a.OverseerTriggerThread Refreshing /autoscaling.json with znode version 1
[junit4] 2> 432489 DEBUG (OverseerAutoScalingTriggerThread-72119934702125061-127.0.0.1:50008_solr-n_0000000000) [ ] o.a.s.c.a.OverseerTriggerThread Current znodeVersion 1, lastZnodeVersion -1
[junit4] 2> 432489 DEBUG (OverseerAutoScalingTriggerThread-72119934702125061-127.0.0.1:50008_solr-n_0000000000) [ ] o.a.s.c.a.OverseerTriggerThread Processed trigger updates upto znodeVersion 1
[junit4] 2> 432493 INFO (jetty-launcher-1418-thread-2) [n:127.0.0.1:50008_solr ] o.a.s.c.TransientSolrCoreCacheDefault Allocating transient cache for 2147483647 transient cores
[junit4] 2> 432493 INFO (jetty-launcher-1418-thread-2) [n:127.0.0.1:50008_solr ] o.a.s.c.ZkController Register node as live in ZooKeeper:/live_nodes/127.0.0.1:50008_solr
[junit4] 2> 432496 INFO (zkCallback-1445-thread-1) [ ] o.a.s.c.c.ZkStateReader Updated live nodes from ZooKeeper... (1) -> (2)
[junit4] 2> 432499 INFO (zkCallback-1436-thread-1) [ ] o.a.s.c.c.ZkStateReader Updated live nodes from ZooKeeper... (1) -> (2)
[junit4] 2> 432499 INFO (zkCallback-1434-thread-1) [ ] o.a.s.c.c.ZkStateReader Updated live nodes from ZooKeeper... (1) -> (2)
[junit4] 2> 432501 DEBUG (OverseerAutoScalingTriggerThread-72119934702125061-127.0.0.1:50008_solr-n_0000000000) [ ] o.a.s.c.a.NodeLostTrigger NodeLostTrigger .auto_add_replicas - Initial livenodes: [127.0.0.1:50008_solr, 127.0.0.1:50009_solr]
[junit4] 2> 432501 DEBUG (OverseerAutoScalingTriggerThread-72119934702125061-127.0.0.1:50008_solr-n_0000000000) [ ] o.a.s.c.a.OverseerTriggerThread -- clean old nodeAdded markers
[junit4] 2> 432502 DEBUG (OverseerAutoScalingTriggerThread-72119934702125061-127.0.0.1:50008_solr-n_0000000000) [ ] o.a.s.c.a.OverseerTriggerThread Current znodeVersion 1, lastZnodeVersion 1
[junit4] 2> 432502 DEBUG (ScheduledTrigger-2029-thread-1) [ ] o.a.s.c.a.NodeLostTrigger Running NodeLostTrigger: .auto_add_replicas with currently live nodes: 2
[junit4] 2> 432841 WARN (jetty-launcher-1418-thread-2) [n:127.0.0.1:50008_solr ] o.a.s.h.a.MetricsHistoryHandler Missing .system, keeping metrics history in memory
[junit4] 2> 432901 INFO (jetty-launcher-1418-thread-2) [n:127.0.0.1:50008_solr ] o.a.s.m.r.SolrJmxReporter JMX monitoring for 'solr_50008.solr.node' (registry 'solr.node') enabled at server: com.sun.jmx.mbeanserver.JmxMBeanServer@783a6767
[junit4] 2> 432908 INFO (jetty-launcher-1418-thread-2) [n:127.0.0.1:50008_solr ] o.a.s.m.r.SolrJmxReporter JMX monitoring for 'solr_50008.solr.jvm' (registry 'solr.jvm') enabled at server: com.sun.jmx.mbeanserver.JmxMBeanServer@783a6767
[junit4] 2> 432908 INFO (jetty-launcher-1418-thread-2) [n:127.0.0.1:50008_solr ] o.a.s.m.r.SolrJmxReporter JMX monitoring for 'solr_50008.solr.jetty' (registry 'solr.jetty') enabled at server: com.sun.jmx.mbeanserver.JmxMBeanServer@783a6767
[junit4] 2> 432909 INFO (jetty-launcher-1418-thread-2) [n:127.0.0.1:50008_solr ] o.a.s.c.CorePropertiesLocator Found 0 core definitions underneath /Users/jenkins/workspace/Lucene-Solr-7.x-MacOSX/solr/build/solr-core/test/J1/temp/solr.cloud.autoscaling.IndexSizeTriggerTest_866ED146DF1B2332-001/tempDir-001/node2/.
[junit4] 2> 432988 INFO (zkConnectionManagerCallback-1453-thread-1) [ ] o.a.s.c.c.ConnectionManager zkClient has connected
[junit4] 2> 432989 INFO (jetty-launcher-1418-thread-1) [n:127.0.0.1:50009_solr ] o.a.s.c.c.ZkStateReader Updated live nodes from ZooKeeper... (0) -> (2)
[junit4] 2> 432991 INFO (jetty-launcher-1418-thread-1) [n:127.0.0.1:50009_solr ] o.a.s.c.s.i.ZkClientClusterStateProvider Cluster at 127.0.0.1:50006/solr ready
[junit4] 2> 432991 WARN (jetty-launcher-1418-thread-1) [n:127.0.0.1:50009_solr ] o.a.s.h.a.MetricsHistoryHandler Missing .system, keeping metrics history in memory
[junit4] 2> 433010 INFO (jetty-launcher-1418-thread-1) [n:127.0.0.1:50009_solr ] o.a.s.m.r.SolrJmxReporter JMX monitoring for 'solr_50009.solr.node' (registry 'solr.node') enabled at server: com.sun.jmx.mbeanserver.JmxMBeanServer@783a6767
[junit4] 2> 433016 INFO (jetty-launcher-1418-thread-1) [n:127.0.0.1:50009_solr ] o.a.s.m.r.SolrJmxReporter JMX monitoring for 'solr_50009.solr.jvm' (registry 'solr.jvm') enabled at server: com.sun.jmx.mbeanserver.JmxMBeanServer@783a6767
[junit4] 2> 433016 INFO (jetty-launcher-1418-thread-1) [n:127.0.0.1:50009_solr ] o.a.s.m.r.SolrJmxReporter JMX monitoring for 'solr_50009.solr.jetty' (registry 'solr.jetty') enabled at server: com.sun.jmx.mbeanserver.JmxMBeanServer@783a6767
[junit4] 2> 433017 INFO (jetty-launcher-1418-thread-1) [n:127.0.0.1:50009_solr ] o.a.s.c.CorePropertiesLocator Found 0 core definitions underneath /Users/jenkins/workspace/Lucene-Solr-7.x-MacOSX/solr/build/solr-core/test/J1/temp/solr.cloud.autoscaling.IndexSizeTriggerTest_866ED146DF1B2332-001/tempDir-001/node1/.
[junit4] 2> 433045 INFO (zkConnectionManagerCallback-1455-thread-1) [ ] o.a.s.c.c.ConnectionManager zkClient has connected
[junit4] 2> 433050 INFO (zkConnectionManagerCallback-1460-thread-1) [ ] o.a.s.c.c.ConnectionManager zkClient has connected
[junit4] 2> 433052 INFO (SUITE-IndexSizeTriggerTest-seed#[866ED146DF1B2332]-worker) [ ] o.a.s.c.c.ZkStateReader Updated live nodes from ZooKeeper... (0) -> (2)
[junit4] 2> 433054 INFO (SUITE-IndexSizeTriggerTest-seed#[866ED146DF1B2332]-worker) [ ] o.a.s.c.s.i.ZkClientClusterStateProvider Cluster at 127.0.0.1:50006/solr ready
[junit4] 2> 433145 DEBUG (SUITE-IndexSizeTriggerTest-seed#[866ED146DF1B2332]-worker) [ ] o.a.s.c.a.s.SimClusterStateProvider --- new Overseer leader: 127.0.0.1:10000_solr
[junit4] 2> 433145 DEBUG (Simulated OverseerAutoScalingTriggerThread) [ ] o.a.s.c.a.OverseerTriggerThread Adding .auto_add_replicas and .scheduled_maintenance triggers
[junit4] 2> 433146 DEBUG (Simulated OverseerAutoScalingTriggerThread) [ ] o.a.s.c.a.OverseerTriggerThread Refreshing /autoscaling.json with znode version 0
[junit4] 2> 433146 DEBUG (Simulated OverseerAutoScalingTriggerThread) [ ] o.a.s.c.a.OverseerTriggerThread Current znodeVersion 0, lastZnodeVersion -1
[junit4] 2> 433146 DEBUG (Simulated OverseerAutoScalingTriggerThread) [ ] o.a.s.c.a.OverseerTriggerThread Processed trigger updates upto znodeVersion 0
[junit4] 2> 433148 WARN (SUITE-IndexSizeTriggerTest-seed#[866ED146DF1B2332]-worker) [ ] o.a.s.h.a.MetricsHistoryHandler Missing .system, keeping metrics history in memory
[junit4] 2> 433150 DEBUG (Simulated OverseerAutoScalingTriggerThread) [ ] o.a.s.c.a.NodeLostTrigger NodeLostTrigger .auto_add_replicas - Initial livenodes: [127.0.0.1:10001_solr, 127.0.0.1:10000_solr]
[junit4] 2> 433150 DEBUG (Simulated OverseerAutoScalingTriggerThread) [ ] o.a.s.c.a.OverseerTriggerThread -- clean old nodeAdded markers
[junit4] 2> 433150 DEBUG (Simulated OverseerAutoScalingTriggerThread) [ ] o.a.s.c.a.OverseerTriggerThread Current znodeVersion 0, lastZnodeVersion 0
[junit4] 2> 433152 DEBUG (ScheduledTrigger-2042-thread-2) [ ] o.a.s.c.a.NodeLostTrigger Running NodeLostTrigger: .auto_add_replicas with currently live nodes: 2
[junit4] 2> 433182 DEBUG (ScheduledTrigger-2042-thread-3) [ ] o.a.s.c.a.NodeLostTrigger Running NodeLostTrigger: .auto_add_replicas with currently live nodes: 2
[junit4] 2> 433207 DEBUG (ScheduledTrigger-2042-thread-4) [ ] o.a.s.c.a.NodeLostTrigger Running NodeLostTrigger: .auto_add_replicas with currently live nodes: 2
[junit4] 2> 433228 DEBUG (ScheduledTrigger-2042-thread-3) [ ] o.a.s.c.a.NodeLostTrigger Running NodeLostTrigger: .auto_add_replicas with currently live nodes: 2
[junit4] 2> 433251 DEBUG (ScheduledTrigger-2042-thread-4) [ ] o.a.s.c.a.NodeLostTrigger Running NodeLostTrigger: .auto_add_replicas with currently live nodes: 2
[junit4] 2> 433275 DEBUG (ScheduledTrigger-2042-thread-4) [ ] o.a.s.c.a.NodeLostTrigger Running NodeLostTrigger: .auto_add_replicas with currently live nodes: 2
[junit4] 2> 433296 DEBUG (ScheduledTrigger-2042-thread-3) [ ] o.a.s.c.a.NodeLostTrigger Running NodeLostTrigger: .auto_add_replicas with currently live nodes: 2
[junit4] 2> 433316 DEBUG (ScheduledTrigger-2042-thread-1) [ ] o.a.s.c.a.NodeLostTrigger Running NodeLostTrigger: .auto_add_replicas with currently live nodes: 2
[junit4] 2> 433337 DEBUG (ScheduledTrigger-2042-thread-1) [ ] o.a.s.c.a.NodeLostTrigger Running NodeLostTrigger: .auto_add_replicas with currently live nodes: 2
[junit4] 2> 433359 DEBUG (ScheduledTrigger-2042-thread-4) [ ] o.a.s.c.a.NodeLostTrigger Running NodeLostTrigger: .auto_add_replicas with currently live nodes: 2
[junit4] 2> 433380 DEBUG (ScheduledTrigger-2042-thread-4) [ ] o.a.s.c.a.NodeLostTrigger Running NodeLostTrigger: .auto_add_replicas with currently live nodes: 2
[junit4] 2> 433401 DEBUG (ScheduledTrigger-2042-thread-4) [ ] o.a.s.c.a.NodeLostTrigger Running NodeLostTrigger: .auto_add_replicas with currently live nodes: 2
[junit4] 2> 433422 DEBUG (ScheduledTrigger-2042-thread-2) [ ] o.a.s.c.a.NodeLostTrigger Running NodeLostTrigger: .auto_add_replicas with currently live nodes: 2
[junit4] 2> 433451 DEBUG (ScheduledTrigger-2042-thread-3) [ ] o.a.s.c.a.NodeLostTrigger Running NodeLostTrigger: .auto_add_replicas with currently live nodes: 2
[junit4] 2> 433457 DEBUG (simCloudManagerPool-2041-thread-7) [ ] o.a.s.c.a.s.SimClusterStateProvider -- elected new leader for testSplitIntegration_collection / shard1: {"core_node1":{
[junit4] 2> "core":"testSplitIntegration_collection_shard1_replica_n1",
[junit4] 2> "leader":"true",
[junit4] 2> "SEARCHER.searcher.maxDoc":0,
[junit4] 2> "SEARCHER.searcher.deletedDocs":0,
[junit4] 2> "INDEX.sizeInBytes":1,
[junit4] 2> "node_name":"127.0.0.1:10001_solr",
[junit4] 2> "state":"active",
[junit4] 2> "type":"NRT",
[junit4] 2> "SEARCHER.searcher.numDocs":0,
[junit4] 2> "shard":"shard1",
[junit4] 2> "collection":"testSplitIntegration_collection"}}
[junit4] 2> 433457 DEBUG (simCloudManagerPool-2041-thread-6) [ ] o.a.s.c.a.s.SimClusterStateProvider -- elected new leader for testSplitIntegration_collection / shard2: {"core_node3":{
[junit4] 2> "core":"testSplitIntegration_collection_shard2_replica_n3",
[junit4] 2> "leader":"true",
[junit4] 2> "SEARCHER.searcher.maxDoc":0,
[junit4] 2> "SEARCHER.searcher.deletedDocs":0,
[junit4] 2> "INDEX.sizeInBytes":1,
[junit4] 2> "node_name":"127.0.0.1:10001_solr",
[junit4] 2> "state":"active",
[junit4] 2> "type":"NRT",
[junit4] 2> "SEARCHER.searcher.numDocs":0,
[junit4] 2> "shard":"shard2",
[ju
[...truncated too long message...]
ers for registry=solr.jvm, tag=null
[junit4] 2> 39618 INFO (jetty-closer-88-thread-2) [ ] o.a.s.m.r.SolrJmxReporter Closing reporter [org.apache.solr.metrics.reporters.SolrJmxReporter@1a7ba778: rootName = solr_49324, domain = solr.jvm, service url = null, agent id = null] for registry solr.jvm / com.codahale.metrics.MetricRegistry@1339024e
[junit4] 2> 39618 INFO (jetty-closer-88-thread-1) [ ] o.a.s.m.SolrMetricManager Closing metric reporters for registry=solr.jvm, tag=null
[junit4] 2> 39619 INFO (jetty-closer-88-thread-1) [ ] o.a.s.m.r.SolrJmxReporter Closing reporter [org.apache.solr.metrics.reporters.SolrJmxReporter@36d3c837: rootName = solr_49323, domain = solr.jvm, service url = null, agent id = null] for registry solr.jvm / com.codahale.metrics.MetricRegistry@1339024e
[junit4] 2> 39622 INFO (jetty-closer-88-thread-2) [ ] o.a.s.m.SolrMetricManager Closing metric reporters for registry=solr.jetty, tag=null
[junit4] 2> 39622 INFO (jetty-closer-88-thread-2) [ ] o.a.s.m.r.SolrJmxReporter Closing reporter [org.apache.solr.metrics.reporters.SolrJmxReporter@72c1a497: rootName = solr_49324, domain = solr.jetty, service url = null, agent id = null] for registry solr.jetty / com.codahale.metrics.MetricRegistry@341089f6
[junit4] 2> 39622 INFO (jetty-closer-88-thread-1) [ ] o.a.s.m.SolrMetricManager Closing metric reporters for registry=solr.jetty, tag=null
[junit4] 2> 39622 INFO (jetty-closer-88-thread-1) [ ] o.a.s.m.r.SolrJmxReporter Closing reporter [org.apache.solr.metrics.reporters.SolrJmxReporter@4f6472bf: rootName = solr_49323, domain = solr.jetty, service url = null, agent id = null] for registry solr.jetty / com.codahale.metrics.MetricRegistry@341089f6
[junit4] 2> 39625 INFO (jetty-closer-88-thread-1) [ ] o.a.s.c.ZkController Remove node as live in ZooKeeper:/live_nodes/127.0.0.1:49323_solr
[junit4] 2> 39625 INFO (jetty-closer-88-thread-2) [ ] o.a.s.c.ZkController Remove node as live in ZooKeeper:/live_nodes/127.0.0.1:49324_solr
[junit4] 2> 39628 INFO (jetty-closer-88-thread-2) [ ] o.a.s.m.SolrMetricManager Closing metric reporters for registry=solr.cluster, tag=null
[junit4] 2> 39628 INFO (jetty-closer-88-thread-1) [ ] o.a.s.m.SolrMetricManager Closing metric reporters for registry=solr.cluster, tag=null
[junit4] 2> 39629 INFO (jetty-closer-88-thread-1) [ ] o.a.s.c.TransientSolrCoreCacheDefault Allocating transient cache for 2147483647 transient cores
[junit4] 2> 39630 INFO (zkCallback-103-thread-1) [ ] o.a.s.c.c.ZkStateReader Updated live nodes from ZooKeeper... (2) -> (0)
[junit4] 2> 39631 INFO (zkCallback-105-thread-1) [ ] o.a.s.c.c.ZkStateReader Updated live nodes from ZooKeeper... (2) -> (0)
[junit4] 2> 39632 INFO (zkCallback-120-thread-1) [ ] o.a.s.c.c.ZkStateReader Updated live nodes from ZooKeeper... (2) -> (0)
[junit4] 2> 39632 INFO (zkCallback-114-thread-1) [ ] o.a.s.c.c.ZkStateReader Updated live nodes from ZooKeeper... (2) -> (0)
[junit4] 2> 39634 INFO (jetty-closer-88-thread-2) [ ] o.a.s.c.Overseer Overseer (id=72120230383845382-127.0.0.1:49324_solr-n_0000000000) closing
[junit4] 2> 39634 INFO (OverseerStateUpdate-72120230383845382-127.0.0.1:49324_solr-n_0000000000) [ ] o.a.s.c.Overseer Overseer Loop exiting : 127.0.0.1:49324_solr
[junit4] 2> 39635 WARN (OverseerAutoScalingTriggerThread-72120230383845382-127.0.0.1:49324_solr-n_0000000000) [ ] o.a.s.c.a.OverseerTriggerThread OverseerTriggerThread woken up but we are closed, exiting.
[junit4] 2> 39636 DEBUG (jetty-closer-88-thread-2) [ ] o.a.s.c.a.ScheduledTriggers Shutting down scheduled thread pool executor now
[junit4] 2> 39639 DEBUG (jetty-closer-88-thread-2) [ ] o.a.s.c.a.ScheduledTriggers Shutting down action executor now
[junit4] 2> 39639 DEBUG (jetty-closer-88-thread-2) [ ] o.a.s.c.a.ScheduledTriggers Awaiting termination for action executor
[junit4] 2> 39639 DEBUG (jetty-closer-88-thread-2) [ ] o.a.s.c.a.ScheduledTriggers Awaiting termination for scheduled thread pool executor
[junit4] 2> 39639 DEBUG (jetty-closer-88-thread-2) [ ] o.a.s.c.a.ScheduledTriggers ScheduledTriggers closed completely
[junit4] 2> 39639 DEBUG (jetty-closer-88-thread-2) [ ] o.a.s.c.a.OverseerTriggerThread OverseerTriggerThread has been closed explicitly
[junit4] 2> 39645 INFO (jetty-closer-88-thread-1) [ ] o.e.j.s.h.ContextHandler Stopped o.e.j.s.ServletContextHandler@50852301{/solr,null,UNAVAILABLE}
[junit4] 2> 39646 INFO (jetty-closer-88-thread-1) [ ] o.e.j.s.session node0 Stopped scavenging
[junit4] 2> 39648 INFO (jetty-closer-88-thread-2) [ ] o.e.j.s.h.ContextHandler Stopped o.e.j.s.ServletContextHandler@40ab26cf{/solr,null,UNAVAILABLE}
[junit4] 2> 39649 INFO (jetty-closer-88-thread-2) [ ] o.e.j.s.session node0 Stopped scavenging
[junit4] 2> 39650 ERROR (SUITE-IndexSizeTriggerTest-seed#[866ED146DF1B2332]-worker) [ ] o.a.z.s.ZooKeeperServer ZKShutdownHandler is not registered, so ZooKeeper server won't take any action on ERROR or SHUTDOWN server state changes
[junit4] 2> 39650 INFO (SUITE-IndexSizeTriggerTest-seed#[866ED146DF1B2332]-worker) [ ] o.a.s.c.ZkTestServer connecting to 127.0.0.1:49321 49321
[junit4] 2> 39770 INFO (Thread-40) [ ] o.a.s.c.ZkTestServer connecting to 127.0.0.1:49321 49321
[junit4] 2> 39935 WARN (Thread-40) [ ] o.a.s.c.ZkTestServer Watch limit violations:
[junit4] 2> Maximum concurrent create/delete watches above limit:
[junit4] 2>
[junit4] 2> 5 /solr/aliases.json
[junit4] 2> 2 /solr/security.json
[junit4] 2>
[junit4] 2> Maximum concurrent data watches above limit:
[junit4] 2>
[junit4] 2> 5 /solr/clusterstate.json
[junit4] 2> 5 /solr/clusterprops.json
[junit4] 2>
[junit4] 2> Maximum concurrent children watches above limit:
[junit4] 2>
[junit4] 2> 5 /solr/live_nodes
[junit4] 2> 5 /solr/collections
[junit4] 2>
[junit4] 2> NOTE: leaving temporary files on disk at: /Users/jenkins/workspace/Lucene-Solr-7.x-MacOSX/solr/build/solr-core/test/J0/temp/solr.cloud.autoscaling.IndexSizeTriggerTest_866ED146DF1B2332-003
[junit4] 2> May 31, 2018 3:00:08 PM com.carrotsearch.randomizedtesting.ThreadLeakControl checkThreadLeaks
[junit4] 2> WARNING: Will linger awaiting termination of 1 leaked thread(s).
[junit4] 2> NOTE: test params are: codec=Asserting(Lucene70): {}, docValues:{}, maxPointsInLeafNode=1242, maxMBSortInHeap=7.510966563114753, sim=RandomSimilarity(queryNorm=false): {}, locale=es-BO, timezone=Europe/Helsinki
[junit4] 2> NOTE: Mac OS X 10.11.6 x86_64/Oracle Corporation 1.8.0_172 (64-bit)/cpus=3,threads=1,free=138230752,total=198180864
[junit4] 2> NOTE: All tests run in this JVM: [IndexSizeTriggerTest, IndexSizeTriggerTest, IndexSizeTriggerTest]
[junit4] Completed [5/5 (5!)] on J0 in 4.43s, 4 tests, 1 failure <<< FAILURES!
[junit4]
[junit4]
[junit4] Tests with failures [seed: 866ED146DF1B2332]:
[junit4] - org.apache.solr.cloud.autoscaling.IndexSizeTriggerTest.testSplitIntegration
[junit4] - org.apache.solr.cloud.autoscaling.IndexSizeTriggerTest.testMergeIntegration
[junit4] - org.apache.solr.cloud.autoscaling.IndexSizeTriggerTest.testSplitIntegration
[junit4] - org.apache.solr.cloud.autoscaling.IndexSizeTriggerTest.testSplitIntegration
[junit4] - org.apache.solr.cloud.autoscaling.IndexSizeTriggerTest.testMergeIntegration
[junit4] - org.apache.solr.cloud.autoscaling.IndexSizeTriggerTest.testSplitIntegration
[junit4] - org.apache.solr.cloud.autoscaling.IndexSizeTriggerTest.testMergeIntegration
[junit4] - org.apache.solr.cloud.autoscaling.IndexSizeTriggerTest.testTrigger
[junit4]
[junit4]
[junit4] JVM J0: 1.01 .. 41.01 = 40.00s
[junit4] JVM J1: 1.00 .. 38.25 = 37.25s
[junit4] Execution time total: 41 seconds
[junit4] Tests summary: 5 suites, 20 tests, 4 errors, 4 failures
BUILD FAILED
/Users/jenkins/workspace/Lucene-Solr-7.x-MacOSX/lucene/common-build.xml:1568: The following error occurred while executing this line:
/Users/jenkins/workspace/Lucene-Solr-7.x-MacOSX/lucene/common-build.xml:1092: There were test failures: 5 suites, 20 tests, 4 errors, 4 failures [seed: 866ED146DF1B2332]
Total time: 43 seconds
[repro] Setting last failure code to 256
[repro] Failures:
[repro] 5/5 failed: org.apache.solr.cloud.autoscaling.IndexSizeTriggerTest
[repro] Exiting with code 256
+ mv lucene/build lucene/build.repro
+ mv solr/build solr/build.repro
+ mv lucene/build.orig lucene/build
+ mv solr/build.orig solr/build
Archiving artifacts
Setting ANT_1_8_2_HOME=/Users/jenkins/tools/hudson.tasks.Ant_AntInstallation/ANT_1.8.2
[WARNINGS] Parsing warnings in console log with parser Java Compiler (javac)
Setting ANT_1_8_2_HOME=/Users/jenkins/tools/hudson.tasks.Ant_AntInstallation/ANT_1.8.2
Setting ANT_1_8_2_HOME=/Users/jenkins/tools/hudson.tasks.Ant_AntInstallation/ANT_1.8.2
<Git Blamer> Using GitBlamer to create author and commit information for all warnings.
<Git Blamer> GIT_COMMIT=a462c147a0607a984ce157d9b7fae0c20c8a9ad7, workspace=/Users/jenkins/workspace/Lucene-Solr-7.x-MacOSX
[WARNINGS] Computing warning deltas based on reference build #674
Recording test results
Setting ANT_1_8_2_HOME=/Users/jenkins/tools/hudson.tasks.Ant_AntInstallation/ANT_1.8.2
Build step 'Publish JUnit test result report' changed build result to UNSTABLE
Email was triggered for: Unstable (Test Failures)
Sending email for trigger: Unstable (Test Failures)
Setting ANT_1_8_2_HOME=/Users/jenkins/tools/hudson.tasks.Ant_AntInstallation/ANT_1.8.2
Setting ANT_1_8_2_HOME=/Users/jenkins/tools/hudson.tasks.Ant_AntInstallation/ANT_1.8.2
Setting ANT_1_8_2_HOME=/Users/jenkins/tools/hudson.tasks.Ant_AntInstallation/ANT_1.8.2
Setting ANT_1_8_2_HOME=/Users/jenkins/tools/hudson.tasks.Ant_AntInstallation/ANT_1.8.2