You are viewing a plain text version of this content. The canonical link for it is here.
Posted to dev@geronimo.apache.org by ga...@apache.org on 2010/08/23 17:25:35 UTC
[BUILD] branches/2.2: Failed for Revision: 988092
Geronimo Revision: 988092 built with tests included
See the full build-0800.log file at http://people.apache.org/builds/geronimo/server/binaries/2.2/20100823/build-0800.log
Download the binaries from http://people.apache.org/builds/geronimo/server/binaries/2.2/20100823
[INFO] BUILD SUCCESSFUL
[INFO] ------------------------------------------------------------------------
[INFO] Total time: 43 minutes 17 seconds
[INFO] Finished at: Mon Aug 23 08:50:41 EDT 2010
[INFO] Final Memory: 342M/1004M
[INFO] ------------------------------------------------------------------------
TESTSUITE RESULTS (Failures only)
=================================
Assembly: tomcat
=================================
See full test results and logs at http://people.apache.org/builds/geronimo/server/binaries/2.2/20100823/logs-0800-tomcat/
[INFO] Running TestSuite
[INFO] Tests run: 40, Failures: 31, Errors: 0, Skipped: 0, Time elapsed: 179.947 sec <<< FAILURE!
[INFO] Running TestSuite
[INFO] Tests run: 12, Failures: 11, Errors: 0, Skipped: 0, Time elapsed: 52.166 sec <<< FAILURE!
--
[INFO] Running TestSuite
[INFO] Tests run: 36, Failures: 1, Errors: 0, Skipped: 0, Time elapsed: 69.759 sec <<< FAILURE!
Assembly: jetty
=================================
See full test results and logs at http://people.apache.org/builds/geronimo/server/binaries/2.2/20100823/logs-0800-jetty/
[INFO] Running TestSuite
[INFO] Tests run: 116, Failures: 3, Errors: 0, Skipped: 113, Time elapsed: 16.885 sec <<< FAILURE!
[INFO] Running TestSuite
[INFO] Tests run: 12, Failures: 10, Errors: 0, Skipped: 0, Time elapsed: 63.613 sec <<< FAILURE!
--
[INFO] Running TestSuite
[INFO] Tests run: 2, Failures: 2, Errors: 0, Skipped: 0, Time elapsed: 8.096 sec <<< FAILURE!
--
[INFO] Running TestSuite
[INFO] Tests run: 36, Failures: 1, Errors: 0, Skipped: 0, Time elapsed: 17.729 sec <<< FAILURE!
Samples: branches/2.2
=================================
Log: http://people.apache.org/builds/geronimo/server/binaries/2.2/20100823/samples-0800.log
Build status: FAILED