You are viewing a plain text version of this content. The canonical link for it is here.
Posted to commits@mina.apache.org by Apache Jenkins Server <je...@builds.apache.org> on 2013/03/22 14:56:22 UTC
Build failed in Jenkins: MINA-trunk-jdk1.6-windows #175
See <https://builds.apache.org/job/MINA-trunk-jdk1.6-windows/175/changes>
Changes:
[elecharny] o The channel is declared in the AbstractIoChannel as a
[elecharny] o Removed some final keyword
[elecharny] o Switched from Channel to SelectableChannel
[elecharny] As the AsbtractIoServer now take a SelectableChannel parameter, fixed
[elecharny] o Added the Mina3_udp and Netty3_udp type
------------------------------------------
[...truncated 44 lines...]
[INFO]
[INFO] --- cobertura-maven-plugin:2.5.1:instrument (default) @ mina-parent ---
[INFO] Skipping cobertura mojo for project with packaging type 'pom'
[INFO]
[INFO] --- cobertura-maven-plugin:2.5.1:cobertura (default) @ mina-parent ---
[INFO]
[INFO] --- maven-install-plugin:2.3.1:install (default-install) @ mina-parent ---
[INFO] Installing <https://builds.apache.org/job/MINA-trunk-jdk1.6-windows/ws/pom.xml> to f:\hudson\hudson-slave\maven-repositories\0\org\apache\mina\mina-parent\3.0.0-M1-SNAPSHOT\mina-parent-3.0.0-M1-SNAPSHOT.pom
[INFO]
[INFO] ------------------------------------------------------------------------
[INFO] Building Apache MINA Codec 3.0.0-M1-SNAPSHOT 3.0.0-M1-SNAPSHOT
[INFO] ------------------------------------------------------------------------
[INFO]
[INFO] --- maven-clean-plugin:2.4.1:clean (default-clean) @ mina-codec ---
[INFO] Deleting F:\hudson\hudson-slave\workspace\MINA-trunk-jdk1.6-windows\codec\target
[INFO]
[INFO] --- maven-remote-resources-plugin:1.1:process (default) @ mina-codec ---
[INFO]
[INFO] --- maven-resources-plugin:2.4.3:resources (default-resources) @ mina-codec ---
[INFO] Using 'UTF-8' encoding to copy filtered resources.
[INFO] skip non existing resourceDirectory F:\hudson\hudson-slave\workspace\MINA-trunk-jdk1.6-windows\codec\src\main\resources
[INFO] Copying 3 resources
[INFO]
[INFO] --- maven-compiler-plugin:2.3.2:compile (default-compile) @ mina-codec ---
[INFO] Compiling 3 source files to F:\hudson\hudson-slave\workspace\MINA-trunk-jdk1.6-windows\codec\target\classes
[INFO] Using 'UTF-8' encoding to copy filtered resources.
[INFO] skip non existing resourceDirectory F:\hudson\hudson-slave\workspace\MINA-trunk-jdk1.6-windows\codec\src\test\resources
[INFO] Copying 3 resources
[INFO]
[INFO] --- maven-resources-plugin:2.4.3:testResources (default-testResources) @ mina-codec ---
[INFO]
[INFO] --- maven-compiler-plugin:2.3.2:testCompile (default-testCompile) @ mina-codec ---
[INFO] No sources to compile
[INFO]
[INFO] --- maven-surefire-plugin:2.7.2:test (default-test) @ mina-codec ---
[INFO] Surefire report directory: F:\hudson\hudson-slave\workspace\MINA-trunk-jdk1.6-windows\codec\target\surefire-reports
-------------------------------------------------------
T E S T S
-------------------------------------------------------
There are no tests to run.
Results :
Tests run: 0, Failures: 0, Errors: 0, Skipped: 0
[JENKINS] Recording test results
[INFO]
[INFO] --- maven-bundle-plugin:2.3.5:bundle (default-bundle) @ mina-codec ---
Mar 22, 2013 1:56:11 PM hudson.maven.ExecutedMojo <init>
WARNING: Failed to getClass for org.apache.maven.plugin.source.SourceJarMojo
[INFO]
[INFO] --- maven-source-plugin:2.1.2:jar (attach-source) @ mina-codec ---
[WARNING] NOT adding sources to artifacts with classifier as Maven only supports one classifier per artifact. Current artifact [org.apache.mina:mina-codec:bundle:3.0.0-M1-SNAPSHOT] has a [] classifier.
[INFO]
[INFO] --- maven-remote-resources-plugin:1.1:process (default) @ mina-codec ---
[INFO]
[INFO] --- maven-resources-plugin:2.4.3:resources (default-resources) @ mina-codec ---
[INFO] Using 'UTF-8' encoding to copy filtered resources.
[INFO] skip non existing resourceDirectory F:\hudson\hudson-slave\workspace\MINA-trunk-jdk1.6-windows\codec\src\main\resources
[INFO] Copying 3 resources
[INFO] Copying 3 resources
[INFO]
[INFO] --- maven-compiler-plugin:2.3.2:compile (default-compile) @ mina-codec ---
[INFO] Nothing to compile - all classes are up to date
[INFO]
[INFO] --- cobertura-maven-plugin:2.5.1:instrument (default) @ mina-codec ---
[INFO] Cobertura 1.9.4.1 - GNU GPL License (NO WARRANTY) - See COPYRIGHT file
Instrumenting 3 files to F:\hudson\hudson-slave\workspace\MINA-trunk-jdk1.6-windows\codec\target\generated-classes\cobertura
Cobertura: Saved information on 3 classes.
Instrument time: 74ms
[INFO] Instrumentation was successful.
[INFO] NOT adding cobertura ser file to attached artifacts list.
[INFO] [INFO] Using 'UTF-8' encoding to copy filtered resources.
[INFO] --- maven-resources-plugin:2.4.3:testResources (default-testResources) @ mina-codec ---[INFO] skip non existing resourceDirectory F:\hudson\hudson-slave\workspace\MINA-trunk-jdk1.6-windows\codec\src\test\resources
[INFO] Copying 3 resources
[INFO] Copying 3 resources
[INFO]
[INFO] --- maven-compiler-plugin:2.3.2:testCompile (default-testCompile) @ mina-codec ---
[INFO] No sources to compile
[INFO]
[INFO] --- maven-surefire-plugin:2.7.2:test (default-test) @ mina-codec ---
[INFO] Surefire report directory: F:\hudson\hudson-slave\workspace\MINA-trunk-jdk1.6-windows\codec\target\surefire-reports
-------------------------------------------------------
T E S T S
-------------------------------------------------------
There are no tests to run.
Results :
Tests run: 0, Failures: 0, Errors: 0, Skipped: 0
[JENKINS] Recording test results
[INFO]
[INFO] --- cobertura-maven-plugin:2.5.1:cobertura (default) @ mina-codec ---
[INFO] Cobertura 1.9.4.1 - GNU GPL License (NO WARRANTY) - See COPYRIGHT file
Cobertura: Loaded information on 3 classes.
Report time: 95ms
[INFO] Cobertura Report generation was successful.
[INFO]
[INFO] --- maven-install-plugin:2.3.1:install (default-install) @ mina-codec ---
[INFO] Installing F:\hudson\hudson-slave\workspace\MINA-trunk-jdk1.6-windows\codec\target\mina-codec-3.0.0-M1-SNAPSHOT.jar to f:\hudson\hudson-slave\maven-repositories\0\org\apache\mina\mina-codec\3.0.0-M1-SNAPSHOT\mina-codec-3.0.0-M1-SNAPSHOT.jar
[INFO] Installing F:\hudson\hudson-slave\workspace\MINA-trunk-jdk1.6-windows\codec\pom.xml to f:\hudson\hudson-slave\maven-repositories\0\org\apache\mina\mina-codec\3.0.0-M1-SNAPSHOT\mina-codec-3.0.0-M1-SNAPSHOT.pom
[INFO]
[INFO] --- maven-bundle-plugin:2.3.5:install (default-install) @ mina-codec ---
[INFO] Installing org/apache/mina/mina-codec/3.0.0-M1-SNAPSHOT/mina-codec-3.0.0-M1-SNAPSHOT.jar
[INFO] Writing OBR metadata
[WARNING] Exception while updating local OBR: Unable to write repository xml
org.apache.maven.plugin.MojoExecutionException: Unable to write repository xml
at org.apache.felix.obrplugin.ObrUpdate.writeRepositoryXml(ObrUpdate.java:253)
at org.apache.felix.obrplugin.ObrInstall.execute(ObrInstall.java:149)
at org.apache.maven.plugin.DefaultBuildPluginManager.executeMojo(DefaultBuildPluginManager.java:107)
at org.apache.maven.lifecycle.internal.MojoExecutor.execute(MojoExecutor.java:209)
at org.apache.maven.lifecycle.internal.MojoExecutor.execute(MojoExecutor.java:153)
at org.apache.maven.lifecycle.internal.MojoExecutor.execute(MojoExecutor.java:145)
at org.apache.maven.lifecycle.internal.LifecycleModuleBuilder.buildProject(LifecycleModuleBuilder.java:84)
at org.apache.maven.lifecycle.internal.LifecycleModuleBuilder.buildProject(LifecycleModuleBuilder.java:59)
at org.apache.maven.lifecycle.internal.LifecycleStarter.singleThreadedBuild(LifecycleStarter.java:183)
at org.apache.maven.lifecycle.internal.LifecycleStarter.execute(LifecycleStarter.java:161)
at org.apache.maven.DefaultMaven.doExecute(DefaultMaven.java:319)
at org.apache.maven.DefaultMaven.execute(DefaultMaven.java:156)
at org.jvnet.hudson.maven3.launcher.Maven3Launcher.main(Maven3Launcher.java:79)
at sun.reflect.NativeMethodAccessorImpl.invoke0(Native Method)
at sun.reflect.NativeMethodAccessorImpl.invoke(NativeMethodAccessorImpl.java:39)
at sun.reflect.DelegatingMethodAccessorImpl.invoke(DelegatingMethodAccessorImpl.java:25)
at java.lang.reflect.Method.invoke(Method.java:597)
at org.codehaus.plexus.classworlds.launcher.Launcher.launchStandard(Launcher.java:329)
at org.codehaus.plexus.classworlds.launcher.Launcher.launch(Launcher.java:239)
at org.jvnet.hudson.maven3.agent.Maven3Main.launch(Maven3Main.java:158)
at hudson.maven.Maven3Builder.call(Maven3Builder.java:100)
at hudson.maven.Maven3Builder.call(Maven3Builder.java:66)
at hudson.remoting.UserRequest.perform(UserRequest.java:118)
at hudson.remoting.UserRequest.perform(UserRequest.java:48)
at hudson.remoting.Request$2.run(Request.java:326)
at hudson.remoting.InterceptingExecutorService$1.call(InterceptingExecutorService.java:72)
at java.util.concurrent.FutureTask$Sync.innerRun(FutureTask.java:303)
at java.util.concurrent.FutureTask.run(FutureTask.java:138)
at java.util.concurrent.ThreadPoolExecutor$Worker.runTask(ThreadPoolExecutor.java:886)
at java.util.concurrent.ThreadPoolExecutor$Worker.run(ThreadPoolExecutor.java:908)
at java.lang.Thread.run(Thread.java:662)
Caused by: java.io.IOException: There is not enough space on the disk
at java.io.FileOutputStream.writeBytes(Native Method)
at java.io.FileOutputStream.write(FileOutputStream.java:282)
at sun.nio.cs.StreamEncoder.writeBytes(StreamEncoder.java:202)
at sun.nio.cs.StreamEncoder.implWrite(StreamEncoder.java:263)
at sun.nio.cs.StreamEncoder.write(StreamEncoder.java:106)
at sun.nio.cs.StreamEncoder.write(StreamEncoder.java:116)
at java.io.OutputStreamWriter.write(OutputStreamWriter.java:203)
at java.io.Writer.write(Writer.java:140)
at java.io.Writer.append(Writer.java:210)
at org.apache.felix.bundlerepository.impl.XmlWriter.attribute(XmlWriter.java:89)
at org.apache.felix.bundlerepository.impl.DataModelHelperImpl.toXml(DataModelHelperImpl.java:380)
at org.apache.felix.bundlerepository.impl.DataModelHelperImpl.toXml(DataModelHelperImpl.java:336)
at org.apache.felix.bundlerepository.impl.DataModelHelperImpl.toXml(DataModelHelperImpl.java:299)
at org.apache.felix.bundlerepository.impl.DataModelHelperImpl.writeRepository(DataModelHelperImpl.java:186)
at org.apache.felix.obrplugin.ObrUpdate.writeRepositoryXml(ObrUpdate.java:249)
... 30 more
[INFO]
[INFO] ------------------------------------------------------------------------
[INFO] Building Apache MINA Core 3.0.0-M1-SNAPSHOT 3.0.0-M1-SNAPSHOT
[INFO] ------------------------------------------------------------------------
[INFO] [INFO] Deleting F:\hudson\hudson-slave\workspace\MINA-trunk-jdk1.6-windows\core\target
[INFO] --- maven-clean-plugin:2.4.1:clean (default-clean) @ mina-core ---
[INFO]
[INFO] --- maven-remote-resources-plugin:1.1:process (default) @ mina-core ---
[INFO] [INFO] Using 'UTF-8' encoding to copy filtered resources.
[INFO] skip non existing resourceDirectory F:\hudson\hudson-slave\workspace\MINA-trunk-jdk1.6-windows\core\src\main\resources
[INFO] --- maven-resources-plugin:2.4.3:resources (default-resources) @ mina-core ---
[INFO] Copying 3 resources
[INFO]
[INFO] --- maven-compiler-plugin:2.3.2:compile (default-compile) @ mina-core ---
[INFO] Compiling 73 source files to F:\hudson\hudson-slave\workspace\MINA-trunk-jdk1.6-windows\core\target\classes
[INFO] -------------------------------------------------------------
[ERROR] COMPILATION ERROR :
[INFO] -------------------------------------------------------------
[ERROR] \hudson\hudson-slave\workspace\MINA-trunk-jdk1.6-windows\core\src\main\java\org\apache\mina\transport\nio\NioUdpServer.java:[246,31] cannot find symbol
symbol : method getLocalAddress()
location: class java.nio.channels.DatagramChannel
[INFO] 1 error
[INFO] -------------------------------------------------------------
[INFO] ------------------------------------------------------------------------
[INFO] Reactor Summary:
[INFO]
[INFO] Apache MINA 3.0.0-M1-SNAPSHOT ..................... SUCCESS [4.768s]
[INFO] Apache MINA Codec 3.0.0-M1-SNAPSHOT ............... SUCCESS [5.591s]
[INFO] Apache MINA Core 3.0.0-M1-SNAPSHOT ................ FAILURE [2.608s]
[INFO] Apache MINA HTTP 3.0.0-M1-SNAPSHOT ................ SKIPPED
[INFO] Apache MINA examples 3.0.0-M1-SNAPSHOT ............ SKIPPED
[INFO] ------------------------------------------------------------------------
[INFO] BUILD FAILURE
[INFO] ------------------------------------------------------------------------
[INFO] Total time: 14.332s
[INFO] Finished at: Fri Mar 22 13:56:15 GMT 2013
[INFO] Final Memory: 22M/119M
[INFO] ------------------------------------------------------------------------
[JENKINS] Archiving F:\hudson\hudson-slave\workspace\MINA-trunk-jdk1.6-windows\examples\pom.xml to /home/hudson/hudson/jobs/MINA-trunk-jdk1.6-windows/modules/org.apache.mina$mina-examples/builds/2013-03-22_13-56-01/archive/org.apache.mina/mina-examples/3.0.0-M1-SNAPSHOT/mina-examples-3.0.0-M1-SNAPSHOT.pom
[JENKINS] Archiving F:\hudson\hudson-slave\workspace\MINA-trunk-jdk1.6-windows\http\pom.xml to /home/hudson/hudson/jobs/MINA-trunk-jdk1.6-windows/modules/org.apache.mina$mina-http/builds/2013-03-22_13-56-01/archive/org.apache.mina/mina-http/3.0.0-M1-SNAPSHOT/mina-http-3.0.0-M1-SNAPSHOT.pom
[JENKINS] Archiving <https://builds.apache.org/job/MINA-trunk-jdk1.6-windows/ws/pom.xml> to /home/hudson/hudson/jobs/MINA-trunk-jdk1.6-windows/modules/org.apache.mina$mina-parent/builds/2013-03-22_13-56-01/archive/org.apache.mina/mina-parent/3.0.0-M1-SNAPSHOT/mina-parent-3.0.0-M1-SNAPSHOT.pom
[JENKINS] Archiving F:\hudson\hudson-slave\workspace\MINA-trunk-jdk1.6-windows\codec\pom.xml to /home/hudson/hudson/jobs/MINA-trunk-jdk1.6-windows/modules/org.apache.mina$mina-codec/builds/2013-03-22_13-56-01/archive/org.apache.mina/mina-codec/3.0.0-M1-SNAPSHOT/mina-codec-3.0.0-M1-SNAPSHOT.pom
[JENKINS] Archiving F:\hudson\hudson-slave\workspace\MINA-trunk-jdk1.6-windows\codec\target\mina-codec-3.0.0-M1-SNAPSHOT.jar to /home/hudson/hudson/jobs/MINA-trunk-jdk1.6-windows/modules/org.apache.mina$mina-codec/builds/2013-03-22_13-56-01/archive/org.apache.mina/mina-codec/3.0.0-M1-SNAPSHOT/mina-codec-3.0.0-M1-SNAPSHOT.jar
[JENKINS] Archiving F:\hudson\hudson-slave\workspace\MINA-trunk-jdk1.6-windows\core\pom.xml to /home/hudson/hudson/jobs/MINA-trunk-jdk1.6-windows/modules/org.apache.mina$mina-core/builds/2013-03-22_13-56-01/archive/org.apache.mina/mina-core/3.0.0-M1-SNAPSHOT/mina-core-3.0.0-M1-SNAPSHOT.pom
[WARNING] The requested profile "serial" could not be activated because it does not exist.
Sending e-mails to: commits@mina.apache.org
channel stopped
ERROR: Failed to parse POMs
java.io.IOException: Remote call on Channel to Maven [f:\hudson\tools\java\latest-1.6-64/bin/java, -Xmx512M, -cp, f:\hudson\hudson-slave\maven3-agent.jar;f:\hudson\tools\maven\latest\boot\plexus-classworlds-2.4.jar, org.jvnet.hudson.maven3.agent.Maven3Main, f:\hudson\tools\maven\latest, C:\Users\hudson\AppData\LocalLow\Sun\Java\Deployment\cache\6.0\39\4bb6b7e7-33fec62f, f:\hudson\hudson-slave\maven3-interceptor.jar, 63039] failed
at hudson.remoting.Channel.call(Channel.java:681)
at hudson.maven.ProcessCache$MavenProcess.call(ProcessCache.java:156)
at hudson.maven.MavenModuleSetBuild$MavenModuleSetBuildExecution.doRun(MavenModuleSetBuild.java:755)
at hudson.model.AbstractBuild$AbstractBuildExecution.run(AbstractBuild.java:592)
at hudson.model.Run.execute(Run.java:1568)
at hudson.maven.MavenModuleSetBuild.run(MavenModuleSetBuild.java:477)
at hudson.model.ResourceController.execute(ResourceController.java:88)
at hudson.model.Executor.run(Executor.java:236)
Caused by: java.lang.Error: Unable to load resource hudson/maven/Messages.properties
at hudson.remoting.RemoteClassLoader.findResource(RemoteClassLoader.java:241)
at java.lang.ClassLoader.getResource(ClassLoader.java:1002)
at java.lang.Class.getResource(Class.java:2074)
at org.jvnet.localizer.ResourceBundleHolder.get(ResourceBundleHolder.java:83)
at org.jvnet.localizer.ResourceBundleHolder.get(ResourceBundleHolder.java:102)
at org.jvnet.localizer.ResourceBundleHolder.get(ResourceBundleHolder.java:102)
at org.jvnet.localizer.ResourceBundleHolder.format(ResourceBundleHolder.java:139)
at hudson.maven.Messages.MavenBuilder_Waiting(Messages.java:491)
at hudson.maven.AbstractMavenBuilder.waitForAsynchronousExecutions(AbstractMavenBuilder.java:183)
at hudson.maven.Maven3Builder.call(Maven3Builder.java:105)
at hudson.maven.Maven3Builder.call(Maven3Builder.java:66)
at hudson.remoting.UserRequest.perform(UserRequest.java:118)
at hudson.remoting.UserRequest.perform(UserRequest.java:48)
at hudson.remoting.Request$2.run(Request.java:326)
at hudson.remoting.InterceptingExecutorService$1.call(InterceptingExecutorService.java:72)
at java.util.concurrent.FutureTask$Sync.innerRun(FutureTask.java:303)
at java.util.concurrent.FutureTask.run(FutureTask.java:138)
at java.util.concurrent.ThreadPoolExecutor$Worker.runTask(ThreadPoolExecutor.java:886)
at java.util.concurrent.ThreadPoolExecutor$Worker.run(ThreadPoolExecutor.java:908)
at java.lang.Thread.run(Thread.java:662)
Caused by: java.io.IOException: There is not enough space on the disk
at java.io.FileOutputStream.writeBytes(Native Method)
at java.io.FileOutputStream.write(FileOutputStream.java:269)
at hudson.remoting.RemoteClassLoader.makeResource(RemoteClassLoader.java:310)
at hudson.remoting.RemoteClassLoader.findResource(RemoteClassLoader.java:237)
... 19 more
Skipping Cobertura coverage report as build was not UNSTABLE or better ...
Jenkins build is back to normal : MINA-trunk-jdk1.6-windows #178
Posted by Apache Jenkins Server <je...@builds.apache.org>.
See <https://builds.apache.org/job/MINA-trunk-jdk1.6-windows/178/>
Build failed in Jenkins: MINA-trunk-jdk1.6-windows #177
Posted by Apache Jenkins Server <je...@builds.apache.org>.
See <https://builds.apache.org/job/MINA-trunk-jdk1.6-windows/177/changes>
Changes:
[elecharny] o Handle the writing of messages that were pushed into the writeQueue if
[elecharny] o Moved the processWrite method into the AbstraIoSession class
[elecharny] Reflected the package changes in core for udp/tcp
[elecharny] Reflected the package change for transport
[elecharny] Reflected the package change for transport
[elecharny] The IoClient and IoServer interface don't have to extend the IoService
------------------------------------------
Started by an SCM change
Building remotely on windows1 in workspace <https://builds.apache.org/job/MINA-trunk-jdk1.6-windows/ws/>
Checkout:MINA-trunk-jdk1.6-windows / <https://builds.apache.org/job/MINA-trunk-jdk1.6-windows/ws/> - hudson.remoting.Channel@6c8ebcba:windows1
Using strategy: Default
Last Built Revision: Revision 2cc1d14072ee1633ae9cef201c9f7c663c7e1f2d (origin/trunk)
Fetching changes from 1 remote Git repository
Fetching upstream changes from https://git-wip-us.apache.org/repos/asf/mina.git
Commencing build of Revision cb7896a19ecf8d1528b87d22c6f6e53e24ae3db7 (origin/trunk)
Checking out Revision cb7896a19ecf8d1528b87d22c6f6e53e24ae3db7 (origin/trunk)
Parsing POMs
Modules changed, recalculating dependency graph
[MINA-trunk-jdk1.6-windows] $ f:\hudson\tools\java\latest-1.6-64/bin/java -Xmx512M -cp f:\hudson\hudson-slave\maven3-agent.jar;f:\hudson\tools\maven\latest\boot\plexus-classworlds-2.4.jar org.jvnet.hudson.maven3.agent.Maven3Main f:\hudson\tools\maven\latest C:\Users\hudson\AppData\LocalLow\Sun\Java\Deployment\cache\6.0\39\4bb6b7e7-33fec62f f:\hudson\hudson-slave\maven3-interceptor.jar 50494
<===[JENKINS REMOTING CAPACITY]===> channel started
log4j:WARN No appenders could be found for logger (org.apache.commons.beanutils.converters.BooleanConverter).
log4j:WARN Please initialize the log4j system properly.
Executing Maven: -B -f <https://builds.apache.org/job/MINA-trunk-jdk1.6-windows/ws/pom.xml> -Dmaven.repo.local=f:\hudson\hudson-slave\maven-repositories\0 clean install -Pserial
[INFO] Scanning for projects...
[INFO] ------------------------------------------------------------------------
[INFO] Reactor Build Order:
[INFO]
[INFO] Apache MINA 3.0.0-M1-SNAPSHOT
[INFO] Apache MINA Codec 3.0.0-M1-SNAPSHOT
[INFO] Apache MINA Core 3.0.0-M1-SNAPSHOT
[INFO] Apache MINA HTTP 3.0.0-M1-SNAPSHOT
[INFO] Apache MINA examples 3.0.0-M1-SNAPSHOT
[INFO]
[INFO] ------------------------------------------------------------------------
[INFO] Building Apache MINA 3.0.0-M1-SNAPSHOT 3.0.0-M1-SNAPSHOT
[INFO] ------------------------------------------------------------------------
[INFO]
[INFO] --- maven-clean-plugin:2.4.1:clean (default-clean) @ mina-parent ---
[INFO] Deleting <https://builds.apache.org/job/MINA-trunk-jdk1.6-windows/ws/target>
java.lang.reflect.InvocationTargetException
at sun.reflect.NativeMethodAccessorImpl.invoke0(Native Method)
at sun.reflect.NativeMethodAccessorImpl.invoke(NativeMethodAccessorImpl.java:39)
at sun.reflect.DelegatingMethodAccessorImpl.invoke(DelegatingMethodAccessorImpl.java:25)
at java.lang.reflect.Method.invoke(Method.java:597)
at org.codehaus.plexus.classworlds.launcher.Launcher.launchStandard(Launcher.java:329)
at org.codehaus.plexus.classworlds.launcher.Launcher.launch(Launcher.java:239)
at org.jvnet.hudson.maven3.agent.Maven3Main.launch(Maven3Main.java:158)
at hudson.maven.Maven3Builder.call(Maven3Builder.java:100)
at hudson.maven.Maven3Builder.call(Maven3Builder.java:66)
at hudson.remoting.UserRequest.perform(UserRequest.java:118)
at hudson.remoting.UserRequest.perform(UserRequest.java:48)
at hudson.remoting.Request$2.run(Request.java:326)
at hudson.remoting.InterceptingExecutorService$1.call(InterceptingExecutorService.java:72)
at java.util.concurrent.FutureTask$Sync.innerRun(FutureTask.java:303)
at java.util.concurrent.FutureTask.run(FutureTask.java:138)
at java.util.concurrent.ThreadPoolExecutor$Worker.runTask(ThreadPoolExecutor.java:886)
at java.util.concurrent.ThreadPoolExecutor$Worker.run(ThreadPoolExecutor.java:908)
at java.lang.Thread.run(Thread.java:662)
Caused by: java.lang.Error: Unable to load resource hudson/model/Messages.properties
at hudson.remoting.RemoteClassLoader.findResource(RemoteClassLoader.java:241)
at java.lang.ClassLoader.getResource(ClassLoader.java:1002)
at java.lang.Class.getResource(Class.java:2074)
at org.jvnet.localizer.ResourceBundleHolder.get(ResourceBundleHolder.java:83)
at org.jvnet.localizer.ResourceBundleHolder.get(ResourceBundleHolder.java:102)
at org.jvnet.localizer.ResourceBundleHolder.get(ResourceBundleHolder.java:102)
at org.jvnet.localizer.ResourceBundleHolder.format(ResourceBundleHolder.java:139)
at hudson.model.Messages.Node_Mode_NORMAL(Messages.java:1765)
at hudson.model.Node$Mode.<clinit>(Node.java:445)
at sun.reflect.NativeMethodAccessorImpl.invoke0(Native Method)
at sun.reflect.NativeMethodAccessorImpl.invoke(NativeMethodAccessorImpl.java:39)
at sun.reflect.DelegatingMethodAccessorImpl.invoke(DelegatingMethodAccessorImpl.java:25)
at java.lang.reflect.Method.invoke(Method.java:597)
at java.lang.Class.getEnumConstantsShared(Class.java:2942)
at java.lang.Class.getEnumConstants(Class.java:2920)
at jenkins.model.Jenkins.<clinit>(Jenkins.java:3958)
at hudson.model.Computer.<clinit>(Computer.java:1336)
at hudson.FilePath.act(FilePath.java:865)
at hudson.FilePath.act(FilePath.java:838)
at hudson.FilePath.digest(FilePath.java:1624)
at hudson.maven.reporters.MavenFingerprinter.record(MavenFingerprinter.java:238)
at hudson.maven.reporters.MavenFingerprinter.postExecute(MavenFingerprinter.java:100)
at hudson.maven.Maven3Builder$MavenExecutionListener.recordMojoEnded(Maven3Builder.java:443)
at hudson.maven.Maven3Builder$MavenExecutionListener.mojoSucceeded(Maven3Builder.java:425)
at org.apache.maven.lifecycle.internal.DefaultExecutionEventCatapult.fire(DefaultExecutionEventCatapult.java:87)
at org.apache.maven.lifecycle.internal.DefaultExecutionEventCatapult.fire(DefaultExecutionEventCatapult.java:42)
at org.apache.maven.lifecycle.internal.MojoExecutor.execute(MojoExecutor.java:228)
at org.apache.maven.lifecycle.internal.MojoExecutor.execute(MojoExecutor.java:153)
at org.apache.maven.lifecycle.internal.MojoExecutor.execute(MojoExecutor.java:145)
at org.apache.maven.lifecycle.internal.LifecycleModuleBuilder.buildProject(LifecycleModuleBuilder.java:84)
at org.apache.maven.lifecycle.internal.LifecycleModuleBuilder.buildProject(LifecycleModuleBuilder.java:59)
at org.apache.maven.lifecycle.internal.LifecycleStarter.singleThreadedBuild(LifecycleStarter.java:183)
at org.apache.maven.lifecycle.internal.LifecycleStarter.execute(LifecycleStarter.java:161)
at org.apache.maven.DefaultMaven.doExecute(DefaultMaven.java:319)
at org.apache.maven.DefaultMaven.execute(DefaultMaven.java:156)
at org.jvnet.hudson.maven3.launcher.Maven3Launcher.main(Maven3Launcher.java:79)
... 18 more
Caused by: java.io.IOException: There is not enough space on the disk
at java.io.FileOutputStream.writeBytes(Native Method)
at java.io.FileOutputStream.write(FileOutputStream.java:269)
at hudson.remoting.RemoteClassLoader.makeResource(RemoteClassLoader.java:310)
at hudson.remoting.RemoteClassLoader.findResource(RemoteClassLoader.java:237)
... 53 more
channel stopped
ERROR: Failed to parse POMs
hudson.util.IOException2: java.lang.reflect.InvocationTargetException
at hudson.maven.Maven3Builder.call(Maven3Builder.java:162)
at hudson.maven.Maven3Builder.call(Maven3Builder.java:66)
at hudson.remoting.UserRequest.perform(UserRequest.java:118)
at hudson.remoting.UserRequest.perform(UserRequest.java:48)
at hudson.remoting.Request$2.run(Request.java:326)
at hudson.remoting.InterceptingExecutorService$1.call(InterceptingExecutorService.java:72)
at java.util.concurrent.FutureTask$Sync.innerRun(FutureTask.java:303)
at java.util.concurrent.FutureTask.run(FutureTask.java:138)
at java.util.concurrent.ThreadPoolExecutor$Worker.runTask(ThreadPoolExecutor.java:886)
at java.util.concurrent.ThreadPoolExecutor$Worker.run(ThreadPoolExecutor.java:908)
at java.lang.Thread.run(Thread.java:662)
Caused by: java.lang.Exception: java.lang.reflect.InvocationTargetException
at org.jvnet.hudson.maven3.agent.Maven3Main.launch(Maven3Main.java:161)
at hudson.maven.Maven3Builder.call(Maven3Builder.java:100)
... 10 more
Caused by: java.lang.reflect.InvocationTargetException
at sun.reflect.NativeMethodAccessorImpl.invoke0(Native Method)
at sun.reflect.NativeMethodAccessorImpl.invoke(NativeMethodAccessorImpl.java:39)
at sun.reflect.DelegatingMethodAccessorImpl.invoke(DelegatingMethodAccessorImpl.java:25)
at java.lang.reflect.Method.invoke(Method.java:597)
at org.codehaus.plexus.classworlds.launcher.Launcher.launchStandard(Launcher.java:329)
at org.codehaus.plexus.classworlds.launcher.Launcher.launch(Launcher.java:239)
at org.jvnet.hudson.maven3.agent.Maven3Main.launch(Maven3Main.java:158)
... 11 more
Caused by: java.lang.Error: Unable to load resource hudson/model/Messages.properties
at hudson.remoting.RemoteClassLoader.findResource(RemoteClassLoader.java:241)
at java.lang.ClassLoader.getResource(ClassLoader.java:1002)
at java.lang.Class.getResource(Class.java:2074)
at org.jvnet.localizer.ResourceBundleHolder.get(ResourceBundleHolder.java:83)
at org.jvnet.localizer.ResourceBundleHolder.get(ResourceBundleHolder.java:102)
at org.jvnet.localizer.ResourceBundleHolder.get(ResourceBundleHolder.java:102)
at org.jvnet.localizer.ResourceBundleHolder.format(ResourceBundleHolder.java:139)
at hudson.model.Messages.Node_Mode_NORMAL(Messages.java:1765)
at hudson.model.Node$Mode.<clinit>(Node.java:445)
at sun.reflect.NativeMethodAccessorImpl.invoke0(Native Method)
at sun.reflect.NativeMethodAccessorImpl.invoke(NativeMethodAccessorImpl.java:39)
at sun.reflect.DelegatingMethodAccessorImpl.invoke(DelegatingMethodAccessorImpl.java:25)
at java.lang.reflect.Method.invoke(Method.java:597)
at java.lang.Class.getEnumConstantsShared(Class.java:2942)
at java.lang.Class.getEnumConstants(Class.java:2920)
at jenkins.model.Jenkins.<clinit>(Jenkins.java:3958)
at hudson.model.Computer.<clinit>(Computer.java:1336)
at hudson.FilePath.act(FilePath.java:865)
at hudson.FilePath.act(FilePath.java:838)
at hudson.FilePath.digest(FilePath.java:1624)
at hudson.maven.reporters.MavenFingerprinter.record(MavenFingerprinter.java:238)
at hudson.maven.reporters.MavenFingerprinter.postExecute(MavenFingerprinter.java:100)
at hudson.maven.Maven3Builder$MavenExecutionListener.recordMojoEnded(Maven3Builder.java:443)
at hudson.maven.Maven3Builder$MavenExecutionListener.mojoSucceeded(Maven3Builder.java:425)
at org.apache.maven.lifecycle.internal.DefaultExecutionEventCatapult.fire(DefaultExecutionEventCatapult.java:87)
at org.apache.maven.lifecycle.internal.DefaultExecutionEventCatapult.fire(DefaultExecutionEventCatapult.java:42)
at org.apache.maven.lifecycle.internal.MojoExecutor.execute(MojoExecutor.java:228)
at org.apache.maven.lifecycle.internal.MojoExecutor.execute(MojoExecutor.java:153)
at org.apache.maven.lifecycle.internal.MojoExecutor.execute(MojoExecutor.java:145)
at org.apache.maven.lifecycle.internal.LifecycleModuleBuilder.buildProject(LifecycleModuleBuilder.java:84)
at org.apache.maven.lifecycle.internal.LifecycleModuleBuilder.buildProject(LifecycleModuleBuilder.java:59)
at org.apache.maven.lifecycle.internal.LifecycleStarter.singleThreadedBuild(LifecycleStarter.java:183)
at org.apache.maven.lifecycle.internal.LifecycleStarter.execute(LifecycleStarter.java:161)
at org.apache.maven.DefaultMaven.doExecute(DefaultMaven.java:319)
at org.apache.maven.DefaultMaven.execute(DefaultMaven.java:156)
at org.jvnet.hudson.maven3.launcher.Maven3Launcher.main(Maven3Launcher.java:79)
... 18 more
Caused by: java.io.IOException: There is not enough space on the disk
at java.io.FileOutputStream.writeBytes(Native Method)
at java.io.FileOutputStream.write(FileOutputStream.java:269)
at hudson.remoting.RemoteClassLoader.makeResource(RemoteClassLoader.java:310)
at hudson.remoting.RemoteClassLoader.findResource(RemoteClassLoader.java:237)
... 53 more
Skipping Cobertura coverage report as build was not UNSTABLE or better ...
Build failed in Jenkins: MINA-trunk-jdk1.6-windows #176
Posted by Apache Jenkins Server <je...@builds.apache.org>.
See <https://builds.apache.org/job/MINA-trunk-jdk1.6-windows/176/changes>
Changes:
[elecharny] Added UDP tests
[elecharny] Cleaned the client and server code, removing the System.out cals and
[elecharny] o Replaced a call to DatagramChannel.getLocalAddress(), as it does not
------------------------------------------
Started by an SCM change
Building remotely on windows1 in workspace <https://builds.apache.org/job/MINA-trunk-jdk1.6-windows/ws/>
Checkout:MINA-trunk-jdk1.6-windows / <https://builds.apache.org/job/MINA-trunk-jdk1.6-windows/ws/> - hudson.remoting.Channel@6c8ebcba:windows1
Using strategy: Default
Last Built Revision: Revision abe19430989b3a6aa6c84570ba494f10ab74bf9d (origin/trunk)
Fetching changes from 1 remote Git repository
Fetching upstream changes from https://git-wip-us.apache.org/repos/asf/mina.git
Commencing build of Revision 2cc1d14072ee1633ae9cef201c9f7c663c7e1f2d (origin/trunk)
Checking out Revision 2cc1d14072ee1633ae9cef201c9f7c663c7e1f2d (origin/trunk)
Parsing POMs
Modules changed, recalculating dependency graph
[MINA-trunk-jdk1.6-windows] $ f:\hudson\tools\java\latest-1.6-64/bin/java -Xmx512M -cp f:\hudson\hudson-slave\maven3-agent.jar;f:\hudson\tools\maven\latest\boot\plexus-classworlds-2.4.jar org.jvnet.hudson.maven3.agent.Maven3Main f:\hudson\tools\maven\latest C:\Users\hudson\AppData\LocalLow\Sun\Java\Deployment\cache\6.0\39\4bb6b7e7-33fec62f f:\hudson\hudson-slave\maven3-interceptor.jar 64101
<===[JENKINS REMOTING CAPACITY]===> channel started
channel stopped
ERROR: Failed to parse POMs
java.io.IOException: Remote call on Channel to Maven [f:\hudson\tools\java\latest-1.6-64/bin/java, -Xmx512M, -cp, f:\hudson\hudson-slave\maven3-agent.jar;f:\hudson\tools\maven\latest\boot\plexus-classworlds-2.4.jar, org.jvnet.hudson.maven3.agent.Maven3Main, f:\hudson\tools\maven\latest, C:\Users\hudson\AppData\LocalLow\Sun\Java\Deployment\cache\6.0\39\4bb6b7e7-33fec62f, f:\hudson\hudson-slave\maven3-interceptor.jar, 64101] failed
at hudson.remoting.Channel.call(Channel.java:681)
at hudson.maven.ProcessCache$MavenProcess.call(ProcessCache.java:156)
at hudson.maven.MavenModuleSetBuild$MavenModuleSetBuildExecution.doRun(MavenModuleSetBuild.java:755)
at hudson.model.AbstractBuild$AbstractBuildExecution.run(AbstractBuild.java:592)
at hudson.model.Run.execute(Run.java:1568)
at hudson.maven.MavenModuleSetBuild.run(MavenModuleSetBuild.java:477)
at hudson.model.ResourceController.execute(ResourceController.java:88)
at hudson.model.Executor.run(Executor.java:236)
Caused by: java.lang.Error: Unable to load resource javax/servlet/http/LocalStrings.properties
at hudson.remoting.RemoteClassLoader.findResource(RemoteClassLoader.java:241)
at java.lang.ClassLoader.getResource(ClassLoader.java:1002)
at java.lang.ClassLoader.getResourceAsStream(ClassLoader.java:1192)
at java.util.ResourceBundle$Control$1.run(ResourceBundle.java:2324)
at java.util.ResourceBundle$Control$1.run(ResourceBundle.java:2309)
at java.security.AccessController.doPrivileged(Native Method)
at java.util.ResourceBundle$Control.newBundle(ResourceBundle.java:2308)
at java.util.ResourceBundle.loadBundle(ResourceBundle.java:1364)
at java.util.ResourceBundle.findBundle(ResourceBundle.java:1328)
at java.util.ResourceBundle.findBundle(ResourceBundle.java:1282)
at java.util.ResourceBundle.findBundle(ResourceBundle.java:1282)
at java.util.ResourceBundle.getBundleImpl(ResourceBundle.java:1224)
at java.util.ResourceBundle.getBundle(ResourceBundle.java:705)
at javax.servlet.http.HttpServlet.<clinit>(HttpServlet.java:92)
at hudson.model.Result.<clinit>(Result.java:191)
at java.lang.Class.forName0(Native Method)
at java.lang.Class.forName(Class.java:169)
at $Proxy2.<clinit>(Unknown Source)
at sun.reflect.GeneratedSerializationConstructorAccessor34.newInstance(Unknown Source)
at java.lang.reflect.Constructor.newInstance(Constructor.java:513)
at java.io.ObjectStreamClass.newInstance(ObjectStreamClass.java:924)
at java.io.ObjectInputStream.readOrdinaryObject(ObjectInputStream.java:1736)
at java.io.ObjectInputStream.readObject0(ObjectInputStream.java:1328)
at java.io.ObjectInputStream.defaultReadFields(ObjectInputStream.java:1946)
at java.io.ObjectInputStream.readSerialData(ObjectInputStream.java:1870)
at java.io.ObjectInputStream.readOrdinaryObject(ObjectInputStream.java:1752)
at java.io.ObjectInputStream.readObject0(ObjectInputStream.java:1328)
at java.io.ObjectInputStream.readObject(ObjectInputStream.java:350)
at java.util.HashMap.readObject(HashMap.java:1030)
at sun.reflect.NativeMethodAccessorImpl.invoke0(Native Method)
at sun.reflect.NativeMethodAccessorImpl.invoke(NativeMethodAccessorImpl.java:39)
at sun.reflect.DelegatingMethodAccessorImpl.invoke(DelegatingMethodAccessorImpl.java:25)
at java.lang.reflect.Method.invoke(Method.java:597)
at java.io.ObjectStreamClass.invokeReadObject(ObjectStreamClass.java:974)
at java.io.ObjectInputStream.readSerialData(ObjectInputStream.java:1848)
at java.io.ObjectInputStream.readOrdinaryObject(ObjectInputStream.java:1752)
at java.io.ObjectInputStream.readObject0(ObjectInputStream.java:1328)
at java.io.ObjectInputStream.defaultReadFields(ObjectInputStream.java:1946)
at java.io.ObjectInputStream.readSerialData(ObjectInputStream.java:1870)
at java.io.ObjectInputStream.readOrdinaryObject(ObjectInputStream.java:1752)
at java.io.ObjectInputStream.readObject0(ObjectInputStream.java:1328)
at java.io.ObjectInputStream.readObject(ObjectInputStream.java:350)
at hudson.remoting.UserRequest.deserialize(UserRequest.java:182)
at hudson.remoting.UserRequest.perform(UserRequest.java:98)
at hudson.remoting.UserRequest.perform(UserRequest.java:48)
at hudson.remoting.Request$2.run(Request.java:326)
at hudson.remoting.InterceptingExecutorService$1.call(InterceptingExecutorService.java:72)
at java.util.concurrent.FutureTask$Sync.innerRun(FutureTask.java:303)
at java.util.concurrent.FutureTask.run(FutureTask.java:138)
at java.util.concurrent.ThreadPoolExecutor$Worker.runTask(ThreadPoolExecutor.java:886)
at java.util.concurrent.ThreadPoolExecutor$Worker.run(ThreadPoolExecutor.java:908)
at java.lang.Thread.run(Thread.java:662)
Caused by: java.io.IOException: There is not enough space on the disk
at java.io.FileOutputStream.writeBytes(Native Method)
at java.io.FileOutputStream.write(FileOutputStream.java:269)
at hudson.remoting.RemoteClassLoader.makeResource(RemoteClassLoader.java:310)
at hudson.remoting.RemoteClassLoader.findResource(RemoteClassLoader.java:237)
... 51 more
Skipping Cobertura coverage report as build was not UNSTABLE or better ...