You are viewing a plain text version of this content. The canonical link for it is here.
Posted to dev@sling.apache.org by Apache Jenkins Server <je...@builds.apache.org> on 2013/08/06 15:54:58 UTC
Build failed in Jenkins: sling-samples-1.6 #426
See <https://builds.apache.org/job/sling-samples-1.6/426/changes>
Changes:
[cziegeler] SLING-2996 : use project.* properties instead of pom.* properties . Apply patch from Oliver Lietz
------------------------------------------
[...truncated 1177 lines...]
Downloaded: http://repo.maven.apache.org/maven2/org/apache/sling/org.apache.sling.jcr.classloader/2.0.2-incubator/org.apache.sling.jcr.classloader-2.0.2-incubator.pom (6 KB at 84.0 KB/sec)
Downloading: http://repo.maven.apache.org/maven2/org/apache/jackrabbit/jackrabbit-jcr-commons/1.4.2/jackrabbit-jcr-commons-1.4.2.pom
Downloaded: http://repo.maven.apache.org/maven2/org/apache/jackrabbit/jackrabbit-jcr-commons/1.4.2/jackrabbit-jcr-commons-1.4.2.pom (4 KB at 55.0 KB/sec)
Downloading: http://repo.maven.apache.org/maven2/org/apache/tomcat/juli/6.0.14/juli-6.0.14.pom
Downloaded: http://repo.maven.apache.org/maven2/org/apache/tomcat/juli/6.0.14/juli-6.0.14.pom (252 B at 3.9 KB/sec)
Downloading: http://repo.maven.apache.org/maven2/org/apache/sling/org.apache.sling.jcr.ocm/2.0.2-incubator/org.apache.sling.jcr.ocm-2.0.2-incubator.jar
Downloading: http://repo.maven.apache.org/maven2/org/apache/jackrabbit/jackrabbit-ocm/1.4/jackrabbit-ocm-1.4.jar
Downloading: http://repo.maven.apache.org/maven2/org/apache/sling/org.apache.sling.scripting.jsp.taglib/2.0.2-incubator/org.apache.sling.scripting.jsp.taglib-2.0.2-incubator.jar
Downloading: http://repo.maven.apache.org/maven2/org/apache/sling/org.apache.sling.scripting.jsp/2.0.2-incubator/org.apache.sling.scripting.jsp-2.0.2-incubator.jar
Downloading: http://repo.maven.apache.org/maven2/org/apache/sling/org.apache.sling.jcr.classloader/2.0.2-incubator/org.apache.sling.jcr.classloader-2.0.2-incubator.jar
Downloaded: http://repo.maven.apache.org/maven2/org/apache/jackrabbit/jackrabbit-ocm/1.4/jackrabbit-ocm-1.4.jar (149 KB at 634.0 KB/sec)
Downloading: http://repo.maven.apache.org/maven2/org/apache/jackrabbit/jackrabbit-jcr-commons/1.4.2/jackrabbit-jcr-commons-1.4.2.jar
Downloaded: http://repo.maven.apache.org/maven2/org/apache/sling/org.apache.sling.jcr.classloader/2.0.2-incubator/org.apache.sling.jcr.classloader-2.0.2-incubator.jar (157 KB at 601.6 KB/sec)
Downloading: http://repo.maven.apache.org/maven2/org/apache/tomcat/juli/6.0.14/juli-6.0.14.jar
Downloaded: http://repo.maven.apache.org/maven2/org/apache/sling/org.apache.sling.scripting.jsp.taglib/2.0.2-incubator/org.apache.sling.scripting.jsp.taglib-2.0.2-incubator.jar (16 KB at 56.9 KB/sec)
Downloaded: http://repo.maven.apache.org/maven2/org/apache/tomcat/juli/6.0.14/juli-6.0.14.jar (18 KB at 275.8 KB/sec)
Downloaded: http://repo.maven.apache.org/maven2/org/apache/jackrabbit/jackrabbit-jcr-commons/1.4.2/jackrabbit-jcr-commons-1.4.2.jar (162 KB at 918.3 KB/sec)
Downloaded: http://repo.maven.apache.org/maven2/org/apache/sling/org.apache.sling.jcr.ocm/2.0.2-incubator/org.apache.sling.jcr.ocm-2.0.2-incubator.jar (613 KB at 1338.4 KB/sec)
Downloaded: http://repo.maven.apache.org/maven2/org/apache/sling/org.apache.sling.scripting.jsp/2.0.2-incubator/org.apache.sling.scripting.jsp-2.0.2-incubator.jar (2131 KB at 2934.0 KB/sec)
Aug 6, 2013 1:54:52 PM org.apache.maven.cli.event.ExecutionEventLogger mojoStarted
INFO:
Aug 6, 2013 1:54:52 PM org.apache.maven.cli.event.ExecutionEventLogger mojoStarted
INFO: --- maven-clean-plugin:2.5:clean (default-clean) @ org.apache.sling.samples.simple-demo ---
Aug 6, 2013 1:54:52 PM org.apache.maven.cli.event.ExecutionEventLogger mojoStarted
INFO:
Aug 6, 2013 1:54:52 PM org.apache.maven.cli.event.ExecutionEventLogger mojoStarted
INFO: --- maven-enforcer-plugin:1.0.1:enforce (enforce-java) @ org.apache.sling.samples.simple-demo ---
Aug 6, 2013 1:54:52 PM org.apache.maven.cli.event.ExecutionEventLogger mojoStarted
INFO:
Aug 6, 2013 1:54:52 PM org.apache.maven.cli.event.ExecutionEventLogger mojoStarted
INFO: --- maven-antrun-plugin:1.7:run (set-bundle-required-execution-environment) @ org.apache.sling.samples.simple-demo ---
[INFO] Executing tasks
main:
[INFO] Executed tasks
Aug 6, 2013 1:54:52 PM org.apache.maven.cli.event.ExecutionEventLogger mojoStarted
INFO:
Aug 6, 2013 1:54:52 PM org.apache.maven.cli.event.ExecutionEventLogger mojoStarted
INFO: --- maven-remote-resources-plugin:1.4:process (default) @ org.apache.sling.samples.simple-demo ---
Aug 6, 2013 1:54:53 PM org.apache.maven.cli.event.ExecutionEventLogger mojoStarted
INFO:
Aug 6, 2013 1:54:53 PM org.apache.maven.cli.event.ExecutionEventLogger mojoStarted
INFO: --- maven-jcrocm-plugin:2.0.4-incubator:ocm (generate-JCR-OCM-descriptor) @ org.apache.sling.samples.simple-demo ---
[INFO] Generating 2 OCM Mapping Descriptors to <https://builds.apache.org/job/sling-samples-1.6/ws/samples-1.6/simple-demo/target/sling-generated/SLING-INF/mappings.xml>
Aug 6, 2013 1:54:53 PM org.apache.maven.cli.event.ExecutionEventLogger mojoStarted
INFO:
Aug 6, 2013 1:54:53 PM org.apache.maven.cli.event.ExecutionEventLogger mojoStarted
INFO: --- maven-resources-plugin:2.6:resources (default-resources) @ org.apache.sling.samples.simple-demo ---
[INFO] Using 'UTF-8' encoding to copy filtered resources.
[INFO] Copying 6 resources
[INFO] Copying 3 resources
[INFO] Copying 1 resource
Aug 6, 2013 1:54:53 PM org.apache.maven.cli.event.ExecutionEventLogger mojoStarted
INFO:
Aug 6, 2013 1:54:53 PM org.apache.maven.cli.event.ExecutionEventLogger mojoStarted
INFO: --- maven-antrun-plugin:1.7:run (check-memory-task) @ org.apache.sling.samples.simple-demo ---
[INFO] Executing tasks
main:
[echo] **************** WARNING (SLING-443/SLING-1782) ******************************
[echo] On most platforms, you'll get OutOfMemoryErrors when building unless you set
[echo] on 32bit platforms: MAVEN_OPTS="-Xmx256M -XX:MaxPermSize=256M", see SLING-443
[echo] on 64bit platforms: MAVEN_OPTS="-Xmx512M -XX:MaxPermSize=512M", see SLING-1782
[echo] ******************************************************************************
[INFO] Executed tasks
Aug 6, 2013 1:54:53 PM org.apache.maven.cli.event.ExecutionEventLogger mojoStarted
INFO:
Aug 6, 2013 1:54:53 PM org.apache.maven.cli.event.ExecutionEventLogger mojoStarted
INFO: --- maven-compiler-plugin:2.5.1:compile (default-compile) @ org.apache.sling.samples.simple-demo ---
[INFO] Compiling 4 source files to <https://builds.apache.org/job/sling-samples-1.6/ws/samples-1.6/simple-demo/target/classes>
Aug 6, 2013 1:54:53 PM org.apache.maven.cli.event.ExecutionEventLogger mojoStarted
INFO:
Aug 6, 2013 1:54:53 PM org.apache.maven.cli.event.ExecutionEventLogger mojoStarted
INFO: --- maven-jspc-plugin:2.0.6:jspc (compile-jsp) @ org.apache.sling.samples.simple-demo ---
[ERROR] Compilation Failure
org.apache.sling.scripting.jsp.jasper.JasperException: File "<https://builds.apache.org/job/sling-samples-1.6/ws/samples-1.6/simple-demo/src/main/scripts/apps/sling/sample/html.jsp"> not found
at org.apache.sling.scripting.jsp.jasper.compiler.DefaultErrorHandler.jspError(DefaultErrorHandler.java:51)
at org.apache.sling.scripting.jsp.jasper.compiler.ErrorDispatcher.dispatch(ErrorDispatcher.java:409)
at org.apache.sling.scripting.jsp.jasper.compiler.ErrorDispatcher.jspError(ErrorDispatcher.java:116)
at org.apache.sling.scripting.jsp.jasper.compiler.JspUtil.getInputStream(JspUtil.java:847)
at org.apache.sling.scripting.jsp.jasper.xmlparser.XMLEncodingDetector.getEncoding(XMLEncodingDetector.java:108)
at org.apache.sling.scripting.jsp.jasper.compiler.ParserController.determineSyntaxAndEncoding(ParserController.java:309)
at org.apache.sling.scripting.jsp.jasper.compiler.ParserController.doParse(ParserController.java:173)
at org.apache.sling.scripting.jsp.jasper.compiler.ParserController.parse(ParserController.java:103)
at org.apache.sling.scripting.jsp.jasper.compiler.Compiler.generateJava(Compiler.java:168)
at org.apache.sling.scripting.jsp.jasper.compiler.Compiler.compile(Compiler.java:311)
at org.apache.sling.maven.jspc.JspcMojo.processFile(JspcMojo.java:362)
at org.apache.sling.maven.jspc.JspcMojo.executeInternal(JspcMojo.java:316)
at org.apache.sling.maven.jspc.JspcMojo.execute(JspcMojo.java:228)
at org.apache.maven.plugin.DefaultBuildPluginManager.executeMojo(DefaultBuildPluginManager.java:101)
at org.apache.maven.lifecycle.internal.MojoExecutor.execute(MojoExecutor.java:209)
at org.apache.maven.lifecycle.internal.MojoExecutor.execute(MojoExecutor.java:153)
at org.apache.maven.lifecycle.internal.MojoExecutor.execute(MojoExecutor.java:145)
at org.apache.maven.lifecycle.internal.LifecycleModuleBuilder.buildProject(LifecycleModuleBuilder.java:84)
at org.apache.maven.lifecycle.internal.LifecycleModuleBuilder.buildProject(LifecycleModuleBuilder.java:59)
at org.apache.maven.lifecycle.internal.LifecycleStarter.singleThreadedBuild(LifecycleStarter.java:183)
at org.apache.maven.lifecycle.internal.LifecycleStarter.execute(LifecycleStarter.java:161)
at org.apache.maven.DefaultMaven.doExecute(DefaultMaven.java:320)
at org.apache.maven.DefaultMaven.execute(DefaultMaven.java:156)
at org.jvnet.hudson.maven3.launcher.Maven3Launcher.main(Maven3Launcher.java:117)
at sun.reflect.NativeMethodAccessorImpl.invoke0(Native Method)
at sun.reflect.NativeMethodAccessorImpl.invoke(NativeMethodAccessorImpl.java:39)
at sun.reflect.DelegatingMethodAccessorImpl.invoke(DelegatingMethodAccessorImpl.java:25)
at java.lang.reflect.Method.invoke(Method.java:597)
at org.codehaus.plexus.classworlds.launcher.Launcher.launchStandard(Launcher.java:329)
at org.codehaus.plexus.classworlds.launcher.Launcher.launch(Launcher.java:239)
at org.jvnet.hudson.maven3.agent.Maven3Main.launch(Maven3Main.java:178)
at sun.reflect.NativeMethodAccessorImpl.invoke0(Native Method)
at sun.reflect.NativeMethodAccessorImpl.invoke(NativeMethodAccessorImpl.java:39)
at sun.reflect.DelegatingMethodAccessorImpl.invoke(DelegatingMethodAccessorImpl.java:25)
at java.lang.reflect.Method.invoke(Method.java:597)
at hudson.maven.Maven3Builder.call(Maven3Builder.java:129)
at hudson.maven.Maven3Builder.call(Maven3Builder.java:67)
at hudson.remoting.UserRequest.perform(UserRequest.java:118)
at hudson.remoting.UserRequest.perform(UserRequest.java:48)
at hudson.remoting.Request$2.run(Request.java:326)
at hudson.remoting.InterceptingExecutorService$1.call(InterceptingExecutorService.java:72)
at java.util.concurrent.FutureTask$Sync.innerRun(FutureTask.java:303)
at java.util.concurrent.FutureTask.run(FutureTask.java:138)
at java.util.concurrent.ThreadPoolExecutor$Worker.runTask(ThreadPoolExecutor.java:895)
at java.util.concurrent.ThreadPoolExecutor$Worker.run(ThreadPoolExecutor.java:918)
at java.lang.Thread.run(Thread.java:662)
Aug 6, 2013 1:54:53 PM org.apache.maven.cli.event.ExecutionEventLogger logReactorSummary
INFO: ------------------------------------------------------------------------
Aug 6, 2013 1:54:53 PM org.apache.maven.cli.event.ExecutionEventLogger logReactorSummary
INFO: Reactor Summary:
Aug 6, 2013 1:54:53 PM org.apache.maven.cli.event.ExecutionEventLogger logReactorSummary
INFO:
Aug 6, 2013 1:54:53 PM org.apache.maven.cli.event.ExecutionEventLogger logReactorSummary
INFO: Apache Sling ESP blog sample ...................... SUCCESS [12.598s]
Aug 6, 2013 1:54:53 PM org.apache.maven.cli.event.ExecutionEventLogger logReactorSummary
INFO: Apache Sling Javashell sample ..................... SUCCESS [2.727s]
Aug 6, 2013 1:54:53 PM org.apache.maven.cli.event.ExecutionEventLogger logReactorSummary
INFO: Apache Sling Sample Path Based Resource Type Provider SUCCESS [4.109s]
Aug 6, 2013 1:54:53 PM org.apache.maven.cli.event.ExecutionEventLogger logReactorSummary
INFO: Apache Sling Sample Post Servlet Extensions ....... SUCCESS [4.175s]
Aug 6, 2013 1:54:53 PM org.apache.maven.cli.event.ExecutionEventLogger logReactorSummary
INFO: Apache Sling Sample Application ................... FAILURE [2.929s]
Aug 6, 2013 1:54:53 PM org.apache.maven.cli.event.ExecutionEventLogger logReactorSummary
INFO: Apache Sling - Slingshot Demo ..................... SKIPPED
Aug 6, 2013 1:54:53 PM org.apache.maven.cli.event.ExecutionEventLogger logReactorSummary
INFO: Apache Sling Webloader Service .................... SKIPPED
Aug 6, 2013 1:54:53 PM org.apache.maven.cli.event.ExecutionEventLogger logReactorSummary
INFO: Apache Sling Webloader User Interface ............. SKIPPED
Aug 6, 2013 1:54:53 PM org.apache.maven.cli.event.ExecutionEventLogger logReactorSummary
INFO: Apache Sling Sample Custom Login Form ............. SKIPPED
Aug 6, 2013 1:54:53 PM org.apache.maven.cli.event.ExecutionEventLogger logReactorSummary
INFO: Apache Sling Slingbucks - sample coffee store management application SKIPPED
Aug 6, 2013 1:54:53 PM org.apache.maven.cli.event.ExecutionEventLogger logReactorSummary
INFO: Dependency Install Sample ......................... SKIPPED
Aug 6, 2013 1:54:53 PM org.apache.maven.cli.event.ExecutionEventLogger logReactorSummary
INFO: Apache Sling Sample Framework Fragment Bundle ..... SKIPPED
Aug 6, 2013 1:54:53 PM org.apache.maven.cli.event.ExecutionEventLogger logReactorSummary
INFO: Apache Sling User Manager UI sample ............... SKIPPED
Aug 6, 2013 1:54:53 PM org.apache.maven.cli.event.ExecutionEventLogger logReactorSummary
INFO: Apache Sling Access Manager UI sample ............. SKIPPED
Aug 6, 2013 1:54:53 PM org.apache.maven.cli.event.ExecutionEventLogger logReactorSummary
INFO: Apache Sling Samples (Builder) .................... SKIPPED
Aug 6, 2013 1:54:53 PM org.apache.maven.cli.event.ExecutionEventLogger logResult
INFO: ------------------------------------------------------------------------
Aug 6, 2013 1:54:53 PM org.apache.maven.cli.event.ExecutionEventLogger logResult
INFO: BUILD FAILURE
Aug 6, 2013 1:54:53 PM org.apache.maven.cli.event.ExecutionEventLogger logStats
INFO: ------------------------------------------------------------------------
Aug 6, 2013 1:54:53 PM org.apache.maven.cli.event.ExecutionEventLogger logStats
INFO: Total time: 28.564s
Aug 6, 2013 1:54:53 PM org.apache.maven.cli.event.ExecutionEventLogger logStats
INFO: Finished at: Tue Aug 06 13:54:53 UTC 2013
Aug 6, 2013 1:54:53 PM org.apache.maven.cli.event.ExecutionEventLogger logStats
INFO: Final Memory: 27M/88M
Aug 6, 2013 1:54:53 PM org.apache.maven.cli.event.ExecutionEventLogger sessionEnded
INFO: ------------------------------------------------------------------------
[JENKINS] Archiving disabled
[JENKINS] Archiving disabled
[JENKINS] Archiving disabled
[JENKINS] Archiving disabled
[JENKINS] Archiving disabled
[JENKINS] Archiving disabled
[JENKINS] Archiving disabled
[JENKINS] Archiving disabled
[JENKINS] Archiving disabled
[JENKINS] Archiving disabled
[JENKINS] Archiving disabled
[JENKINS] Archiving disabled
[JENKINS] Archiving disabled
[JENKINS] Archiving disabled
[JENKINS] Archiving disabled
Waiting for Jenkins to finish collecting data
mavenExecutionResult exceptions not empty
message : Failed to execute goal org.apache.sling:maven-jspc-plugin:2.0.6:jspc (compile-jsp) on project org.apache.sling.samples.simple-demo: File "<https://builds.apache.org/job/sling-samples-1.6/ws/samples-1.6/simple-demo/src/main/scripts/apps/sling/sample/html.jsp"> not found
cause : File "<https://builds.apache.org/job/sling-samples-1.6/ws/samples-1.6/simple-demo/src/main/scripts/apps/sling/sample/html.jsp"> not found
Stack trace :
org.apache.maven.lifecycle.LifecycleExecutionException: Failed to execute goal org.apache.sling:maven-jspc-plugin:2.0.6:jspc (compile-jsp) on project org.apache.sling.samples.simple-demo: File "<https://builds.apache.org/job/sling-samples-1.6/ws/samples-1.6/simple-demo/src/main/scripts/apps/sling/sample/html.jsp"> not found
at org.apache.maven.lifecycle.internal.MojoExecutor.execute(MojoExecutor.java:217)
at org.apache.maven.lifecycle.internal.MojoExecutor.execute(MojoExecutor.java:153)
at org.apache.maven.lifecycle.internal.MojoExecutor.execute(MojoExecutor.java:145)
at org.apache.maven.lifecycle.internal.LifecycleModuleBuilder.buildProject(LifecycleModuleBuilder.java:84)
at org.apache.maven.lifecycle.internal.LifecycleModuleBuilder.buildProject(LifecycleModuleBuilder.java:59)
at org.apache.maven.lifecycle.internal.LifecycleStarter.singleThreadedBuild(LifecycleStarter.java:183)
at org.apache.maven.lifecycle.internal.LifecycleStarter.execute(LifecycleStarter.java:161)
at org.apache.maven.DefaultMaven.doExecute(DefaultMaven.java:320)
at org.apache.maven.DefaultMaven.execute(DefaultMaven.java:156)
at org.jvnet.hudson.maven3.launcher.Maven3Launcher.main(Maven3Launcher.java:117)
at sun.reflect.NativeMethodAccessorImpl.invoke0(Native Method)
at sun.reflect.NativeMethodAccessorImpl.invoke(NativeMethodAccessorImpl.java:39)
at sun.reflect.DelegatingMethodAccessorImpl.invoke(DelegatingMethodAccessorImpl.java:25)
at java.lang.reflect.Method.invoke(Method.java:597)
at org.codehaus.plexus.classworlds.launcher.Launcher.launchStandard(Launcher.java:329)
at org.codehaus.plexus.classworlds.launcher.Launcher.launch(Launcher.java:239)
at org.jvnet.hudson.maven3.agent.Maven3Main.launch(Maven3Main.java:178)
at sun.reflect.NativeMethodAccessorImpl.invoke0(Native Method)
at sun.reflect.NativeMethodAccessorImpl.invoke(NativeMethodAccessorImpl.java:39)
at sun.reflect.DelegatingMethodAccessorImpl.invoke(DelegatingMethodAccessorImpl.java:25)
at java.lang.reflect.Method.invoke(Method.java:597)
at hudson.maven.Maven3Builder.call(Maven3Builder.java:129)
at hudson.maven.Maven3Builder.call(Maven3Builder.java:67)
at hudson.remoting.UserRequest.perform(UserRequest.java:118)
at hudson.remoting.UserRequest.perform(UserRequest.java:48)
at hudson.remoting.Request$2.run(Request.java:326)
at hudson.remoting.InterceptingExecutorService$1.call(InterceptingExecutorService.java:72)
at java.util.concurrent.FutureTask$Sync.innerRun(FutureTask.java:303)
at java.util.concurrent.FutureTask.run(FutureTask.java:138)
at java.util.concurrent.ThreadPoolExecutor$Worker.runTask(ThreadPoolExecutor.java:895)
at java.util.concurrent.ThreadPoolExecutor$Worker.run(ThreadPoolExecutor.java:918)
at java.lang.Thread.run(Thread.java:662)
Caused by: org.apache.maven.plugin.MojoExecutionException: File "<https://builds.apache.org/job/sling-samples-1.6/ws/samples-1.6/simple-demo/src/main/scripts/apps/sling/sample/html.jsp"> not found
at org.apache.sling.maven.jspc.JspcMojo.execute(JspcMojo.java:231)
at org.apache.maven.plugin.DefaultBuildPluginManager.executeMojo(DefaultBuildPluginManager.java:101)
at org.apache.maven.lifecycle.internal.MojoExecutor.execute(MojoExecutor.java:209)
... 31 more
Caused by: org.apache.sling.scripting.jsp.jasper.JasperException: File "<https://builds.apache.org/job/sling-samples-1.6/ws/samples-1.6/simple-demo/src/main/scripts/apps/sling/sample/html.jsp"> not found
at org.apache.sling.scripting.jsp.jasper.compiler.DefaultErrorHandler.jspError(DefaultErrorHandler.java:51)
at org.apache.sling.scripting.jsp.jasper.compiler.ErrorDispatcher.dispatch(ErrorDispatcher.java:409)
at org.apache.sling.scripting.jsp.jasper.compiler.ErrorDispatcher.jspError(ErrorDispatcher.java:116)
at org.apache.sling.scripting.jsp.jasper.compiler.JspUtil.getInputStream(JspUtil.java:847)
at org.apache.sling.scripting.jsp.jasper.xmlparser.XMLEncodingDetector.getEncoding(XMLEncodingDetector.java:108)
at org.apache.sling.scripting.jsp.jasper.compiler.ParserController.determineSyntaxAndEncoding(ParserController.java:309)
at org.apache.sling.scripting.jsp.jasper.compiler.ParserController.doParse(ParserController.java:173)
at org.apache.sling.scripting.jsp.jasper.compiler.ParserController.parse(ParserController.java:103)
at org.apache.sling.scripting.jsp.jasper.compiler.Compiler.generateJava(Compiler.java:168)
at org.apache.sling.scripting.jsp.jasper.compiler.Compiler.compile(Compiler.java:311)
at org.apache.sling.maven.jspc.JspcMojo.processFile(JspcMojo.java:362)
at org.apache.sling.maven.jspc.JspcMojo.executeInternal(JspcMojo.java:316)
at org.apache.sling.maven.jspc.JspcMojo.execute(JspcMojo.java:228)
... 33 more
Sending e-mails to: dev@sling.apache.org
channel stopped
[locks-and-latches] Releasing all the locks
[locks-and-latches] All the locks released
Jenkins build is back to normal : sling-samples-1.6 #427
Posted by Apache Jenkins Server <je...@builds.apache.org>.
See <https://builds.apache.org/job/sling-samples-1.6/427/>