You are viewing a plain text version of this content. The canonical link for it is here.
Posted to builds@beam.apache.org by Apache Jenkins Server <je...@builds.apache.org> on 2023/03/17 05:16:38 UTC

Build failed in Jenkins: beam_PreCommit_Python_Integration_Cron #285

See <https://ci-beam.apache.org/job/beam_PreCommit_Python_Integration_Cron/285/display/redirect>

Changes:


------------------------------------------
[...truncated 130.98 KB...]
../../build/gradleenv/2050596098/lib/python3.10/site-packages/google/rpc/__init__.py:20
  <https://ci-beam.apache.org/job/beam_PreCommit_Python_Integration_Cron/ws/src/build/gradleenv/2050596098/lib/python3.10/site-packages/google/rpc/__init__.py>:20: DeprecationWarning: Deprecated call to `pkg_resources.declare_namespace('google.rpc')`.
  Implementing implicit namespace packages (as specified in PEP 420) is preferred to `pkg_resources.declare_namespace`. See https://setuptools.pypa.io/en/latest/references/keywords.html#keyword-namespace-packages
    pkg_resources.declare_namespace(__name__)

-- Docs: https://docs.pytest.org/en/stable/how-to/capture-warnings.html
- generated xml file: <https://ci-beam.apache.org/job/beam_PreCommit_Python_Integration_Cron/ws/src/sdks/python/pytest_preCommitIT-df-py310.xml> -
================= 1 passed, 120 warnings in 596.10s (0:09:56) ==================

> Task :sdks:python:test-suites:dataflow:py310:preCommitIT_streaming_V2
>>> RUNNING integration tests with pipeline options: --runner=TestDataflowRunner --project=apache-beam-testing --region=us-central1 --staging_location=gs://temp-storage-for-end-to-end-tests/staging-it --temp_location=gs://temp-storage-for-end-to-end-tests/temp-it --output=gs://temp-storage-for-end-to-end-tests/py-it-cloud/output --sdk_location=<https://ci-beam.apache.org/job/beam_PreCommit_Python_Integration_Cron/ws/src/sdks/python/build/apache-beam.tar.gz> --requirements_file=postcommit_requirements.txt --num_workers=1 --sleep_secs=20 --streaming --experiments=use_runner_v2 --enable_streaming_engine --kms_key_name=projects/apache-beam-testing/locations/global/keyRings/beam-it/cryptoKeys/test --dataflow_kms_key=projects/apache-beam-testing/locations/global/keyRings/beam-it/cryptoKeys/test
>>>   pytest options: apache_beam/examples/streaming_wordcount_it_test.py::StreamingWordCountIT::test_streaming_wordcount_it --capture=no --numprocesses=2 --timeout=1800
>>>   collect markers: 
============================= test session starts ==============================
platform linux -- Python 3.10.2, pytest-7.2.2, pluggy-1.0.0
rootdir: <https://ci-beam.apache.org/job/beam_PreCommit_Python_Integration_Cron/ws/src/sdks/python,> configfile: pytest.ini
plugins: xdist-2.5.0, hypothesis-6.70.0, timeout-2.1.0, forked-1.6.0, requests-mock-1.10.0
timeout: 1800.0s
timeout method: signal
timeout func_only: False
gw0 I / gw1 I
[gw0] Python 3.10.2 (main, Jan 15 2022, 18:02:07) [GCC 9.3.0]
[gw1] Python 3.10.2 (main, Jan 15 2022, 18:02:07) [GCC 9.3.0]
gw0 [1] / gw1 [1]

scheduling tests via LoadScheduling

apache_beam/examples/streaming_wordcount_it_test.py::StreamingWordCountIT::test_streaming_wordcount_it 
> Task :sdks:python:test-suites:dataflow:py37:preCommitIT_batch_V2

[gw0] PASSED apache_beam/examples/wordcount_it_test.py::WordCountIT::test_wordcount_it 

=============================== warnings summary ===============================
../../build/gradleenv/-1734967052/lib/python3.7/site-packages/hdfs/config.py:15
../../build/gradleenv/-1734967052/lib/python3.7/site-packages/hdfs/config.py:15
../../build/gradleenv/-1734967052/lib/python3.7/site-packages/hdfs/config.py:15
  <https://ci-beam.apache.org/job/beam_PreCommit_Python_Integration_Cron/ws/src/build/gradleenv/-1734967052/lib/python3.7/site-packages/hdfs/config.py>:15: DeprecationWarning: the imp module is deprecated in favour of importlib; see the module's documentation for alternative uses
    from imp import load_source

../../build/gradleenv/-1734967052/lib/python3.7/site-packages/pkg_resources/__init__.py:121
../../build/gradleenv/-1734967052/lib/python3.7/site-packages/pkg_resources/__init__.py:121
../../build/gradleenv/-1734967052/lib/python3.7/site-packages/pkg_resources/__init__.py:121
  <https://ci-beam.apache.org/job/beam_PreCommit_Python_Integration_Cron/ws/src/build/gradleenv/-1734967052/lib/python3.7/site-packages/pkg_resources/__init__.py>:121: DeprecationWarning: pkg_resources is deprecated as an API
    warnings.warn("pkg_resources is deprecated as an API", DeprecationWarning)

../../build/gradleenv/-1734967052/lib/python3.7/site-packages/pkg_resources/__init__.py:2870: 54 warnings
  <https://ci-beam.apache.org/job/beam_PreCommit_Python_Integration_Cron/ws/src/build/gradleenv/-1734967052/lib/python3.7/site-packages/pkg_resources/__init__.py>:2870: DeprecationWarning: Deprecated call to `pkg_resources.declare_namespace('google')`.
  Implementing implicit namespace packages (as specified in PEP 420) is preferred to `pkg_resources.declare_namespace`. See https://setuptools.pypa.io/en/latest/references/keywords.html#keyword-namespace-packages
    declare_namespace(pkg)

../../build/gradleenv/-1734967052/lib/python3.7/site-packages/pkg_resources/__init__.py:2870: 39 warnings
  <https://ci-beam.apache.org/job/beam_PreCommit_Python_Integration_Cron/ws/src/build/gradleenv/-1734967052/lib/python3.7/site-packages/pkg_resources/__init__.py>:2870: DeprecationWarning: Deprecated call to `pkg_resources.declare_namespace('google.cloud')`.
  Implementing implicit namespace packages (as specified in PEP 420) is preferred to `pkg_resources.declare_namespace`. See https://setuptools.pypa.io/en/latest/references/keywords.html#keyword-namespace-packages
    declare_namespace(pkg)

../../build/gradleenv/-1734967052/lib/python3.7/site-packages/pkg_resources/__init__.py:2349: 12 warnings
  <https://ci-beam.apache.org/job/beam_PreCommit_Python_Integration_Cron/ws/src/build/gradleenv/-1734967052/lib/python3.7/site-packages/pkg_resources/__init__.py>:2349: DeprecationWarning: Deprecated call to `pkg_resources.declare_namespace('google')`.
  Implementing implicit namespace packages (as specified in PEP 420) is preferred to `pkg_resources.declare_namespace`. See https://setuptools.pypa.io/en/latest/references/keywords.html#keyword-namespace-packages
    declare_namespace(parent)

../../build/gradleenv/-1734967052/lib/python3.7/site-packages/pkg_resources/__init__.py:2870
../../build/gradleenv/-1734967052/lib/python3.7/site-packages/pkg_resources/__init__.py:2870
../../build/gradleenv/-1734967052/lib/python3.7/site-packages/pkg_resources/__init__.py:2870
  <https://ci-beam.apache.org/job/beam_PreCommit_Python_Integration_Cron/ws/src/build/gradleenv/-1734967052/lib/python3.7/site-packages/pkg_resources/__init__.py>:2870: DeprecationWarning: Deprecated call to `pkg_resources.declare_namespace('google.logging')`.
  Implementing implicit namespace packages (as specified in PEP 420) is preferred to `pkg_resources.declare_namespace`. See https://setuptools.pypa.io/en/latest/references/keywords.html#keyword-namespace-packages
    declare_namespace(pkg)

../../build/gradleenv/-1734967052/lib/python3.7/site-packages/pkg_resources/__init__.py:2870
../../build/gradleenv/-1734967052/lib/python3.7/site-packages/pkg_resources/__init__.py:2870
../../build/gradleenv/-1734967052/lib/python3.7/site-packages/pkg_resources/__init__.py:2870
  <https://ci-beam.apache.org/job/beam_PreCommit_Python_Integration_Cron/ws/src/build/gradleenv/-1734967052/lib/python3.7/site-packages/pkg_resources/__init__.py>:2870: DeprecationWarning: Deprecated call to `pkg_resources.declare_namespace('google.iam')`.
  Implementing implicit namespace packages (as specified in PEP 420) is preferred to `pkg_resources.declare_namespace`. See https://setuptools.pypa.io/en/latest/references/keywords.html#keyword-namespace-packages
    declare_namespace(pkg)

../../build/gradleenv/-1734967052/lib/python3.7/site-packages/google/rpc/__init__.py:20
../../build/gradleenv/-1734967052/lib/python3.7/site-packages/google/rpc/__init__.py:20
../../build/gradleenv/-1734967052/lib/python3.7/site-packages/google/rpc/__init__.py:20
  <https://ci-beam.apache.org/job/beam_PreCommit_Python_Integration_Cron/ws/src/build/gradleenv/-1734967052/lib/python3.7/site-packages/google/rpc/__init__.py>:20: DeprecationWarning: Deprecated call to `pkg_resources.declare_namespace('google.rpc')`.
  Implementing implicit namespace packages (as specified in PEP 420) is preferred to `pkg_resources.declare_namespace`. See https://setuptools.pypa.io/en/latest/references/keywords.html#keyword-namespace-packages
    pkg_resources.declare_namespace(__name__)

-- Docs: https://docs.pytest.org/en/stable/how-to/capture-warnings.html
- generated xml file: <https://ci-beam.apache.org/job/beam_PreCommit_Python_Integration_Cron/ws/src/sdks/python/pytest_preCommitIT-df-py37.xml> -
================= 1 passed, 120 warnings in 771.40s (0:12:51) ==================

> Task :sdks:python:test-suites:dataflow:py37:preCommitIT_streaming_V2
>>> RUNNING integration tests with pipeline options: --runner=TestDataflowRunner --project=apache-beam-testing --region=us-central1 --staging_location=gs://temp-storage-for-end-to-end-tests/staging-it --temp_location=gs://temp-storage-for-end-to-end-tests/temp-it --output=gs://temp-storage-for-end-to-end-tests/py-it-cloud/output --sdk_location=<https://ci-beam.apache.org/job/beam_PreCommit_Python_Integration_Cron/ws/src/sdks/python/build/apache-beam.tar.gz> --requirements_file=postcommit_requirements.txt --num_workers=1 --sleep_secs=20 --streaming --experiments=use_runner_v2 --enable_streaming_engine --kms_key_name=projects/apache-beam-testing/locations/global/keyRings/beam-it/cryptoKeys/test --dataflow_kms_key=projects/apache-beam-testing/locations/global/keyRings/beam-it/cryptoKeys/test
>>>   pytest options: apache_beam/examples/streaming_wordcount_it_test.py::StreamingWordCountIT::test_streaming_wordcount_it --capture=no --numprocesses=2 --timeout=1800
>>>   collect markers: 
============================= test session starts ==============================
platform linux -- Python 3.7.12, pytest-7.2.2, pluggy-1.0.0
rootdir: <https://ci-beam.apache.org/job/beam_PreCommit_Python_Integration_Cron/ws/src/sdks/python,> configfile: pytest.ini
plugins: xdist-2.5.0, hypothesis-6.70.0, timeout-2.1.0, forked-1.6.0, requests-mock-1.10.0
timeout: 1800.0s
timeout method: signal
timeout func_only: False
gw0 I / gw1 I
[gw0] Python 3.7.12 (default, Jan 15 2022, 18:42:10)  -- [GCC 9.3.0]
[gw1] Python 3.7.12 (default, Jan 15 2022, 18:42:10)  -- [GCC 9.3.0]
gw0 [1] / gw1 [1]

scheduling tests via LoadScheduling

apache_beam/examples/streaming_wordcount_it_test.py::StreamingWordCountIT::test_streaming_wordcount_it 
> Task :sdks:python:test-suites:dataflow:py310:preCommitIT_streaming_V2

[gw0] PASSED apache_beam/examples/streaming_wordcount_it_test.py::StreamingWordCountIT::test_streaming_wordcount_it 

=============================== warnings summary ===============================
../../build/gradleenv/2050596098/lib/python3.10/site-packages/hdfs/config.py:15
../../build/gradleenv/2050596098/lib/python3.10/site-packages/hdfs/config.py:15
../../build/gradleenv/2050596098/lib/python3.10/site-packages/hdfs/config.py:15
  <https://ci-beam.apache.org/job/beam_PreCommit_Python_Integration_Cron/ws/src/build/gradleenv/2050596098/lib/python3.10/site-packages/hdfs/config.py>:15: DeprecationWarning: the imp module is deprecated in favour of importlib and slated for removal in Python 3.12; see the module's documentation for alternative uses
    from imp import load_source

../../build/gradleenv/2050596098/lib/python3.10/site-packages/pkg_resources/__init__.py:121
../../build/gradleenv/2050596098/lib/python3.10/site-packages/pkg_resources/__init__.py:121
../../build/gradleenv/2050596098/lib/python3.10/site-packages/pkg_resources/__init__.py:121
  <https://ci-beam.apache.org/job/beam_PreCommit_Python_Integration_Cron/ws/src/build/gradleenv/2050596098/lib/python3.10/site-packages/pkg_resources/__init__.py>:121: DeprecationWarning: pkg_resources is deprecated as an API
    warnings.warn("pkg_resources is deprecated as an API", DeprecationWarning)

../../build/gradleenv/2050596098/lib/python3.10/site-packages/pkg_resources/__init__.py:2870: 54 warnings
  <https://ci-beam.apache.org/job/beam_PreCommit_Python_Integration_Cron/ws/src/build/gradleenv/2050596098/lib/python3.10/site-packages/pkg_resources/__init__.py>:2870: DeprecationWarning: Deprecated call to `pkg_resources.declare_namespace('google')`.
  Implementing implicit namespace packages (as specified in PEP 420) is preferred to `pkg_resources.declare_namespace`. See https://setuptools.pypa.io/en/latest/references/keywords.html#keyword-namespace-packages
    declare_namespace(pkg)

../../build/gradleenv/2050596098/lib/python3.10/site-packages/pkg_resources/__init__.py:2870: 39 warnings
  <https://ci-beam.apache.org/job/beam_PreCommit_Python_Integration_Cron/ws/src/build/gradleenv/2050596098/lib/python3.10/site-packages/pkg_resources/__init__.py>:2870: DeprecationWarning: Deprecated call to `pkg_resources.declare_namespace('google.cloud')`.
  Implementing implicit namespace packages (as specified in PEP 420) is preferred to `pkg_resources.declare_namespace`. See https://setuptools.pypa.io/en/latest/references/keywords.html#keyword-namespace-packages
    declare_namespace(pkg)

../../build/gradleenv/2050596098/lib/python3.10/site-packages/pkg_resources/__init__.py:2349: 12 warnings
  <https://ci-beam.apache.org/job/beam_PreCommit_Python_Integration_Cron/ws/src/build/gradleenv/2050596098/lib/python3.10/site-packages/pkg_resources/__init__.py>:2349: DeprecationWarning: Deprecated call to `pkg_resources.declare_namespace('google')`.
  Implementing implicit namespace packages (as specified in PEP 420) is preferred to `pkg_resources.declare_namespace`. See https://setuptools.pypa.io/en/latest/references/keywords.html#keyword-namespace-packages
    declare_namespace(parent)

../../build/gradleenv/2050596098/lib/python3.10/site-packages/pkg_resources/__init__.py:2870
../../build/gradleenv/2050596098/lib/python3.10/site-packages/pkg_resources/__init__.py:2870
../../build/gradleenv/2050596098/lib/python3.10/site-packages/pkg_resources/__init__.py:2870
  <https://ci-beam.apache.org/job/beam_PreCommit_Python_Integration_Cron/ws/src/build/gradleenv/2050596098/lib/python3.10/site-packages/pkg_resources/__init__.py>:2870: DeprecationWarning: Deprecated call to `pkg_resources.declare_namespace('google.logging')`.
  Implementing implicit namespace packages (as specified in PEP 420) is preferred to `pkg_resources.declare_namespace`. See https://setuptools.pypa.io/en/latest/references/keywords.html#keyword-namespace-packages
    declare_namespace(pkg)

../../build/gradleenv/2050596098/lib/python3.10/site-packages/pkg_resources/__init__.py:2870
../../build/gradleenv/2050596098/lib/python3.10/site-packages/pkg_resources/__init__.py:2870
../../build/gradleenv/2050596098/lib/python3.10/site-packages/pkg_resources/__init__.py:2870
  <https://ci-beam.apache.org/job/beam_PreCommit_Python_Integration_Cron/ws/src/build/gradleenv/2050596098/lib/python3.10/site-packages/pkg_resources/__init__.py>:2870: DeprecationWarning: Deprecated call to `pkg_resources.declare_namespace('google.iam')`.
  Implementing implicit namespace packages (as specified in PEP 420) is preferred to `pkg_resources.declare_namespace`. See https://setuptools.pypa.io/en/latest/references/keywords.html#keyword-namespace-packages
    declare_namespace(pkg)

../../build/gradleenv/2050596098/lib/python3.10/site-packages/google/rpc/__init__.py:20
../../build/gradleenv/2050596098/lib/python3.10/site-packages/google/rpc/__init__.py:20
../../build/gradleenv/2050596098/lib/python3.10/site-packages/google/rpc/__init__.py:20
  <https://ci-beam.apache.org/job/beam_PreCommit_Python_Integration_Cron/ws/src/build/gradleenv/2050596098/lib/python3.10/site-packages/google/rpc/__init__.py>:20: DeprecationWarning: Deprecated call to `pkg_resources.declare_namespace('google.rpc')`.
  Implementing implicit namespace packages (as specified in PEP 420) is preferred to `pkg_resources.declare_namespace`. See https://setuptools.pypa.io/en/latest/references/keywords.html#keyword-namespace-packages
    pkg_resources.declare_namespace(__name__)

-- Docs: https://docs.pytest.org/en/stable/how-to/capture-warnings.html
- generated xml file: <https://ci-beam.apache.org/job/beam_PreCommit_Python_Integration_Cron/ws/src/sdks/python/pytest_preCommitIT-df-py310.xml> -
================= 1 passed, 120 warnings in 760.75s (0:12:40) ==================

> Task :sdks:python:test-suites:dataflow:py37:preCommitIT_streaming_V2

[gw0] PASSED apache_beam/examples/streaming_wordcount_it_test.py::StreamingWordCountIT::test_streaming_wordcount_it 

=============================== warnings summary ===============================
../../build/gradleenv/-1734967052/lib/python3.7/site-packages/hdfs/config.py:15
../../build/gradleenv/-1734967052/lib/python3.7/site-packages/hdfs/config.py:15
../../build/gradleenv/-1734967052/lib/python3.7/site-packages/hdfs/config.py:15
  <https://ci-beam.apache.org/job/beam_PreCommit_Python_Integration_Cron/ws/src/build/gradleenv/-1734967052/lib/python3.7/site-packages/hdfs/config.py>:15: DeprecationWarning: the imp module is deprecated in favour of importlib; see the module's documentation for alternative uses
    from imp import load_source

../../build/gradleenv/-1734967052/lib/python3.7/site-packages/pkg_resources/__init__.py:121
../../build/gradleenv/-1734967052/lib/python3.7/site-packages/pkg_resources/__init__.py:121
../../build/gradleenv/-1734967052/lib/python3.7/site-packages/pkg_resources/__init__.py:121
  <https://ci-beam.apache.org/job/beam_PreCommit_Python_Integration_Cron/ws/src/build/gradleenv/-1734967052/lib/python3.7/site-packages/pkg_resources/__init__.py>:121: DeprecationWarning: pkg_resources is deprecated as an API
    warnings.warn("pkg_resources is deprecated as an API", DeprecationWarning)

../../build/gradleenv/-1734967052/lib/python3.7/site-packages/pkg_resources/__init__.py:2870: 54 warnings
  <https://ci-beam.apache.org/job/beam_PreCommit_Python_Integration_Cron/ws/src/build/gradleenv/-1734967052/lib/python3.7/site-packages/pkg_resources/__init__.py>:2870: DeprecationWarning: Deprecated call to `pkg_resources.declare_namespace('google')`.
  Implementing implicit namespace packages (as specified in PEP 420) is preferred to `pkg_resources.declare_namespace`. See https://setuptools.pypa.io/en/latest/references/keywords.html#keyword-namespace-packages
    declare_namespace(pkg)

../../build/gradleenv/-1734967052/lib/python3.7/site-packages/pkg_resources/__init__.py:2870: 39 warnings
  <https://ci-beam.apache.org/job/beam_PreCommit_Python_Integration_Cron/ws/src/build/gradleenv/-1734967052/lib/python3.7/site-packages/pkg_resources/__init__.py>:2870: DeprecationWarning: Deprecated call to `pkg_resources.declare_namespace('google.cloud')`.
  Implementing implicit namespace packages (as specified in PEP 420) is preferred to `pkg_resources.declare_namespace`. See https://setuptools.pypa.io/en/latest/references/keywords.html#keyword-namespace-packages
    declare_namespace(pkg)

../../build/gradleenv/-1734967052/lib/python3.7/site-packages/pkg_resources/__init__.py:2349: 12 warnings
  <https://ci-beam.apache.org/job/beam_PreCommit_Python_Integration_Cron/ws/src/build/gradleenv/-1734967052/lib/python3.7/site-packages/pkg_resources/__init__.py>:2349: DeprecationWarning: Deprecated call to `pkg_resources.declare_namespace('google')`.
  Implementing implicit namespace packages (as specified in PEP 420) is preferred to `pkg_resources.declare_namespace`. See https://setuptools.pypa.io/en/latest/references/keywords.html#keyword-namespace-packages
    declare_namespace(parent)

../../build/gradleenv/-1734967052/lib/python3.7/site-packages/pkg_resources/__init__.py:2870
../../build/gradleenv/-1734967052/lib/python3.7/site-packages/pkg_resources/__init__.py:2870
../../build/gradleenv/-1734967052/lib/python3.7/site-packages/pkg_resources/__init__.py:2870
  <https://ci-beam.apache.org/job/beam_PreCommit_Python_Integration_Cron/ws/src/build/gradleenv/-1734967052/lib/python3.7/site-packages/pkg_resources/__init__.py>:2870: DeprecationWarning: Deprecated call to `pkg_resources.declare_namespace('google.logging')`.
  Implementing implicit namespace packages (as specified in PEP 420) is preferred to `pkg_resources.declare_namespace`. See https://setuptools.pypa.io/en/latest/references/keywords.html#keyword-namespace-packages
    declare_namespace(pkg)

../../build/gradleenv/-1734967052/lib/python3.7/site-packages/pkg_resources/__init__.py:2870
../../build/gradleenv/-1734967052/lib/python3.7/site-packages/pkg_resources/__init__.py:2870
../../build/gradleenv/-1734967052/lib/python3.7/site-packages/pkg_resources/__init__.py:2870
  <https://ci-beam.apache.org/job/beam_PreCommit_Python_Integration_Cron/ws/src/build/gradleenv/-1734967052/lib/python3.7/site-packages/pkg_resources/__init__.py>:2870: DeprecationWarning: Deprecated call to `pkg_resources.declare_namespace('google.iam')`.
  Implementing implicit namespace packages (as specified in PEP 420) is preferred to `pkg_resources.declare_namespace`. See https://setuptools.pypa.io/en/latest/references/keywords.html#keyword-namespace-packages
    declare_namespace(pkg)

../../build/gradleenv/-1734967052/lib/python3.7/site-packages/google/rpc/__init__.py:20
../../build/gradleenv/-1734967052/lib/python3.7/site-packages/google/rpc/__init__.py:20
../../build/gradleenv/-1734967052/lib/python3.7/site-packages/google/rpc/__init__.py:20
  <https://ci-beam.apache.org/job/beam_PreCommit_Python_Integration_Cron/ws/src/build/gradleenv/-1734967052/lib/python3.7/site-packages/google/rpc/__init__.py>:20: DeprecationWarning: Deprecated call to `pkg_resources.declare_namespace('google.rpc')`.
  Implementing implicit namespace packages (as specified in PEP 420) is preferred to `pkg_resources.declare_namespace`. See https://setuptools.pypa.io/en/latest/references/keywords.html#keyword-namespace-packages
    pkg_resources.declare_namespace(__name__)

-- Docs: https://docs.pytest.org/en/stable/how-to/capture-warnings.html
- generated xml file: <https://ci-beam.apache.org/job/beam_PreCommit_Python_Integration_Cron/ws/src/sdks/python/pytest_preCommitIT-df-py37.xml> -
================= 1 passed, 120 warnings in 793.01s (0:13:13) ==================

> Task :sdks:python:test-suites:dataflow:preCommitIT_V2

FAILURE: Build failed with an exception.

* Where:
Script '<https://ci-beam.apache.org/job/beam_PreCommit_Python_Integration_Cron/ws/src/sdks/python/test-suites/dataflow/common.gradle'> line: 75

* What went wrong:
Execution failed for task ':sdks:python:test-suites:dataflow:py37:preCommitIT_batch'.
> Process 'command 'sh'' finished with non-zero exit value 1

* Try:
> Run with --stacktrace option to get the stack trace.
> Run with --info or --debug option to get more log output.

* Get more help at https://help.gradle.org

Deprecated Gradle features were used in this build, making it incompatible with Gradle 8.0.

You can use '--warning-mode all' to show the individual deprecation warnings and determine if they come from your own scripts or plugins.

See https://docs.gradle.org/7.5.1/userguide/command_line_interface.html#sec:command_line_warnings

BUILD FAILED in 51m 12s
24 actionable tasks: 18 executed, 4 from cache, 2 up-to-date

Publishing build scan...
https://gradle.com/s/5vhxijzywmqzu

Build step 'Invoke Gradle script' changed build result to FAILURE
Build step 'Invoke Gradle script' marked build as failure

---------------------------------------------------------------------
To unsubscribe, e-mail: builds-unsubscribe@beam.apache.org
For additional commands, e-mail: builds-help@beam.apache.org


Jenkins build is back to normal : beam_PreCommit_Python_Integration_Cron #286

Posted by Apache Jenkins Server <je...@builds.apache.org>.
See <https://ci-beam.apache.org/job/beam_PreCommit_Python_Integration_Cron/286/display/redirect>


---------------------------------------------------------------------
To unsubscribe, e-mail: builds-unsubscribe@beam.apache.org
For additional commands, e-mail: builds-help@beam.apache.org