You are viewing a plain text version of this content. The canonical link for it is here.
Posted to dev@lucene.apache.org by Policeman Jenkins Server <je...@thetaphi.de> on 2018/12/26 04:30:33 UTC

[JENKINS] Lucene-Solr-BadApples-7.x-Linux (32bit/jdk1.8.0_172) - Build # 139 - Still Unstable!

Build: https://jenkins.thetaphi.de/job/Lucene-Solr-BadApples-7.x-Linux/139/
Java: 32bit/jdk1.8.0_172 -server -XX:+UseSerialGC

1 tests failed.
FAILED:  junit.framework.TestSuite.org.apache.solr.update.processor.ScriptEngineTest

Error Message:
The test or suite printed 10008 bytes to stdout and stderr, even though the limit was set to 8192 bytes. Increase the limit with @Limit, ignore it completely with @SuppressSysoutChecks or run with -Dtests.verbose=true

Stack Trace:
java.lang.AssertionError: The test or suite printed 10008 bytes to stdout and stderr, even though the limit was set to 8192 bytes. Increase the limit with @Limit, ignore it completely with @SuppressSysoutChecks or run with -Dtests.verbose=true
	at __randomizedtesting.SeedInfo.seed([EE1EE3B3FE2CB4D]:0)
	at org.apache.lucene.util.TestRuleLimitSysouts.afterIfSuccessful(TestRuleLimitSysouts.java:211)
	at com.carrotsearch.randomizedtesting.rules.TestRuleAdapter$1.afterIfSuccessful(TestRuleAdapter.java:36)
	at com.carrotsearch.randomizedtesting.rules.StatementAdapter.evaluate(StatementAdapter.java:37)
	at org.apache.lucene.util.TestRuleAssertionsRequired$1.evaluate(TestRuleAssertionsRequired.java:53)
	at org.apache.lucene.util.TestRuleMarkFailure$1.evaluate(TestRuleMarkFailure.java:47)
	at org.apache.lucene.util.TestRuleIgnoreAfterMaxFailures$1.evaluate(TestRuleIgnoreAfterMaxFailures.java:64)
	at org.apache.lucene.util.TestRuleIgnoreTestSuites$1.evaluate(TestRuleIgnoreTestSuites.java:54)
	at com.carrotsearch.randomizedtesting.rules.StatementAdapter.evaluate(StatementAdapter.java:36)
	at com.carrotsearch.randomizedtesting.ThreadLeakControl$StatementRunner.run(ThreadLeakControl.java:368)
	at java.lang.Thread.run(Thread.java:748)




Build Log:
[...truncated 13591 lines...]
   [junit4] Suite: org.apache.solr.update.processor.ScriptEngineTest
   [junit4] IGNOR/A 0.00s J2 | ScriptEngineTest.testJRuby
   [junit4]    > Assumption #1: got: <[null]>, expected: every item is not null
   [junit4]   2> 662234 ERROR (Finalizer) [    ] o.a.s.c.CoreContainer CoreContainer was not close prior to finalize(), indicates a bug -- POSSIBLE RESOURCE LEAK!!!  instance=13677481
   [junit4]   2> 662234 ERROR (Finalizer) [    ] o.a.s.c.CoreContainer CoreContainer was not close prior to finalize(), indicates a bug -- POSSIBLE RESOURCE LEAK!!!  instance=14650409
   [junit4]   2> 662235 ERROR (Finalizer) [    ] o.a.s.c.CoreContainer CoreContainer was not close prior to finalize(), indicates a bug -- POSSIBLE RESOURCE LEAK!!!  instance=2700282
   [junit4]   2> 662235 ERROR (Finalizer) [    ] o.a.s.c.CoreContainer CoreContainer was not close prior to finalize(), indicates a bug -- POSSIBLE RESOURCE LEAK!!!  instance=18086052
   [junit4]   2> 662235 ERROR (Finalizer) [    ] o.a.s.c.CoreContainer CoreContainer was not close prior to finalize(), indicates a bug -- POSSIBLE RESOURCE LEAK!!!  instance=7162900
   [junit4]   2> 662235 ERROR (Finalizer) [    ] o.a.s.c.CoreContainer CoreContainer was not close prior to finalize(), indicates a bug -- POSSIBLE RESOURCE LEAK!!!  instance=11874932
   [junit4]   2> 662235 ERROR (Finalizer) [    ] o.a.s.c.CoreContainer CoreContainer was not close prior to finalize(), indicates a bug -- POSSIBLE RESOURCE LEAK!!!  instance=21786427
   [junit4]   2> 662235 ERROR (Finalizer) [    ] o.a.s.c.CoreContainer CoreContainer was not close prior to finalize(), indicates a bug -- POSSIBLE RESOURCE LEAK!!!  instance=17981678
   [junit4]   2> 662235 ERROR (Finalizer) [    ] o.a.s.c.CoreContainer CoreContainer was not close prior to finalize(), indicates a bug -- POSSIBLE RESOURCE LEAK!!!  instance=22122932
   [junit4]   2> 662235 ERROR (Finalizer) [    ] o.a.s.c.CoreContainer CoreContainer was not close prior to finalize(), indicates a bug -- POSSIBLE RESOURCE LEAK!!!  instance=10239032
   [junit4]   2> 662235 ERROR (Finalizer) [    ] o.a.s.c.CoreContainer CoreContainer was not close prior to finalize(), indicates a bug -- POSSIBLE RESOURCE LEAK!!!  instance=13089447
   [junit4]   2> 662236 ERROR (Finalizer) [    ] o.a.s.c.CoreContainer CoreContainer was not close prior to finalize(), indicates a bug -- POSSIBLE RESOURCE LEAK!!!  instance=12891777
   [junit4]   2> 662236 ERROR (Finalizer) [    ] o.a.s.c.CoreContainer CoreContainer was not close prior to finalize(), indicates a bug -- POSSIBLE RESOURCE LEAK!!!  instance=23023644
   [junit4]   2> 662236 ERROR (Finalizer) [    ] o.a.s.c.CoreContainer CoreContainer was not close prior to finalize(), indicates a bug -- POSSIBLE RESOURCE LEAK!!!  instance=14930483
   [junit4]   2> 662236 ERROR (Finalizer) [    ] o.a.s.c.CoreContainer CoreContainer was not close prior to finalize(), indicates a bug -- POSSIBLE RESOURCE LEAK!!!  instance=25319882
   [junit4]   2> 662236 ERROR (Finalizer) [    ] o.a.s.c.CoreContainer CoreContainer was not close prior to finalize(), indicates a bug -- POSSIBLE RESOURCE LEAK!!!  instance=9404997
   [junit4]   2> 662236 ERROR (Finalizer) [    ] o.a.s.c.CoreContainer CoreContainer was not close prior to finalize(), indicates a bug -- POSSIBLE RESOURCE LEAK!!!  instance=28702712
   [junit4]   2> 662236 ERROR (Finalizer) [    ] o.a.s.c.CoreContainer CoreContainer was not close prior to finalize(), indicates a bug -- POSSIBLE RESOURCE LEAK!!!  instance=17287479
   [junit4]   2> 662236 ERROR (Finalizer) [    ] o.a.s.c.CoreContainer CoreContainer was not close prior to finalize(), indicates a bug -- POSSIBLE RESOURCE LEAK!!!  instance=16028244
   [junit4]   2> 662236 ERROR (Finalizer) [    ] o.a.s.c.CoreContainer CoreContainer was not close prior to finalize(), indicates a bug -- POSSIBLE RESOURCE LEAK!!!  instance=12954853
   [junit4]   2> 662236 ERROR (Finalizer) [    ] o.a.s.c.CoreContainer CoreContainer was not close prior to finalize(), indicates a bug -- POSSIBLE RESOURCE LEAK!!!  instance=5606898
   [junit4]   2> 662236 ERROR (Finalizer) [    ] o.a.s.c.CoreContainer CoreContainer was not close prior to finalize(), indicates a bug -- POSSIBLE RESOURCE LEAK!!!  instance=30457150
   [junit4]   2> 662236 ERROR (Finalizer) [    ] o.a.s.c.CoreContainer CoreContainer was not close prior to finalize(), indicates a bug -- POSSIBLE RESOURCE LEAK!!!  instance=22609826
   [junit4]   2> 662236 ERROR (Finalizer) [    ] o.a.s.c.CoreContainer CoreContainer was not close prior to finalize(), indicates a bug -- POSSIBLE RESOURCE LEAK!!!  instance=3265256
   [junit4]   2> 662236 ERROR (Finalizer) [    ] o.a.s.c.CoreContainer CoreContainer was not close prior to finalize(), indicates a bug -- POSSIBLE RESOURCE LEAK!!!  instance=14411585
   [junit4]   2> 662236 ERROR (Finalizer) [    ] o.a.s.c.CoreContainer CoreContainer was not close prior to finalize(), indicates a bug -- POSSIBLE RESOURCE LEAK!!!  instance=13671273
   [junit4]   2> 662237 ERROR (Finalizer) [    ] o.a.s.c.CoreContainer CoreContainer was not close prior to finalize(), indicates a bug -- POSSIBLE RESOURCE LEAK!!!  instance=15458110
   [junit4]   2> 662237 ERROR (Finalizer) [    ] o.a.s.c.CoreContainer CoreContainer was not close prior to finalize(), indicates a bug -- POSSIBLE RESOURCE LEAK!!!  instance=5371545
   [junit4]   2> 662237 ERROR (Finalizer) [    ] o.a.s.c.CoreContainer CoreContainer was not close prior to finalize(), indicates a bug -- POSSIBLE RESOURCE LEAK!!!  instance=19785341
   [junit4]   2> 662237 ERROR (Finalizer) [    ] o.a.s.c.CoreContainer CoreContainer was not close prior to finalize(), indicates a bug -- POSSIBLE RESOURCE LEAK!!!  instance=30552866
   [junit4]   2> NOTE: test params are: codec=Asserting(Lucene70): {}, docValues:{}, maxPointsInLeafNode=826, maxMBSortInHeap=5.131145407085953, sim=RandomSimilarity(queryNorm=false): {}, locale=is-IS, timezone=America/Anchorage
   [junit4]   2> NOTE: Linux 4.15.0-42-generic i386/Oracle Corporation 1.8.0_172 (32-bit)/cpus=8,threads=1,free=250838560,total=518979584
   [junit4]   2> NOTE: All tests run in this JVM: [StatelessScriptUpdateProcessorFactoryTest, PeerSyncWithLeaderAndIndexFingerprintCachingTest, TestGraphTermsQParserPlugin, TestSimNodeAddedTrigger, ChaosMonkeySafeLeaderTest, UtilsToolTest, TestPartialUpdateDeduplication, ForceLeaderTest, TestBinaryField, HdfsDirectoryFactoryTest, CollectionsAPISolrJTest, AddReplicaTest, RandomizedTaggerTest, TestExceedMaxTermLength, SolrJmxReporterCloudTest, MultiThreadedOCPTest, SuggestComponentTest, UninvertDocValuesMergePolicyTest, TestSimpleTextCodec, TestCSVResponseWriter, ClassificationUpdateProcessorIntegrationTest, ParsingFieldUpdateProcessorsTest, DistributedFacetExistsSmallTest, TestCloudNestedDocsSort, TestFacetMethods, ShardRoutingCustomTest, NodeMarkersRegistrationTest, TestHalfAndHalfDocValues, SpellCheckComponentTest, QueryResultKeyTest, SolrCoreMetricManagerTest, TestWriterPerf, BlockJoinFacetRandomTest, CursorMarkTest, ImplicitSnitchTest, TestFuzzyAnalyzedSuggestions, CdcrRequestHandlerTest, TestSha256AuthenticationProvider, SuggesterFSTTest, TestHttpShardHandlerFactory, SpellCheckCollatorTest, CdcrBootstrapTest, TestDynamicFieldCollectionResource, DistributedIntervalFacetingTest, HdfsUnloadDistributedZkTest, TestPayloadCheckQParserPlugin, NumericFieldsTest, TestSubQueryTransformerDistrib, TestComplexPhraseLeadingWildcard, TestMinMaxOnMultiValuedField, TestSearchPerf, TestConfigSetImmutable, HdfsSyncSliceTest, TestRecoveryHdfs, ExternalFileFieldSortTest, SuggesterWFSTTest, RollingRestartTest, DateFieldTest, TestAuthenticationFramework, DirectSolrSpellCheckerTest, V2ApiIntegrationTest, TestInitQParser, TestSchemaVersionResource, TestJettySolrRunner, DistributedTermsComponentTest, SolrCloudReportersTest, TestMergePolicyConfig, BadCopyFieldTest, TestDistribDocBasedVersion, DistributedQueryElevationComponentTest, ByteBuffersDirectoryFactoryTest, SolrTestCaseJ4Test, TestCloudSchemaless, TestFieldResource, ConnectionManagerTest, TestRemoteStreaming, URLClassifyProcessorTest, ResourceLoaderTest, QueryEqualityTest, TestExtendedDismaxParser, SolrXmlInZkTest, HdfsDirectoryTest, TriggerSetPropertiesIntegrationTest, TestWithCollection, TestPullReplica, TestFilteredDocIdSet, SpatialFilterTest, OverseerTest, ScriptEngineTest]
   [junit4]   2> NOTE: reproduce with: ant test  -Dtestcase=ScriptEngineTest -Dtests.seed=EE1EE3B3FE2CB4D -Dtests.multiplier=3 -Dtests.slow=true -Dtests.badapples=true -Dtests.locale=is-IS -Dtests.timezone=America/Anchorage -Dtests.asserts=true -Dtests.file.encoding=ISO-8859-1
   [junit4] ERROR   0.00s J2 | ScriptEngineTest (suite) <<<
   [junit4]    > Throwable #1: java.lang.AssertionError: The test or suite printed 10008 bytes to stdout and stderr, even though the limit was set to 8192 bytes. Increase the limit with @Limit, ignore it completely with @SuppressSysoutChecks or run with -Dtests.verbose=true
   [junit4]    > 	at __randomizedtesting.SeedInfo.seed([EE1EE3B3FE2CB4D]:0)
   [junit4]    > 	at java.lang.Thread.run(Thread.java:748)
   [junit4] Completed [264/836 (1!)] on J2 in 0.26s, 6 tests, 1 failure, 1 skipped <<< FAILURES!

[...truncated 46904 lines...]
[repro] Jenkins log URL: https://jenkins.thetaphi.de/job/Lucene-Solr-BadApples-7.x-Linux/139/consoleText

[repro] Revision: bcf1a4eaf8d3b945f11833c9dfed4a17a6d6ac58

[repro] Repro line:  ant test  -Dtestcase=ScriptEngineTest -Dtests.seed=EE1EE3B3FE2CB4D -Dtests.multiplier=3 -Dtests.slow=true -Dtests.badapples=true -Dtests.locale=is-IS -Dtests.timezone=America/Anchorage -Dtests.asserts=true -Dtests.file.encoding=ISO-8859-1

[repro] ant clean

[...truncated 6 lines...]
[repro] Test suites by module:
[repro]    solr/core
[repro]       ScriptEngineTest
[repro] ant compile-test

[...truncated 3605 lines...]
[repro] ant test-nocompile -Dtests.dups=5 -Dtests.maxfailures=5 -Dtests.class="*.ScriptEngineTest" -Dtests.showOutput=onerror  -Dtests.seed=EE1EE3B3FE2CB4D -Dtests.multiplier=3 -Dtests.slow=true -Dtests.badapples=true -Dtests.locale=is-IS -Dtests.timezone=America/Anchorage -Dtests.asserts=true -Dtests.file.encoding=ISO-8859-1

[...truncated 100 lines...]
[repro] Failures:
[repro]   0/5 failed: org.apache.solr.update.processor.ScriptEngineTest
[repro] Exiting with code 0

[...truncated 40 lines...]