You are viewing a plain text version of this content. The canonical link for it is here.
Posted to builds@solr.apache.org by Apache Jenkins Server <je...@builds.apache.org> on 2026/09/28 22:11:03 UTC

[JENKINS] Solr » Solr-Test-main - Build # 14973 - Failure!

Build: https://ci-builds.apache.org/job/Solr/job/Solr-Test-main/14973/

1 tests failed.
FAILED:  org.apache.solr.crossdc.manager.ZkConfigIntegrationTest.classMethod

Error Message:
com.carrotsearch.randomizedtesting.ThreadLeakError: 2 threads leaked from SUITE scope at org.apache.solr.crossdc.manager.ZkConfigIntegrationTest: 
   1) Thread[id=412, name=Curator-Framework-0, state=TIMED_WAITING, group=TGRP-ZkConfigIntegrationTest]
        at java.base/jdk.internal.misc.Unsafe.park(Native Method)
        at java.base/java.util.concurrent.locks.LockSupport.parkNanos(LockSupport.java:269)
        at java.base/java.util.concurrent.locks.AbstractQueuedSynchronizer$ConditionObject.awaitNanos(AbstractQueuedSynchronizer.java:1797)
        at java.base/java.util.concurrent.DelayQueue.take(DelayQueue.java:254)
        at java.base/java.util.concurrent.DelayQueue.take(DelayQueue.java:100)
        at org.apache.curator.framework.imps.CuratorFrameworkImpl.backgroundOperationsLoop(CuratorFrameworkImpl.java:796)
        at org.apache.curator.framework.imps.CuratorFrameworkImpl.access$300(CuratorFrameworkImpl.java:77)
        at org.apache.curator.framework.imps.CuratorFrameworkImpl$4.call(CuratorFrameworkImpl.java:320)
        at java.base/java.util.concurrent.FutureTask.run(FutureTask.java:317)
        at java.base/java.util.concurrent.ScheduledThreadPoolExecutor$ScheduledFutureTask.run(ScheduledThreadPoolExecutor.java:304)
        at java.base/java.util.concurrent.ThreadPoolExecutor.runWorker(ThreadPoolExecutor.java:1144)
        at java.base/java.util.concurrent.ThreadPoolExecutor$Worker.run(ThreadPoolExecutor.java:642)
        at java.base/java.lang.Thread.run(Thread.java:1583)
   2) Thread[id=409, name=Curator-ConnectionStateManager-0, state=TIMED_WAITING, group=TGRP-ZkConfigIntegrationTest]
        at java.base/jdk.internal.misc.Unsafe.park(Native Method)
        at java.base/java.util.concurrent.locks.LockSupport.parkNanos(LockSupport.java:269)
        at java.base/java.util.concurrent.locks.AbstractQueuedSynchronizer$ConditionObject.awaitNanos(AbstractQueuedSynchronizer.java:1797)
        at java.base/java.util.concurrent.ArrayBlockingQueue.poll(ArrayBlockingQueue.java:435)
        at org.apache.curator.framework.state.ConnectionStateManager.processEvents(ConnectionStateManager.java:246)
        at org.apache.curator.framework.state.ConnectionStateManager.lambda$start$0(ConnectionStateManager.java:127)
        at java.base/java.util.concurrent.FutureTask.run(FutureTask.java:317)
        at java.base/java.util.concurrent.ThreadPoolExecutor.runWorker(ThreadPoolExecutor.java:1144)
        at java.base/java.util.concurrent.ThreadPoolExecutor$Worker.run(ThreadPoolExecutor.java:642)
        at java.base/java.lang.Thread.run(Thread.java:1583)

Stack Trace:
com.carrotsearch.randomizedtesting.ThreadLeakError: 2 threads leaked from SUITE scope at org.apache.solr.crossdc.manager.ZkConfigIntegrationTest: 
   1) Thread[id=412, name=Curator-Framework-0, state=TIMED_WAITING, group=TGRP-ZkConfigIntegrationTest]
        at java.base/jdk.internal.misc.Unsafe.park(Native Method)
        at java.base/java.util.concurrent.locks.LockSupport.parkNanos(LockSupport.java:269)
        at java.base/java.util.concurrent.locks.AbstractQueuedSynchronizer$ConditionObject.awaitNanos(AbstractQueuedSynchronizer.java:1797)
        at java.base/java.util.concurrent.DelayQueue.take(DelayQueue.java:254)
        at java.base/java.util.concurrent.DelayQueue.take(DelayQueue.java:100)
        at org.apache.curator.framework.imps.CuratorFrameworkImpl.backgroundOperationsLoop(CuratorFrameworkImpl.java:796)
        at org.apache.curator.framework.imps.CuratorFrameworkImpl.access$300(CuratorFrameworkImpl.java:77)
        at org.apache.curator.framework.imps.CuratorFrameworkImpl$4.call(CuratorFrameworkImpl.java:320)
        at java.base/java.util.concurrent.FutureTask.run(FutureTask.java:317)
        at java.base/java.util.concurrent.ScheduledThreadPoolExecutor$ScheduledFutureTask.run(ScheduledThreadPoolExecutor.java:304)
        at java.base/java.util.concurrent.ThreadPoolExecutor.runWorker(ThreadPoolExecutor.java:1144)
        at java.base/java.util.concurrent.ThreadPoolExecutor$Worker.run(ThreadPoolExecutor.java:642)
        at java.base/java.lang.Thread.run(Thread.java:1583)
   2) Thread[id=409, name=Curator-ConnectionStateManager-0, state=TIMED_WAITING, group=TGRP-ZkConfigIntegrationTest]
        at java.base/jdk.internal.misc.Unsafe.park(Native Method)
        at java.base/java.util.concurrent.locks.LockSupport.parkNanos(LockSupport.java:269)
        at java.base/java.util.concurrent.locks.AbstractQueuedSynchronizer$ConditionObject.awaitNanos(AbstractQueuedSynchronizer.java:1797)
        at java.base/java.util.concurrent.ArrayBlockingQueue.poll(ArrayBlockingQueue.java:435)
        at org.apache.curator.framework.state.ConnectionStateManager.processEvents(ConnectionStateManager.java:246)
        at org.apache.curator.framework.state.ConnectionStateManager.lambda$start$0(ConnectionStateManager.java:127)
        at java.base/java.util.concurrent.FutureTask.run(FutureTask.java:317)
        at java.base/java.util.concurrent.ThreadPoolExecutor.runWorker(ThreadPoolExecutor.java:1144)
        at java.base/java.util.concurrent.ThreadPoolExecutor$Worker.run(ThreadPoolExecutor.java:642)
        at java.base/java.lang.Thread.run(Thread.java:1583)
	at __randomizedtesting.SeedInfo.seed([70BC127F4429CBD9]:0)




Build Log:
[...truncated 11 lines...]
ERROR: Workspace has a .git repository, but it appears to be corrupt.
hudson.plugins.git.GitException: Command "git rev-parse --resolve-git-dir /home/jenkins/jenkins-agent/workspace/Solr/Solr-Test-main/.git" returned status code 128:
stdout: 
stderr: fatal: not a gitdir '/home/jenkins/jenkins-agent/workspace/Solr/Solr-Test-main/.git'

	at PluginClassLoader for git-client//org.jenkinsci.plugins.gitclient.CliGitAPIImpl.launchCommandIn(CliGitAPIImpl.java:2848)
	at PluginClassLoader for git-client//org.jenkinsci.plugins.gitclient.CliGitAPIImpl.launchCommandIn(CliGitAPIImpl.java:2768)
	at PluginClassLoader for git-client//org.jenkinsci.plugins.gitclient.CliGitAPIImpl.launchCommandIn(CliGitAPIImpl.java:2763)
	at PluginClassLoader for git-client//org.jenkinsci.plugins.gitclient.CliGitAPIImpl.launchCommand(CliGitAPIImpl.java:2052)
	at PluginClassLoader for git-client//org.jenkinsci.plugins.gitclient.CliGitAPIImpl.launchCommand(CliGitAPIImpl.java:2064)
	at PluginClassLoader for git-client//org.jenkinsci.plugins.gitclient.CliGitAPIImpl.hasGitRepo(CliGitAPIImpl.java:404)
	at PluginClassLoader for git-client//hudson.plugins.git.GitAPI.hasGitRepo(GitAPI.java:281)
	at jdk.internal.reflect.GeneratedMethodAccessor34.invoke(Unknown Source)
	at java.base/jdk.internal.reflect.DelegatingMethodAccessorImpl.invoke(DelegatingMethodAccessorImpl.java:43)
	at java.base/java.lang.reflect.Method.invoke(Method.java:569)
	at hudson.remoting.RemoteInvocationHandler$RPCRequest.perform(RemoteInvocationHandler.java:986)
	at hudson.remoting.RemoteInvocationHandler$RPCRequest.call(RemoteInvocationHandler.java:961)
	at hudson.remoting.RemoteInvocationHandler$RPCRequest.call(RemoteInvocationHandler.java:907)
	at hudson.remoting.UserRequest.perform(UserRequest.java:225)
	at hudson.remoting.UserRequest.perform(UserRequest.java:50)
	at hudson.remoting.Request$2.run(Request.java:391)
	at hudson.remoting.InterceptingExecutorService.lambda$wrap$0(InterceptingExecutorService.java:81)
	at java.base/java.util.concurrent.FutureTask.run(FutureTask.java:264)
	at java.base/java.util.concurrent.ThreadPoolExecutor.runWorker(ThreadPoolExecutor.java:1136)
	at java.base/java.util.concurrent.ThreadPoolExecutor$Worker.run(ThreadPoolExecutor.java:635)
	at java.base/java.lang.Thread.run(Thread.java:840)
Cloning the remote Git repository
Cloning repository https://gitbox.apache.org/repos/asf/solr.git
 > git init /home/jenkins/jenkins-agent/workspace/Solr/Solr-Test-main # timeout=10
Fetching upstream changes from https://gitbox.apache.org/repos/asf/solr.git
 > git --version # timeout=10
 > git --version # 'git version 2.43.0'
 > git fetch --tags --force --progress -- https://gitbox.apache.org/repos/asf/solr.git +refs/heads/*:refs/remotes/origin/* # timeout=10
 > git config remote.origin.url https://gitbox.apache.org/repos/asf/solr.git # timeout=10
 > git config --add remote.origin.fetch +refs/heads/*:refs/remotes/origin/* # timeout=10
Avoid second fetch
 > git rev-parse refs/remotes/origin/main^{commit} # timeout=10
Checking out Revision 634be2a1c1358363fd6110b6502e094027a704e4 (refs/remotes/origin/main)
 > git config core.sparsecheckout # timeout=10
 > git checkout -f 634be2a1c1358363fd6110b6502e094027a704e4 # timeout=10
 > git branch -a -v --no-abbrev # timeout=10
 > git checkout -b main 634be2a1c1358363fd6110b6502e094027a704e4 # timeout=10
Commit message: "Update release scripts (#4956)"
 > git rev-list --no-walk bcd23b98f2796736202680f37636db025a44e2cc # timeout=10
No emails were triggered.
provisioning config files...
copy managed file [gradle.properties] to file:/home/jenkins/jenkins-agent/workspace/Solr/Solr-Test-main/gradle.properties
[Gradle] - Launching build.
[Solr-Test-main] $ /home/jenkins/jenkins-agent/workspace/Solr/Solr-Test-main/gradlew -Dtests.haltonfailure=false -Dtests.badapples=false --continue test
Downloading gradle-wrapper.jar from https://raw.githubusercontent.com/gradle/gradle/v8.10.2/gradle/wrapper/gradle-wrapper.jar
To honour the JVM settings for this build a single-use Daemon process will be forked. For more on this, please refer to https://docs.gradle.org/9.7.0/userguide/gradle_daemon.html#sec:disabling_the_daemon in the Gradle documentation.
Daemon will be stopped at the end of the build 

> Task :build-infra:compileJava
Note: /home/jenkins/jenkins-agent/workspace/Solr/Solr-Test-main/build-tools/build-infra/src/main/java/org/apache/lucene/gradle/Checksum.java uses or overrides a deprecated API.
Note: Recompile with -Xlint:deprecation for details.

> Task :build-infra:pluginDescriptors
> Task :build-infra:processResources
> Task :build-infra:classes
> Task :build-infra:jar

> Configure project :solr:webapp
WARNING: gradle.properties is missing solr.ui.commit and is not configured to build UI from source; falling back to build from source.

> Task :gitStatus
> Task :checkJdkInternalsExportedToGradle

> Task :solr:api:compileJava
Note: Some input files use or override a deprecated API.
Note: Recompile with -Xlint:deprecation for details.

> Task :solr:api:processResources NO-SOURCE
> Task :solr:api:classes
> Task :solr:api:jar

> Task :randomizationInfo
Running tests with randomization seed: tests.seed=70BC127F4429CBD9

> Task :solr:api:resolve
> Task :solr:api:processTestResources
> Task :solr:core:processResources
> Task :solr:solrj:processResources
> Task :solr:solrj-jetty:processResources NO-SOURCE
> Task :solr:solrj-streaming:processResources
> Task :solr:solrj-zookeeper:processResources NO-SOURCE
> Task :solr:test-framework:processResources
> Task :solr:benchmark:processResources
> Task :solr:benchmark:processTestResources
> Task :solr:core:processTestResources
> Task :solr:modules:analysis-extras:processResources NO-SOURCE
> Task :solr:cross-dc-manager:processResources NO-SOURCE
> Task :solr:cross-dc-manager:processTestResources
> Task :solr:modules:cross-dc:processResources NO-SOURCE
> Task :solr:modules:opentelemetry:processResources NO-SOURCE
> Task :solr:server:compileJava SKIPPED
> Task :solr:server:processResources NO-SOURCE
> Task :solr:server:classes UP-TO-DATE
> Task :solr:server:compileTestJava NO-SOURCE
> Task :solr:server:processTestResources NO-SOURCE
> Task :solr:server:testClasses UP-TO-DATE
> Task :solr:server:test NO-SOURCE
> Task :solr:server:wipeTaskTemp
> Task :solr:solr-ref-guide:compileJava NO-SOURCE
> Task :solr:solr-ref-guide:processResources NO-SOURCE
> Task :solr:solr-ref-guide:classes UP-TO-DATE
> Task :solr:solr-ref-guide:copySolrjTestResources
> Task :solr:solr-ref-guide:processTestResources NO-SOURCE
> Task :solr:modules:sql:processResources
> Task :solr:solrj:processTestResources
> Task :solr:solrj-jetty:processTestResources
> Task :solr:solrj-streaming:processTestResources
> Task :solr:solrj-zookeeper:processTestResources
> Task :solr:test-framework:processTestResources

> Task :solr:solrj:openApiGenerate
Cleaned up output directory /home/jenkins/jenkins-agent/workspace/Solr/Solr-Test-main/solr/solrj/build/generated before code generation.
[openApiGenerate] Worker isolation: classloader (fast startup, but generator classes accumulate in Gradle daemon Metaspace - consider workerIsolation = "process" if you hit metaspace pressure)
File (reserved word) cannot be used as model name. Renamed to ModelFile
############################################################################################
# Thanks for using OpenAPI Generator.                                                      #
# We appreciate your support! Please consider donating to help us maintain this project.   #
# https://opencollective.com/openapi_generator/donate                                      #
############################################################################################
Successfully generated code to /home/jenkins/jenkins-agent/workspace/Solr/Solr-Test-main/solr/solrj/build/generated
Type-safe project accessors is an incubating feature.
> Task :kotlinWasmKotlinNpmCachesSetup
> Task :kotlinWasmNodeJsSetup
> Task :kotlinWasmRestoreYarnLock
> Task :kotlinWasmYarnSetup
> Task :shared:wasmJsPackageJson
> Task :shared:wasmJsTestPackageJson
> Task :webApp:wasmJsPackageJson
> Task :webApp:wasmJsTestPackageJson
> Task :shared:wasmJsPublicPackageJson
> Task :shared:wasmJsTestPublicPackageJson
> Task :webApp:wasmJsPublicPackageJson
> Task :webApp:wasmJsTestPublicPackageJson
> Task :kotlinWasmPackageJsonUmbrella
> Task :wasmRootPackageJson
> Task :kotlinWasmNpmInstall
> Task :kotlinWasmToolingSetup
> Task :kotlinWasmStoreYarnLock
> Task :shared:convertXmlValueResourcesForCommonMain
> Task :shared:copyNonXmlValueResourcesForCommonMain
> Task :shared:prepareComposeResourcesTaskForCommonMain
> Task :shared:convertXmlValueResourcesForWasmJsMain NO-SOURCE
> Task :shared:copyNonXmlValueResourcesForWasmJsMain NO-SOURCE
> Task :shared:prepareComposeResourcesTaskForWasmJsMain NO-SOURCE
> Task :shared:convertXmlValueResourcesForWebMain NO-SOURCE
> Task :shared:copyNonXmlValueResourcesForWebMain NO-SOURCE
> Task :shared:prepareComposeResourcesTaskForWebMain NO-SOURCE
> Task :shared:assembleWasmJsMainResources
> Task :shared:wasmJsCopyHierarchicalMultiplatformResources
> Task :shared:wasmJsZipMultiplatformResourcesForPublication
> Task :webApp:wasmJsResolveResourcesFromDependencies
> Task :webApp:convertXmlValueResourcesForCommonMain NO-SOURCE
> Task :webApp:copyNonXmlValueResourcesForCommonMain NO-SOURCE
> Task :webApp:prepareComposeResourcesTaskForCommonMain NO-SOURCE
> Task :webApp:convertXmlValueResourcesForWasmJsMain NO-SOURCE
> Task :webApp:copyNonXmlValueResourcesForWasmJsMain NO-SOURCE
> Task :webApp:prepareComposeResourcesTaskForWasmJsMain NO-SOURCE
> Task :webApp:convertXmlValueResourcesForWebMain NO-SOURCE
> Task :webApp:copyNonXmlValueResourcesForWebMain NO-SOURCE
> Task :webApp:prepareComposeResourcesTaskForWebMain NO-SOURCE
> Task :webApp:assembleWasmJsMainResources
> Task :webApp:wasmJsResolveSelfResourcesCopyHierarchicalMultiplatformResources
> Task :webApp:wasmJsAggregateResources
> Task :webApp:wasmJsProcessResources
> Task :shared:kmpPartiallyResolvedDependenciesChecker
> Task :shared:checkKotlinGradlePluginConfigurationErrors SKIPPED
> Task :shared:checkWasmJsMainComposeLibrariesCompatibility
> Task :shared:generateResourceAccessorsForCommonMain
> Task :shared:generateResourceAccessorsForWasmJsMain NO-SOURCE
> Task :shared:generateResourceAccessorsForWebMain NO-SOURCE
> Task :shared:generateActualResourceCollectorsForWasmJsMain
> Task :shared:generateComposeResClass
> Task :shared:generateExpectResourceCollectorsForCommonMain
> Task :shared:compileKotlinWasmJs FROM-CACHE
> Task :webApp:kmpPartiallyResolvedDependenciesChecker
> Task :webApp:checkKotlinGradlePluginConfigurationErrors SKIPPED
> Task :webApp:checkWasmJsMainComposeLibrariesCompatibility
> Task :webApp:generateResourceAccessorsForCommonMain SKIPPED
> Task :webApp:generateResourceAccessorsForWasmJsMain SKIPPED
> Task :webApp:generateResourceAccessorsForWebMain SKIPPED
> Task :webApp:generateActualResourceCollectorsForWasmJsMain SKIPPED
> Task :webApp:generateComposeResClass SKIPPED
> Task :webApp:generateExpectResourceCollectorsForCommonMain SKIPPED
> Task :webApp:compileKotlinWasmJs FROM-CACHE
> Task :webApp:wasmJsMainClasses
> Task :webApp:compileProductionExecutableKotlinWasmJs FROM-CACHE
> Task :webApp:kotlinWasmBinaryenSetup

> Task :solr:webapp:buildUiFromSource

> Task :webApp:compileProductionExecutableKotlinWasmJsOptimize
> Task :webApp:unpackSkikoWasmRuntime
> Task :webApp:processSkikoRuntimeForKWasm
> Task :webApp:wasmJsProductionExecutableCompileSync
> Task :webApp:wasmJsBrowserProductionWebpack FROM-CACHE
> Task :webApp:wasmJsBrowserDistribution

BUILD SUCCESSFUL in 1m 22s
45 actionable tasks: 41 executed, 4 from cache

> Task :solr:solrj:generatedSpotlessHelper
> Task :solr:solrj:generatedSpotless

> Task :solr:solrj:compileJava
Note: Some input files use or override a deprecated API.
Note: Recompile with -Xlint:deprecation for details.

> Task :solr:solrj-jetty:compileJava
Note: /home/jenkins/jenkins-agent/workspace/Solr/Solr-Test-main/solr/solrj-jetty/src/java/org/apache/solr/client/solrj/jetty/HttpJettySolrClient.java uses or overrides a deprecated API.
Note: Recompile with -Xlint:deprecation for details.

> Task :solr:solrj-streaming:compileJava
Note: Some input files use or override a deprecated API.
Note: Recompile with -Xlint:deprecation for details.

> Task :solr:solrj-zookeeper:compileJava
> Task :solr:core:compileJava
Note: Some input files use or override a deprecated API.
Note: Recompile with -Xlint:deprecation for details.

> Task :solr:test-framework:compileJava
Note: Some input files use or override a deprecated API.
Note: Recompile with -Xlint:deprecation for details.

> Task :solr:api:compileTestJava
> Task :solr:api:testClasses
> Task :solr:core:classes
> Task :solr:core:jar
> Task :solr:solrj:classes
> Task :solr:solrj:jar
> Task :solr:solrj-jetty:classes
> Task :solr:solrj-jetty:jar
> Task :solr:solrj-streaming:classes
> Task :solr:solrj-streaming:jar
> Task :solr:solrj-zookeeper:classes
> Task :solr:solrj-zookeeper:jar
> Task :solr:test-framework:classes
> Task :solr:test-framework:jar

> Task :solr:api:test
WARNING: Using incubator modules: jdk.incubator.vector
WARNING: Using incubator modules: jdk.incubator.vector
WARNING: A command line option has enabled the Security Manager
WARNING: The Security Manager is deprecated and will be removed in a future release
WARNING: A command line option has enabled the Security Manager
WARNING: The Security Manager is deprecated and will be removed in a future release
java.security.policy: error adding Permission, java.net.URLPermission:
	java.util.ServiceConfigurationError: Locale provider adapter "CLDR"cannot be instantiated.
java.security.policy: error adding Permission, java.net.URLPermission:
	java.util.ServiceConfigurationError: Locale provider adapter "CLDR"cannot be instantiated.
java.security.policy: error adding Permission, java.net.URLPermission:
	java.util.ServiceConfigurationError: Locale provider adapter "CLDR"cannot be instantiated.
java.security.policy: error adding Permission, java.net.URLPermission:
	java.util.ServiceConfigurationError: Locale provider adapter "CLDR"cannot be instantiated.
java.security.policy: error adding Permission, java.net.URLPermission:
	java.util.ServiceConfigurationError: Locale provider adapter "CLDR"cannot be instantiated.
java.security.policy: error adding Permission, java.net.URLPermission:
	java.util.ServiceConfigurationError: Locale provider adapter "CLDR"cannot be instantiated.
java.security.policy: error adding Permission, java.net.URLPermission:
	java.util.ServiceConfigurationError: Locale provider adapter "CLDR"cannot be instantiated.
java.security.policy: error adding Permission, java.net.URLPermission:
	java.util.ServiceConfigurationError: Locale provider adapter "CLDR"cannot be instantiated.
java.security.policy: error adding Permission, java.net.URLPermission:
	java.util.ServiceConfigurationError: Locale provider adapter "CLDR"cannot be instantiated.
java.security.policy: error adding Permission, java.net.URLPermission:
	java.util.ServiceConfigurationError: Locale provider adapter "CLDR"cannot be instantiated.
:solr:api:test (SUCCESS): 19 test(s)

> Task :solr:api:wipeTaskTemp
> Task :solr:benchmark:compileJava
> Task :solr:benchmark:classes
> Task :solr:benchmark:compileTestJava
> Task :solr:benchmark:testClasses

> Task :solr:benchmark:test
WARNING: Using incubator modules: jdk.incubator.vector
WARNING: Using incubator modules: jdk.incubator.vector
WARNING: Using incubator modules: jdk.incubator.vector
WARNING: A command line option has enabled the Security Manager
WARNING: The Security Manager is deprecated and will be removed in a future release
WARNING: A command line option has enabled the Security Manager
WARNING: The Security Manager is deprecated and will be removed in a future release
WARNING: A command line option has enabled the Security Manager
WARNING: The Security Manager is deprecated and will be removed in a future release
java.security.policy: error adding Permission, java.net.URLPermission:
	java.util.ServiceConfigurationError: Locale provider adapter "CLDR"cannot be instantiated.
java.security.policy: error adding Permission, java.net.URLPermission:
	java.util.ServiceConfigurationError: Locale provider adapter "CLDR"cannot be instantiated.
java.security.policy: error adding Permission, java.net.URLPermission:
	java.util.ServiceConfigurationError: Locale provider adapter "CLDR"cannot be instantiated.
java.security.policy: error adding Permission, java.net.URLPermission:
	java.util.ServiceConfigurationError: Locale provider adapter "CLDR"cannot be instantiated.
java.security.policy: error adding Permission, java.net.URLPermission:
	java.util.ServiceConfigurationError: Locale provider adapter "CLDR"cannot be instantiated.
java.security.policy: error adding Permission, java.net.URLPermission:
	java.util.ServiceConfigurationError: Locale provider adapter "CLDR"cannot be instantiated.
java.security.policy: error adding Permission, java.net.URLPermission:
	java.util.ServiceConfigurationError: Locale provider adapter "CLDR"cannot be instantiated.
java.security.policy: error adding Permission, java.net.URLPermission:
	java.util.ServiceConfigurationError: Locale provider adapter "CLDR"cannot be instantiated.
java.security.policy: error adding Permission, java.net.URLPermission:
	java.util.ServiceConfigurationError: Locale provider adapter "CLDR"cannot be instantiated.
java.security.policy: error adding Permission, java.net.URLPermission:
	java.util.ServiceConfigurationError: Locale provider adapter "CLDR"cannot be instantiated.
java.security.policy: error adding Permission, java.net.URLPermission:
	java.util.ServiceConfigurationError: Locale provider adapter "CLDR"cannot be instantiated.
java.security.policy: error adding Permission, java.net.URLPermission:
	java.util.ServiceConfigurationError: Locale provider adapter "CLDR"cannot be instantiated.
java.security.policy: error adding Permission, java.net.URLPermission:
	java.util.ServiceConfigurationError: Locale provider adapter "CLDR"cannot be instantiated.
java.security.policy: error adding Permission, java.net.URLPermission:
	java.util.ServiceConfigurationError: Locale provider adapter "CLDR"cannot be instantiated.
java.security.policy: error adding Permission, java.net.URLPermission:
	java.util.ServiceConfigurationError: Locale provider adapter "CLDR"cannot be instantiated.
:solr:benchmark:test (SUCCESS): 10 test(s)

> Task :solr:benchmark:wipeTaskTemp
> Task :solr:core:compileTestJava
Note: Some input files use or override a deprecated API.
Note: Recompile with -Xlint:deprecation for details.

> Task :solr:core:testClasses

> Task :solr:modules:analysis-extras:compileJava
Note: /home/jenkins/jenkins-agent/workspace/Solr/Solr-Test-main/solr/modules/analysis-extras/src/java/org/apache/solr/schema/ICUCollationField.java uses or overrides a deprecated API.
Note: Recompile with -Xlint:deprecation for details.

> Task :solr:modules:analysis-extras:classes
> Task :solr:modules:analysis-extras:jar

> Task :solr:core:test
WARNING: Using incubator modules: jdk.incubator.vector
WARNING: Using incubator modules: jdk.incubator.vector
WARNING: Using incubator modules: jdk.incubator.vector
WARNING: Using incubator modules: jdk.incubator.vector
WARNING: A command line option has enabled the Security Manager
WARNING: The Security Manager is deprecated and will be removed in a future release
WARNING: A command line option has enabled the Security Manager
WARNING: The Security Manager is deprecated and will be removed in a future release
WARNING: A command line option has enabled the Security Manager
WARNING: The Security Manager is deprecated and will be removed in a future release
WARNING: A command line option has enabled the Security Manager
WARNING: The Security Manager is deprecated and will be removed in a future release
java.security.policy: error adding Permission, java.net.URLPermission:
java.security.policy: error adding Permission, java.net.URLPermission:
	java.util.ServiceConfigurationError: Locale provider adapter "CLDR"cannot be instantiated.
	java.util.ServiceConfigurationError: Locale provider adapter "CLDR"cannot be instantiated.
java.security.policy: error adding Permission, java.net.URLPermission:
java.security.policy: error adding Permission, java.net.URLPermission:
	java.util.ServiceConfigurationError: Locale provider adapter "CLDR"cannot be instantiated.
	java.util.ServiceConfigurationError: Locale provider adapter "CLDR"cannot be instantiated.
java.security.policy: error adding Permission, java.net.URLPermission:
	java.util.ServiceConfigurationError: Locale provider adapter "CLDR"cannot be instantiated.
java.security.policy: error adding Permission, java.net.URLPermission:
	java.util.ServiceConfigurationError: Locale provider adapter "CLDR"cannot be instantiated.
java.security.policy: error adding Permission, java.net.URLPermission:
	java.util.ServiceConfigurationError: Locale provider adapter "CLDR"cannot be instantiated.
java.security.policy: error adding Permission, java.net.URLPermission:
	java.util.ServiceConfigurationError: Locale provider adapter "CLDR"cannot be instantiated.
java.security.policy: error adding Permission, java.net.URLPermission:
	java.util.ServiceConfigurationError: Locale provider adapter "CLDR"cannot be instantiated.
java.security.policy: error adding Permission, java.net.URLPermission:
	java.util.ServiceConfigurationError: Locale provider adapter "CLDR"cannot be instantiated.
java.security.policy: error adding Permission, java.net.URLPermission:
	java.util.ServiceConfigurationError: Locale provider adapter "CLDR"cannot be instantiated.
java.security.policy: error adding Permission, java.net.URLPermission:
	java.util.ServiceConfigurationError: Locale provider adapter "CLDR"cannot be instantiated.
java.security.policy: error adding Permission, java.net.URLPermission:
	java.util.ServiceConfigurationError: Locale provider adapter "CLDR"cannot be instantiated.
java.security.policy: error adding Permission, java.net.URLPermission:
	java.util.ServiceConfigurationError: Locale provider adapter "CLDR"cannot be instantiated.
java.security.policy: error adding Permission, java.net.URLPermission:
	java.util.ServiceConfigurationError: Locale provider adapter "CLDR"cannot be instantiated.
java.security.policy: error adding Permission, java.net.URLPermission:
	java.util.ServiceConfigurationError: Locale provider adapter "CLDR"cannot be instantiated.
java.security.policy: error adding Permission, java.net.URLPermission:
	java.util.ServiceConfigurationError: Locale provider adapter "CLDR"cannot be instantiated.
java.security.policy: error adding Permission, java.net.URLPermission:
	java.util.ServiceConfigurationError: Locale provider adapter "CLDR"cannot be instantiated.
java.security.policy: error adding Permission, java.net.URLPermission:
	java.util.ServiceConfigurationError: Locale provider adapter "CLDR"cannot be instantiated.
java.security.policy: error adding Permission, java.net.URLPermission:
	java.util.ServiceConfigurationError: Locale provider adapter "CLDR"cannot be instantiated.
WARNING: Test org.apache.solr.TestRandomDVFaceting wrote 11,545,091 bytes of output.
WARNING: Test org.apache.solr.TestRandomFaceting wrote 28,300,534 bytes of output.

[87.560s][warning][jfr,system] Could not initialize JDK events. access denied ("java.lang.RuntimePermission" "accessClassInPackage.jdk.internal.event")
[386.092s][warning][jfr,system] Could not initialize JDK events. access denied ("java.lang.RuntimePermission" "accessClassInPackage.jdk.internal.event")

> Task :solr:core:test
WARNING: Test org.apache.solr.cloud.TestStressCloudBlindAtomicUpdates wrote 12,142,137 bytes of output.
WARNING: Test org.apache.solr.cloud.TestRandomFlRTGCloud wrote 34,002,314 bytes of output.
WARNING: Test org.apache.solr.search.TestRangeQuery wrote 16,496,325 bytes of output.

[959.589s][warning][jfr,system] Could not initialize JDK events. access denied ("java.lang.RuntimePermission" "accessClassInPackage.jdk.internal.event")

> Task :solr:core:test
WARNING: Test org.apache.solr.schema.DocValuesTest wrote 10,729,098 bytes of output.
WARNING: Test org.apache.solr.search.facet.TestCloudJSONFacetSKG wrote 14,631,356 bytes of output.
WARNING: Test org.apache.solr.search.TestRandomCollapseQParserPlugin wrote 18,290,961 bytes of output.
WARNING: Test org.apache.solr.update.TestInPlaceUpdatesStandalone wrote 21,961,300 bytes of output.
WARNING: Test org.apache.solr.search.facet.TestCloudJSONFacetSKGEquiv wrote 16,799,798 bytes of output.

[1468.623s][warning][jfr,system] Could not initialize JDK events. access denied ("java.lang.RuntimePermission" "accessClassInPackage.jdk.internal.event")

> Task :solr:core:test
:solr:core:test (SUCCESS): 5865 test(s), 272 skipped

> Task :solr:core:wipeTaskTemp

> Task :solr:modules:cross-dc:compileJava
Note: Some input files use or override a deprecated API.
Note: Recompile with -Xlint:deprecation for details.

> Task :solr:modules:opentelemetry:compileJava

> Task :solr:cross-dc-manager:compileJava
Note: /home/jenkins/jenkins-agent/workspace/Solr/Solr-Test-main/solr/cross-dc-manager/src/java/org/apache/solr/crossdc/manager/messageprocessor/SolrMessageProcessor.java uses or overrides a deprecated API.
Note: Recompile with -Xlint:deprecation for details.

> Task :solr:cross-dc-manager:classes

> Task :solr:cross-dc-manager:compileTestJava
Note: /home/jenkins/jenkins-agent/workspace/Solr/Solr-Test-main/solr/cross-dc-manager/src/test/org/apache/solr/crossdc/manager/consumer/KafkaCrossDcConsumerTest.java uses or overrides a deprecated API.
Note: Recompile with -Xlint:deprecation for details.

> Task :solr:cross-dc-manager:testClasses
> Task :solr:modules:cross-dc:classes
> Task :solr:modules:cross-dc:jar
> Task :solr:modules:opentelemetry:classes
> Task :solr:modules:opentelemetry:jar
OpenJDK 64-Bit Server VM warning: Sharing is only supported for boot loader classes because bootstrap classpath has been appended
OpenJDK 64-Bit Server VM warning: Sharing is only supported for boot loader classes because bootstrap classpath has been appended

> Task :solr:cross-dc-manager:test
WARNING: Using incubator modules: jdk.incubator.vector
WARNING: Using incubator modules: jdk.incubator.vector
WARNING: Using incubator modules: jdk.incubator.vector
WARNING: Using incubator modules: jdk.incubator.vector

OpenJDK 64-Bit Server VM warning: Sharing is only supported for boot loader classes because bootstrap classpath has been appended

> Task :solr:cross-dc-manager:test
WARNING: Test org.apache.solr.crossdc.manager.consumer.KafkaCrossDcConsumerTest wrote 22,296,090 bytes of output.

OpenJDK 64-Bit Server VM warning: Sharing is only supported for boot loader classes because bootstrap classpath has been appended

> Task :solr:cross-dc-manager:test

ZkConfigIntegrationTest > classMethod FAILED
    com.carrotsearch.randomizedtesting.ThreadLeakError: 2 threads leaked from SUITE scope at org.apache.solr.crossdc.manager.ZkConfigIntegrationTest: 
       1) Thread[id=412, name=Curator-Framework-0, state=TIMED_WAITING, group=TGRP-ZkConfigIntegrationTest]
            at java.base/jdk.internal.misc.Unsafe.park(Native Method)
            at java.base/java.util.concurrent.locks.LockSupport.parkNanos(LockSupport.java:269)
            at java.base/java.util.concurrent.locks.AbstractQueuedSynchronizer$ConditionObject.awaitNanos(AbstractQueuedSynchronizer.java:1797)
            at java.base/java.util.concurrent.DelayQueue.take(DelayQueue.java:254)
            at java.base/java.util.concurrent.DelayQueue.take(DelayQueue.java:100)
            at org.apache.curator.framework.imps.CuratorFrameworkImpl.backgroundOperationsLoop(CuratorFrameworkImpl.java:796)
            at org.apache.curator.framework.imps.CuratorFrameworkImpl.access$300(CuratorFrameworkImpl.java:77)
            at org.apache.curator.framework.imps.CuratorFrameworkImpl$4.call(CuratorFrameworkImpl.java:320)
            at java.base/java.util.concurrent.FutureTask.run(FutureTask.java:317)
            at java.base/java.util.concurrent.ScheduledThreadPoolExecutor$ScheduledFutureTask.run(ScheduledThreadPoolExecutor.java:304)
            at java.base/java.util.concurrent.ThreadPoolExecutor.runWorker(ThreadPoolExecutor.java:1144)
            at java.base/java.util.concurrent.ThreadPoolExecutor$Worker.run(ThreadPoolExecutor.java:642)
            at java.base/java.lang.Thread.run(Thread.java:1583)
       2) Thread[id=409, name=Curator-ConnectionStateManager-0, state=TIMED_WAITING, group=TGRP-ZkConfigIntegrationTest]
            at java.base/jdk.internal.misc.Unsafe.park(Native Method)
            at java.base/java.util.concurrent.locks.LockSupport.parkNanos(LockSupport.java:269)
            at java.base/java.util.concurrent.locks.AbstractQueuedSynchronizer$ConditionObject.awaitNanos(AbstractQueuedSynchronizer.java:1797)
            at java.base/java.util.concurrent.ArrayBlockingQueue.poll(ArrayBlockingQueue.java:435)
            at org.apache.curator.framework.state.ConnectionStateManager.processEvents(ConnectionStateManager.java:246)
            at org.apache.curator.framework.state.ConnectionStateManager.lambda$start$0(ConnectionStateManager.java:127)
            at java.base/java.util.concurrent.FutureTask.run(FutureTask.java:317)
            at java.base/java.util.concurrent.ThreadPoolExecutor.runWorker(ThreadPoolExecutor.java:1144)
            at java.base/java.util.concurrent.ThreadPoolExecutor$Worker.run(ThreadPoolExecutor.java:642)
            at java.base/java.lang.Thread.run(Thread.java:1583)
        at __randomizedtesting.SeedInfo.seed([70BC127F4429CBD9]:0)
No reporter found for test descriptor: Test classMethod(org.apache.solr.crossdc.manager.ZkConfigIntegrationTest)
java.lang.IllegalStateException: No reporter found for test descriptor: Test classMethod(org.apache.solr.crossdc.manager.ZkConfigIntegrationTest)
	at org.gradle.api.internal.tasks.testing.junit.result.TestEventReporterAsListener.completed(TestEventReporterAsListener.java:80)
	at org.gradle.api.internal.tasks.testing.results.SynchronizedTestListenerInternal.completed(SynchronizedTestListenerInternal.java:49)
	at org.gradle.api.internal.tasks.testing.results.StateTrackingTestResultProcessor.completed(StateTrackingTestResultProcessor.java:98)
	at com.gradle.scan.plugin.internal.dep.org.gradle.testretry.internal.executer.RetryTestResultProcessor.completed(SourceFile:143)
	at org.gradle.api.internal.tasks.testing.results.TestRetryShieldingTestResultProcessor.completed(TestRetryShieldingTestResultProcessor.java:41)
	at org.gradle.api.internal.tasks.testing.results.AttachParentTestResultProcessor.completed(AttachParentTestResultProcessor.java:61)
	at java.base/jdk.internal.reflect.DirectMethodHandleAccessor.invoke(DirectMethodHandleAccessor.java:103)
	at java.base/java.lang.reflect.Method.invoke(Method.java:580)
	at org.gradle.internal.dispatch.MethodInvocation.invokeOn(MethodInvocation.java:77)
	at org.gradle.internal.dispatch.ReflectionDispatch.dispatch(ReflectionDispatch.java:28)
	at org.gradle.internal.dispatch.ReflectionDispatch.dispatch(ReflectionDispatch.java:19)
	at org.gradle.internal.dispatch.FailureHandlingDispatch.dispatch(FailureHandlingDispatch.java:30)
	at org.gradle.internal.dispatch.AsyncDispatch.dispatchMessages(AsyncDispatch.java:88)
	at org.gradle.internal.dispatch.AsyncDispatch.access$000(AsyncDispatch.java:36)
	at org.gradle.internal.dispatch.AsyncDispatch$1.run(AsyncDispatch.java:72)
	at org.gradle.internal.concurrent.InterruptibleRunnable.run(InterruptibleRunnable.java:44)
	at org.gradle.internal.operations.CurrentBuildOperationRef.with(CurrentBuildOperationRef.java:84)
	at org.gradle.internal.operations.CurrentBuildOperationPreservingRunnable.run(CurrentBuildOperationPreservingRunnable.java:51)
	at org.gradle.internal.concurrent.ExecutorPolicy$CatchAndRecordFailures.onExecute(ExecutorPolicy.java:65)
	at org.gradle.internal.concurrent.AbstractManagedExecutor$1.run(AbstractManagedExecutor.java:47)
	at java.base/java.util.concurrent.ThreadPoolExecutor.runWorker(ThreadPoolExecutor.java:1144)
	at java.base/java.util.concurrent.ThreadPoolExecutor$Worker.run(ThreadPoolExecutor.java:642)
	at java.base/java.lang.Thread.run(Thread.java:1583)

ZkConfigIntegrationTest > classMethod FAILED

org.apache.solr.crossdc.manager.ZkConfigIntegrationTest > test suite's output saved to /home/jenkins/jenkins-agent/workspace/Solr/Solr-Test-main/solr/cross-dc-manager/build/test-results/test/outputs/OUTPUT-org.apache.solr.crossdc.manager.ZkConfigIntegrationTest.txt, copied below:
  2> 6658 INFO  (SUITE-ZkConfigIntegrationTest-seed#[70BC127F4429CBD9]-worker) [] o.t.DockerClientFactory Testcontainers version: 2.0.5
  2> 6855 INFO  (SUITE-ZkConfigIntegrationTest-seed#[70BC127F4429CBD9]-worker) [] o.t.d.DockerClientProviderStrategy Loaded org.testcontainers.dockerclient.UnixSocketClientProviderStrategy from ~/.testcontainers.properties, will try it first
  2> 7064 INFO  (SUITE-ZkConfigIntegrationTest-seed#[70BC127F4429CBD9]-worker) [] o.t.d.DockerClientProviderStrategy Found Docker environment with local Unix socket (unix:///var/run/docker.sock)
  2> 7066 INFO  (SUITE-ZkConfigIntegrationTest-seed#[70BC127F4429CBD9]-worker) [] o.t.DockerClientFactory Docker host IP address is localhost
  2> 7078 INFO  (SUITE-ZkConfigIntegrationTest-seed#[70BC127F4429CBD9]-worker) [] o.t.DockerClientFactory Connected to docker: 
  2>   Server Version: 29.8.1
  2>   API Version: 1.56
  2>   Operating System: Ubuntu 24.04.5 LTS
  2>   Total Memory: 32093 MB
  2> 7091 INFO  (SUITE-ZkConfigIntegrationTest-seed#[70BC127F4429CBD9]-worker) [] o.t.i.PullPolicy Image pull policy will be performed by: DefaultPullPolicy()
  2> 7093 INFO  (SUITE-ZkConfigIntegrationTest-seed#[70BC127F4429CBD9]-worker) [] o.t.u.ImageNameSubstitutor Image name substitution will be performed by: DefaultImageNameSubstitutor (composite of 'ConfigurationFileImageNameSubstitutor' and 'PrefixingImageNameSubstitutor')
  2> 7107 INFO  (SUITE-ZkConfigIntegrationTest-seed#[70BC127F4429CBD9]-worker) [] t.t.1.0 Creating container for image: testcontainers/ryuk:0.14.0
  2> 7255 INFO  (SUITE-ZkConfigIntegrationTest-seed#[70BC127F4429CBD9]-worker) [] t.t.1.0 Container testcontainers/ryuk:0.14.0 is starting: 2d912c3899a498757007e08ffdab4eea303f4e788a8220121fd30a9b3cacaf30
  2> 7585 INFO  (SUITE-ZkConfigIntegrationTest-seed#[70BC127F4429CBD9]-worker) [] t.t.1.0 Container testcontainers/ryuk:0.14.0 started in PT0.477975207S
  2> 7588 INFO  (SUITE-ZkConfigIntegrationTest-seed#[70BC127F4429CBD9]-worker) [] o.t.u.RyukResourceReaper Ryuk started - will monitor and terminate Testcontainers containers on JVM exit
  2> 7588 INFO  (SUITE-ZkConfigIntegrationTest-seed#[70BC127F4429CBD9]-worker) [] o.t.DockerClientFactory Checking the system...
  2> 7588 INFO  (SUITE-ZkConfigIntegrationTest-seed#[70BC127F4429CBD9]-worker) [] o.t.DockerClientFactory ✔︎ Docker server version should be at least 1.6.0
  2> 7590 INFO  (SUITE-ZkConfigIntegrationTest-seed#[70BC127F4429CBD9]-worker) [] t.a.3.1 Creating container for image: apache/kafka:4.3.1
  2> 7635 INFO  (SUITE-ZkConfigIntegrationTest-seed#[70BC127F4429CBD9]-worker) [] t.a.3.1 Container apache/kafka:4.3.1 is starting: 05673dd6fff25d4757ba2cf745fdc8ae71123148a3ccff6e718e86cd26250b1d
  2> 10422 INFO  (SUITE-ZkConfigIntegrationTest-seed#[70BC127F4429CBD9]-worker) [] t.a.3.1 Container apache/kafka:4.3.1 started in PT2.832213225S
  2> 10423 INFO  (SUITE-ZkConfigIntegrationTest-seed#[70BC127F4429CBD9]-worker) [] o.a.s.SolrTestCase Setting 'solr.configset.default.confdir' system property to test-framework derived value of '/home/jenkins/jenkins-agent/workspace/Solr/Solr-Test-main/solr/server/solr/configsets/_default/conf'
  2> 10424 INFO  (SUITE-ZkConfigIntegrationTest-seed#[70BC127F4429CBD9]-worker) [] o.a.s.SolrTestCaseJ4 Created dataDir: /home/jenkins/jenkins-agent/workspace/Solr/Solr-Test-main/solr/cross-dc-manager/build/tmp/tests-tmp/org.apache.solr.crossdc.manager.ZkConfigIntegrationTest_70BC127F4429CBD9-001/data-dir-2-001
  2> 10424 WARN  (SUITE-ZkConfigIntegrationTest-seed#[70BC127F4429CBD9]-worker) [] o.a.s.SolrTestCaseJ4 startTrackingSearchers: numOpens=1 numCloses=1
  2> 10424 INFO  (SUITE-ZkConfigIntegrationTest-seed#[70BC127F4429CBD9]-worker) [] o.a.s.u.ErrorLogMuter Creating ErrorLogMuter-regex-2 for ERROR logs matching regex: ignore_exception
  2> 10425 INFO  (SUITE-ZkConfigIntegrationTest-seed#[70BC127F4429CBD9]-worker) [] o.a.s.SolrTestCaseJ4 Using PointFields (NUMERIC_POINTS_SYSPROP=true) w/NUMERIC_DOCVALUES_SYSPROP=true
  2> 10427 WARN  (SUITE-ZkConfigIntegrationTest-seed#[70BC127F4429CBD9]-worker) [] o.e.j.u.r.ResourceFactory Leaked /home/jenkins/jenkins-agent/workspace/Solr/Solr-Test-main/solr/test-framework/build/libs/solr-test-framework-11.0.0-SNAPSHOT.jar for jar:file:///home/jenkins/jenkins-agent/workspace/Solr/Solr-Test-main/solr/test-framework/build/libs/solr-test-framework-11.0.0-SNAPSHOT.jar!/SSLTestConfig.hostname-and-ip-missmatch.keystore
  2> 10427 INFO  (SUITE-ZkConfigIntegrationTest-seed#[70BC127F4429CBD9]-worker) [] o.a.s.SolrTestCaseJ4 Randomized ssl (false) and clientAuth (false) via: @org.apache.solr.util.RandomizeSSL(reason="", value=0.0/0.0, ssl=0.0/0.0, clientAuth=0.0/0.0)
  2> 10427 INFO  (SUITE-ZkConfigIntegrationTest-seed#[70BC127F4429CBD9]-worker) [] o.a.s.SolrTestCaseJ4 SecureRandom sanity checks: test.solr.allowed.securerandom=null & java.security.egd=file:/dev/./urandom
  2> 10431 INFO  (SUITE-ZkConfigIntegrationTest-seed#[70BC127F4429CBD9]-worker) [] o.a.s.c.m.ZkConfigIntegrationTest Kafka Testcontainer started. bootstrapServers=localhost:35213
  2> 10447 INFO  (SUITE-ZkConfigIntegrationTest-seed#[70BC127F4429CBD9]-worker) [] o.a.k.c.c.AbstractConfig AdminClientConfig values: 
  2> 	bootstrap.controllers = []
  2> 	bootstrap.servers = [localhost:35213]
  2> 	client.dns.lookup = use_all_dns_ips
  2> 	client.id = 
  2> 	config.providers = []
  2> 	connections.max.idle.ms = 300000
  2> 	default.api.timeout.ms = 60000
  2> 	enable.metrics.push = false
  2> 	metadata.max.age.ms = 300000
  2> 	metadata.recovery.rebootstrap.trigger.ms = 300000
  2> 	metadata.recovery.strategy = rebootstrap
  2> 	metric.reporters = [org.apache.kafka.common.metrics.JmxReporter]
  2> 	metrics.num.samples = 2
  2> 	metrics.recording.level = INFO
  2> 	metrics.sample.window.ms = 30000
  2> 	receive.buffer.bytes = 65536
  2> 	reconnect.backoff.max.ms = 1000
  2> 	reconnect.backoff.ms = 50
  2> 	request.timeout.ms = 30000
  2> 	retries = 2147483647
  2> 	retry.backoff.max.ms = 1000
  2> 	retry.backoff.ms = 100
  2> 	sasl.client.callback.handler.class = null
  2> 	sasl.jaas.config = null
  2> 	sasl.kerberos.kinit.cmd = /usr/bin/kinit
  2> 	sasl.kerberos.min.time.before.relogin = 60000
  2> 	sasl.kerberos.service.name = null
  2> 	sasl.kerberos.ticket.renew.jitter = 0.05
  2> 	sasl.kerberos.ticket.renew.window.factor = 0.8
  2> 	sasl.login.callback.handler.class = null
  2> 	sasl.login.class = null
  2> 	sasl.login.connect.timeout.ms = null
  2> 	sasl.login.read.timeout.ms = null
  2> 	sasl.login.refresh.buffer.seconds = 300
  2> 	sasl.login.refresh.min.period.seconds = 60
  2> 	sasl.login.refresh.window.factor = 0.8
  2> 	sasl.login.refresh.window.jitter = 0.05
  2> 	sasl.login.retry.backoff.max.ms = 10000
  2> 	sasl.login.retry.backoff.ms = 100
  2> 	sasl.mechanism = GSSAPI
  2> 	sasl.oauthbearer.assertion.algorithm = RS256
  2> 	sasl.oauthbearer.assertion.claim.aud = null
  2> 	sasl.oauthbearer.assertion.claim.exp.seconds = 300
  2> 	sasl.oauthbearer.assertion.claim.iss = null
  2> 	sasl.oauthbearer.assertion.claim.jti.include = false
  2> 	sasl.oauthbearer.assertion.claim.nbf.seconds = 60
  2> 	sasl.oauthbearer.assertion.claim.sub = null
  2> 	sasl.oauthbearer.assertion.file = null
  2> 	sasl.oauthbearer.assertion.private.key.file = null
  2> 	sasl.oauthbearer.assertion.private.key.passphrase = null
  2> 	sasl.oauthbearer.assertion.template.file = null
  2> 	sasl.oauthbearer.client.credentials.client.id = null
  2> 	sasl.oauthbearer.client.credentials.client.secret = null
  2> 	sasl.oauthbearer.clock.skew.seconds = 30
  2> 	sasl.oauthbearer.expected.audience = []
  2> 	sasl.oauthbearer.expected.issuer = null
  2> 	sasl.oauthbearer.header.urlencode = false
  2> 	sasl.oauthbearer.jwks.endpoint.refresh.ms = 3600000
  2> 	sasl.oauthbearer.jwks.endpoint.retry.backoff.max.ms = 10000
  2> 	sasl.oauthbearer.jwks.endpoint.retry.backoff.ms = 100
  2> 	sasl.oauthbearer.jwks.endpoint.url = null
  2> 	sasl.oauthbearer.jwt.retriever.class = class org.apache.kafka.common.security.oauthbearer.DefaultJwtRetriever
  2> 	sasl.oauthbearer.jwt.validator.class = class org.apache.kafka.common.security.oauthbearer.DefaultJwtValidator
  2> 	sasl.oauthbearer.scope = null
  2> 	sasl.oauthbearer.scope.claim.name = scope
  2> 	sasl.oauthbearer.sub.claim.name = sub
  2> 	sasl.oauthbearer.token.endpoint.url = null
  2> 	security.protocol = PLAINTEXT
  2> 	security.providers = null
  2> 	send.buffer.bytes = 131072
  2> 	socket.connection.setup.timeout.max.ms = 30000
  2> 	socket.connection.setup.timeout.ms = 10000
  2> 	ssl.cipher.suites = []
  2> 	ssl.enabled.protocols = [TLSv1.2, TLSv1.3]
  2> 	ssl.endpoint.identification.algorithm = https
  2> 	ssl.engine.factory.class = null
  2> 	ssl.key.password = null
  2> 	ssl.keymanager.algorithm = SunX509
  2> 	ssl.keystore.certificate.chain = null
  2> 	ssl.keystore.key = null
  2> 	ssl.keystore.location = null
  2> 	ssl.keystore.password = null
  2> 	ssl.keystore.type = JKS
  2> 	ssl.protocol = TLSv1.3
  2> 	ssl.provider = null
  2> 	ssl.secure.random.implementation = null
  2> 	ssl.trustmanager.algorithm = PKIX
  2> 	ssl.truststore.certificates = null
  2> 	ssl.truststore.location = null
  2> 	ssl.truststore.password = null
  2> 	ssl.truststore.type = JKS
  2> 
  2> 10492 INFO  (SUITE-ZkConfigIntegrationTest-seed#[70BC127F4429CBD9]-worker) [] o.a.k.c.u.AppInfoParser Kafka version: 4.3.1
  2> 10492 INFO  (SUITE-ZkConfigIntegrationTest-seed#[70BC127F4429CBD9]-worker) [] o.a.k.c.u.AppInfoParser Kafka commitId: 26b251a451ce941d
  2> 10493 INFO  (SUITE-ZkConfigIntegrationTest-seed#[70BC127F4429CBD9]-worker) [] o.a.k.c.u.AppInfoParser Kafka startTimeMs: 1790632731775
  2> 10836 INFO  (SUITE-ZkConfigIntegrationTest-seed#[70BC127F4429CBD9]-worker) [] o.a.k.c.m.Metrics Metrics scheduler closed
  2> 10837 INFO  (SUITE-ZkConfigIntegrationTest-seed#[70BC127F4429CBD9]-worker) [] o.a.k.c.m.Metrics Closing reporter org.apache.kafka.common.metrics.JmxReporter
  2> 10837 INFO  (SUITE-ZkConfigIntegrationTest-seed#[70BC127F4429CBD9]-worker) [] o.a.k.c.m.Metrics Metrics reporters closed
  2> 10837 INFO  (kafka-admin-client-thread | adminclient-1) [] o.a.k.c.u.AppInfoParser App info kafka.admin.client for adminclient-1 unregistered
  2> 10840 INFO  (kafka-admin-client-thread | adminclient-1) [] o.a.k.c.m.Metrics Metrics scheduler closed
  2> 10840 INFO  (kafka-admin-client-thread | adminclient-1) [] o.a.k.c.m.Metrics Closing reporter org.apache.kafka.common.metrics.JmxReporter
  2> 10840 INFO  (kafka-admin-client-thread | adminclient-1) [] o.a.k.c.m.Metrics Metrics reporters closed
  2> 10841 INFO  (SUITE-ZkConfigIntegrationTest-seed#[70BC127F4429CBD9]-worker) [] o.a.s.c.OpenTelemetryConfigurator OpenTelemetry tracer enabled with simple propagation only.
  2> 10841 INFO  (SUITE-ZkConfigIntegrationTest-seed#[70BC127F4429CBD9]-worker) [] o.a.s.c.MiniSolrCloudCluster Starting cluster of 1 servers in /home/jenkins/jenkins-agent/workspace/Solr/Solr-Test-main/solr/cross-dc-manager/build/tmp/tests-tmp/org.apache.solr.crossdc.manager.ZkConfigIntegrationTest_70BC127F4429CBD9-001/tempDir-001
  2> 10841 INFO  (SUITE-ZkConfigIntegrationTest-seed#[70BC127F4429CBD9]-worker) [] o.a.s.c.ZkTestServer STARTING ZK TEST SERVER
  2> 10841 INFO  (ZkTestServer Run Thread) [] o.a.s.c.ZkTestServer client port: /127.0.0.1:0
  2> 10842 INFO  (ZkTestServer Run Thread) [] o.a.s.c.ZkTestServer Starting server
  2> 10842 WARN  (ZkTestServer Run Thread) [] o.a.z.s.ServerCnxnFactory maxCnxns is not configured, using default value 0.
  2> 10942 INFO  (SUITE-ZkConfigIntegrationTest-seed#[70BC127F4429CBD9]-worker) [] o.a.s.c.ZkTestServer start zk server on port: 40027
  2> 10943 WARN  (SUITE-ZkConfigIntegrationTest-seed#[70BC127F4429CBD9]-worker) [] o.a.s.c.c.SolrZkClient Using default ZkCredentialsInjector. ZkCredentialsInjector is not secure, it creates an empty list of credentials which leads to 'OPEN_ACL_UNSAFE' ACLs to Zookeeper nodes
  2> 10943 WARN  (SUITE-ZkConfigIntegrationTest-seed#[70BC127F4429CBD9]-worker) [] o.a.s.c.c.SolrZkClient Using default ZkACLProvider. DefaultZkACLProvider is not secure, it creates 'OPEN_ACL_UNSAFE' ACLs to Zookeeper nodes
  2> 10944 INFO  (SUITE-ZkConfigIntegrationTest-seed#[70BC127F4429CBD9]-worker) [] o.a.c.f.i.CuratorFrameworkImpl Starting
  2> 10945 INFO  (SUITE-ZkConfigIntegrationTest-seed#[70BC127F4429CBD9]-worker) [] o.a.c.f.i.CuratorFrameworkImpl Default schema
  2> 10947 INFO  (SUITE-ZkConfigIntegrationTest-seed#[70BC127F4429CBD9]-worker-EventThread) [] o.a.c.f.s.ConnectionStateManager State change: CONNECTED
  2> 10948 INFO  (SUITE-ZkConfigIntegrationTest-seed#[70BC127F4429CBD9]-worker-EventThread) [] o.a.c.f.i.EnsembleTracker New config event received: {}
  2> 10948 INFO  (SUITE-ZkConfigIntegrationTest-seed#[70BC127F4429CBD9]-worker-EventThread) [] o.a.c.f.i.EnsembleTracker New config event received: {}
  2> 10950 WARN  (SUITE-ZkConfigIntegrationTest-seed#[70BC127F4429CBD9]-worker) [] o.a.s.c.c.SolrZkClient Using default ZkCredentialsInjector. ZkCredentialsInjector is not secure, it creates an empty list of credentials which leads to 'OPEN_ACL_UNSAFE' ACLs to Zookeeper nodes
  2> 10950 WARN  (SUITE-ZkConfigIntegrationTest-seed#[70BC127F4429CBD9]-worker) [] o.a.s.c.c.SolrZkClient Using default ZkACLProvider. DefaultZkACLProvider is not secure, it creates 'OPEN_ACL_UNSAFE' ACLs to Zookeeper nodes
  2> 10950 INFO  (SUITE-ZkConfigIntegrationTest-seed#[70BC127F4429CBD9]-worker) [] o.a.c.f.i.CuratorFrameworkImpl Starting
  2> 10951 INFO  (SUITE-ZkConfigIntegrationTest-seed#[70BC127F4429CBD9]-worker) [] o.a.c.f.i.CuratorFrameworkImpl Default schema
  2> 10952 INFO  (SUITE-ZkConfigIntegrationTest-seed#[70BC127F4429CBD9]-worker-EventThread) [] o.a.c.f.s.ConnectionStateManager State change: CONNECTED
  2> 10952 WARN  (SUITE-ZkConfigIntegrationTest-seed#[70BC127F4429CBD9]-worker) [] o.a.s.c.c.SolrZkClient Using default ZkCredentialsInjector. ZkCredentialsInjector is not secure, it creates an empty list of credentials which leads to 'OPEN_ACL_UNSAFE' ACLs to Zookeeper nodes
  2> 10953 WARN  (SUITE-ZkConfigIntegrationTest-seed#[70BC127F4429CBD9]-worker) [] o.a.s.c.c.SolrZkClient Using default ZkACLProvider. DefaultZkACLProvider is not secure, it creates 'OPEN_ACL_UNSAFE' ACLs to Zookeeper nodes
  2> 10953 INFO  (SUITE-ZkConfigIntegrationTest-seed#[70BC127F4429CBD9]-worker-EventThread) [] o.a.c.f.i.EnsembleTracker New config event received: {}
  2> 10953 INFO  (SUITE-ZkConfigIntegrationTest-seed#[70BC127F4429CBD9]-worker-EventThread) [] o.a.c.f.i.EnsembleTracker New config event received: {}
  2> 10953 INFO  (SUITE-ZkConfigIntegrationTest-seed#[70BC127F4429CBD9]-worker) [] o.a.c.f.i.CuratorFrameworkImpl Starting
  2> 10954 INFO  (SUITE-ZkConfigIntegrationTest-seed#[70BC127F4429CBD9]-worker) [] o.a.c.f.i.CuratorFrameworkImpl Default schema
  2> 10955 INFO  (SUITE-ZkConfigIntegrationTest-seed#[70BC127F4429CBD9]-worker-EventThread) [] o.a.c.f.s.ConnectionStateManager State change: CONNECTED
  2> 10955 INFO  (SUITE-ZkConfigIntegrationTest-seed#[70BC127F4429CBD9]-worker-EventThread) [] o.a.c.f.i.EnsembleTracker New config event received: {}
  2> 10955 INFO  (SUITE-ZkConfigIntegrationTest-seed#[70BC127F4429CBD9]-worker-EventThread) [] o.a.c.f.i.EnsembleTracker New config event received: {}
  2> 10956 INFO  (Curator-Framework-0) [] o.a.c.f.i.CuratorFrameworkImpl backgroundOperationsLoop exiting
  2> 11060 INFO  (jetty-launcher-85-thread-1) [] o.a.s.e.JettySolrRunner Start Jetty (configured port=0, binding port=0)
  2> 11060 INFO  (jetty-launcher-85-thread-1) [] o.a.s.e.JettySolrRunner Trying to start Jetty on port 0 try number 2 ...
  2> 11060 INFO  (jetty-launcher-85-thread-1) [] o.e.j.s.Server jetty-12.1.12; built: 2026-08-03T22:37:55.389Z; git: 10dd3948f37767b84cc2c62358364f042e51dbbe; jvm 21.0.12.1+1-LTS
  2> 11061 INFO  (jetty-launcher-85-thread-1) [] o.e.j.s.DefaultSessionIdManager Session workerName=node0
  2> 11061 WARN  (jetty-launcher-85-thread-1) [] o.e.j.e.s.ServletContextHandler BaseResource file:///home/jenkins/jenkins-agent/workspace/Solr/Solr-Test-main/solr/cross-dc-manager/build/tmp/tests-cwd/./ is aliased to file:///home/jenkins/jenkins-agent/workspace/Solr/Solr-Test-main/solr/cross-dc-manager/build/tmp/tests-cwd/ in oeje10s.ServletContextHandler@384b67fb{/solr,/solr,b=file:///home/jenkins/jenkins-agent/workspace/Solr/Solr-Test-main/solr/cross-dc-manager/build/tmp/tests-cwd/./,a=STOPPED,h=oeje10s.ServletHandler@33ab6eb7{STOPPED}}. May not be supported in future releases.
  2> 11062 INFO  (jetty-launcher-85-thread-1) [] o.e.j.s.h.ContextHandler /solr Base Resource is an alias: file:///home/jenkins/jenkins-agent/workspace/Solr/Solr-Test-main/solr/cross-dc-manager/build/tmp/tests-cwd/./ -> file:///home/jenkins/jenkins-agent/workspace/Solr/Solr-Test-main/solr/cross-dc-manager/build/tmp/tests-cwd/
  2> 11062 INFO  (jetty-launcher-85-thread-1) [] o.e.j.s.h.ContextHandler Started oeje10s.ServletContextHandler@384b67fb{/solr,/solr,b=file:///home/jenkins/jenkins-agent/workspace/Solr/Solr-Test-main/solr/cross-dc-manager/build/tmp/tests-cwd/,a=AVAILABLE,h=oeje10s.ServletHandler@33ab6eb7{STARTED}}
  2> 11062 INFO  (jetty-launcher-85-thread-1) [] o.a.s.e.JettySolrRunner Jetty properties: {hostPort=33513, zkHost=127.0.0.1:40027/solr}
  2> 11062 ERROR (jetty-launcher-85-thread-1) [] o.a.s.u.StartupLoggingUtils Missing Java Option solr.logs.dir. Logging may be missing or incomplete.
  2> 11062 INFO  (jetty-launcher-85-thread-1) [] o.a.s.s.CoreContainerProvider Using logger factory org.apache.logging.slf4j.Log4jLoggerFactory
  2> 11062 INFO  (jetty-launcher-85-thread-1) [] o.a.s.s.CoreContainerProvider  ___      _       Welcome to Apache Solr™ version 11.0.0-SNAPSHOT 634be2a1c1358363fd6110b6502e094027a704e4 [snapshot build, details omitted]
  2> 11062 INFO  (jetty-launcher-85-thread-1) [] o.a.s.s.CoreContainerProvider / __| ___| |_ _   Starting in cloud mode on port null
  2> 11062 INFO  (jetty-launcher-85-thread-1) [] o.a.s.s.CoreContainerProvider \__ \/ _ \ | '_|  Install dir: /home/jenkins/jenkins-agent/workspace/Solr/Solr-Test-main/solr
  2> 11063 INFO  (jetty-launcher-85-thread-1) [] o.a.s.s.CoreContainerProvider |___/\___/_|_|    Start time: 2026-09-28T21:58:52.347007563Z
  2> 11063 INFO  (jetty-launcher-85-thread-1) [] o.a.s.s.CoreContainerProvider Solr Home: /home/jenkins/jenkins-agent/workspace/Solr/Solr-Test-main/solr/cross-dc-manager/build/tmp/tests-tmp/org.apache.solr.crossdc.manager.ZkConfigIntegrationTest_70BC127F4429CBD9-001/tempDir-001/node1 (source: servlet config: solr.solr.home)
  2> 11063 WARN  (jetty-launcher-85-thread-1) [] o.a.s.c.c.SolrZkClient Using default ZkCredentialsInjector. ZkCredentialsInjector is not secure, it creates an empty list of credentials which leads to 'OPEN_ACL_UNSAFE' ACLs to Zookeeper nodes
  2> 11063 WARN  (jetty-launcher-85-thread-1) [] o.a.s.c.c.SolrZkClient Using default ZkACLProvider. DefaultZkACLProvider is not secure, it creates 'OPEN_ACL_UNSAFE' ACLs to Zookeeper nodes
  2> 11063 INFO  (jetty-launcher-85-thread-1) [] o.a.c.f.i.CuratorFrameworkImpl Starting
  2> 11064 INFO  (jetty-launcher-85-thread-1) [] o.a.c.f.i.CuratorFrameworkImpl Default schema
  2> 11065 INFO  (jetty-launcher-85-thread-1-EventThread) [] o.a.c.f.s.ConnectionStateManager State change: CONNECTED
  2> 11066 INFO  (jetty-launcher-85-thread-1-EventThread) [] o.a.c.f.i.EnsembleTracker New config event received: {}
  2> 11066 INFO  (jetty-launcher-85-thread-1-EventThread) [] o.a.c.f.i.EnsembleTracker New config event received: {}
  2> 11066 INFO  (Curator-Framework-0) [] o.a.c.f.i.CuratorFrameworkImpl backgroundOperationsLoop exiting
  2> 11167 INFO  (jetty-launcher-85-thread-1) [] o.a.s.c.SolrXmlConfig Loading solr.xml from /home/jenkins/jenkins-agent/workspace/Solr/Solr-Test-main/solr/cross-dc-manager/build/tmp/tests-tmp/org.apache.solr.crossdc.manager.ZkConfigIntegrationTest_70BC127F4429CBD9-001/tempDir-001/node1/solr.xml
  2> 11170 INFO  (jetty-launcher-85-thread-1) [] o.a.s.c.SolrXmlConfig Metrics collection is disabled.
  2> 11182 INFO  (jetty-launcher-85-thread-1) [] o.a.s.c.ZkContainer Zookeeper client=127.0.0.1:40027/solr
  2> 11182 WARN  (jetty-launcher-85-thread-1) [] o.a.s.c.c.SolrZkClient Using default ZkCredentialsInjector. ZkCredentialsInjector is not secure, it creates an empty list of credentials which leads to 'OPEN_ACL_UNSAFE' ACLs to Zookeeper nodes
  2> 11182 WARN  (jetty-launcher-85-thread-1) [] o.a.s.c.c.SolrZkClient Using default ZkACLProvider. DefaultZkACLProvider is not secure, it creates 'OPEN_ACL_UNSAFE' ACLs to Zookeeper nodes
  2> 11182 INFO  (jetty-launcher-85-thread-1) [] o.a.c.f.i.CuratorFrameworkImpl Starting
  2> 11184 INFO  (jetty-launcher-85-thread-1) [] o.a.c.f.i.CuratorFrameworkImpl Default schema
  2> 11184 INFO  (jetty-launcher-85-thread-1-EventThread) [] o.a.c.f.s.ConnectionStateManager State change: CONNECTED
  2> 11185 INFO  (jetty-launcher-85-thread-1-EventThread) [] o.a.c.f.i.EnsembleTracker New config event received: {}
  2> 11185 INFO  (jetty-launcher-85-thread-1-EventThread) [] o.a.c.f.i.EnsembleTracker New config event received: {}
  2> 11185 INFO  (Curator-Framework-0) [] o.a.c.f.i.CuratorFrameworkImpl backgroundOperationsLoop exiting
  2> 11287 INFO  (jetty-launcher-85-thread-1) [n:127.0.0.1:33513_solr] o.a.c.f.i.CuratorFrameworkImpl Starting
  2> 11288 INFO  (jetty-launcher-85-thread-1) [n:127.0.0.1:33513_solr] o.a.c.f.i.CuratorFrameworkImpl Default schema
  2> 11289 INFO  (jetty-launcher-85-thread-1-EventThread) [] o.a.c.f.s.ConnectionStateManager State change: CONNECTED
  2> 11289 INFO  (jetty-launcher-85-thread-1-EventThread) [] o.a.c.f.i.EnsembleTracker New config event received: {}
  2> 11289 INFO  (jetty-launcher-85-thread-1-EventThread) [] o.a.c.f.i.EnsembleTracker New config event received: {}
  2> 11311 WARN  (jetty-launcher-85-thread-1) [n:127.0.0.1:33513_solr] o.a.s.c.ZkController Contents of zookeeper /security.json are world-readable; consider setting up ACLs as described in https://solr.apache.org/guide/solr/latest/deployment-guide/zookeeper-access-control.html
  2> 11314 INFO  (jetty-launcher-85-thread-1) [n:127.0.0.1:33513_solr] o.a.s.c.ZkController The Overseer is enabled.  It will process all cluster commands & state updates.
  2> 11318 INFO  (jetty-launcher-85-thread-1) [n:127.0.0.1:33513_solr] o.a.s.c.OverseerElectionContext I am going to be the leader 127.0.0.1:33513_solr
  2> 11319 INFO  (jetty-launcher-85-thread-1) [n:127.0.0.1:33513_solr] o.a.s.c.Overseer Overseer (id=72089654984638469-127.0.0.1:33513_solr-n_0000000000) starting
  2> 11323 INFO  (OverseerStateUpdate-72089654984638469-127.0.0.1:33513_solr-n_0000000000) [n:127.0.0.1:33513_solr] o.a.s.c.Overseer Starting to work on the main queue : 127.0.0.1:33513_solr
  2> 11323 INFO  (jetty-launcher-85-thread-1) [n:127.0.0.1:33513_solr] o.a.s.c.ZkController Register node as live in ZooKeeper: /live_nodes/127.0.0.1:33513_solr
  2> 11325 INFO  (OverseerStateUpdate-72089654984638469-127.0.0.1:33513_solr-n_0000000000) [n:127.0.0.1:33513_solr] o.a.s.c.c.ZkStateReader Updated live nodes from ZooKeeper... (0) -> (1)
  2> 11327 WARN  (jetty-launcher-85-thread-1) [n:127.0.0.1:33513_solr] o.a.s.c.CoreContainer Not all security plugins configured!  authentication=disabled authorization=disabled.  Solr is only as secure as you make it. Consider configuring authentication/authorization before exposing Solr to users internal or external.  See https://s.apache.org/solrsecurity for more info
  2> 11392 INFO  (jetty-launcher-85-thread-1) [n:127.0.0.1:33513_solr] o.a.s.c.CorePropertiesLocator Found 0 core definitions underneath /home/jenkins/jenkins-agent/workspace/Solr/Solr-Test-main/solr/cross-dc-manager/build/tmp/tests-tmp/org.apache.solr.crossdc.manager.ZkConfigIntegrationTest_70BC127F4429CBD9-001/tempDir-001/node1
  2> 11478 INFO  (jetty-launcher-85-thread-1) [n:127.0.0.1:33513_solr] o.e.j.e.s.ServletContextHandler Started oeje10s.ServletContextHandler@384b67fb{/solr,/solr,b=file:///home/jenkins/jenkins-agent/workspace/Solr/Solr-Test-main/solr/cross-dc-manager/build/tmp/tests-cwd/,a=AVAILABLE,h=oeje10s.ServletHandler@33ab6eb7{STARTED}}
  2> 11478 INFO  (jetty-launcher-85-thread-1) [n:127.0.0.1:33513_solr] o.e.j.s.AbstractConnector Started oejs.ServerConnector@5ccaddb7{HTTP/1.1, (http/1.1, h2c)}{127.0.0.1:33513}
  2> 11479 INFO  (jetty-launcher-85-thread-1) [n:127.0.0.1:33513_solr] o.e.j.s.Server Started oejs.Server@54a5e031{STARTING}[12.1.12,sto=0] @418ms
  2> 11481 INFO  (SUITE-ZkConfigIntegrationTest-seed#[70BC127F4429CBD9]-worker) [] o.a.s.c.MiniSolrCloudCluster waitForAllNodes: numServers=1
  2> 11482 INFO  (SUITE-ZkConfigIntegrationTest-seed#[70BC127F4429CBD9]-worker) [] o.a.s.c.MiniSolrCloudCluster waitForNode: 127.0.0.1:33513_solr
  2> 11482 WARN  (SUITE-ZkConfigIntegrationTest-seed#[70BC127F4429CBD9]-worker) [] o.a.s.c.c.SolrZkClient Using default ZkCredentialsInjector. ZkCredentialsInjector is not secure, it creates an empty list of credentials which leads to 'OPEN_ACL_UNSAFE' ACLs to Zookeeper nodes
  2> 11482 WARN  (SUITE-ZkConfigIntegrationTest-seed#[70BC127F4429CBD9]-worker) [] o.a.s.c.c.SolrZkClient Using default ZkACLProvider. DefaultZkACLProvider is not secure, it creates 'OPEN_ACL_UNSAFE' ACLs to Zookeeper nodes
  2> 11482 INFO  (SUITE-ZkConfigIntegrationTest-seed#[70BC127F4429CBD9]-worker) [] o.a.c.f.i.CuratorFrameworkImpl Starting
  2> 11483 INFO  (SUITE-ZkConfigIntegrationTest-seed#[70BC127F4429CBD9]-worker) [] o.a.c.f.i.CuratorFrameworkImpl Default schema
  2> 11484 INFO  (SUITE-ZkConfigIntegrationTest-seed#[70BC127F4429CBD9]-worker-EventThread) [] o.a.c.f.s.ConnectionStateManager State change: CONNECTED
  2> 11484 INFO  (SUITE-ZkConfigIntegrationTest-seed#[70BC127F4429CBD9]-worker-EventThread) [] o.a.c.f.i.EnsembleTracker New config event received: {}
  2> 11485 INFO  (SUITE-ZkConfigIntegrationTest-seed#[70BC127F4429CBD9]-worker-EventThread) [] o.a.c.f.i.EnsembleTracker New config event received: {}
  2> 11485 INFO  (SUITE-ZkConfigIntegrationTest-seed#[70BC127F4429CBD9]-worker) [] o.a.s.c.c.ZkStateReader Updated live nodes from ZooKeeper... (0) -> (1)
  2> 11486 INFO  (SUITE-ZkConfigIntegrationTest-seed#[70BC127F4429CBD9]-worker) [] o.a.s.c.s.i.ZkClientClusterStateProvider Cluster at 127.0.0.1:40027/solr ready
  2> 11511 INFO  (OverseerThreadFactory-107-thread-1) [ c:collection1 t:null-5] o.a.s.c.a.c.CreateCollectionCmd Create collection collection1
  2> 11511 INFO  (OverseerThreadFactory-107-thread-1) [ c:collection1 t:null-5] o.a.s.c.a.c.CreateCollectionCmd solr.cloud.prs.enabled : false and collection prs : null, isPRS : false
  2> 11515 INFO  (OverseerThreadFactory-107-thread-1) [ c:collection1 t:null-5] o.a.s.c.c.ZkStateReader /collections/collection1/state.json is deleted, stop watching children
  2> 11517 INFO  (zkCallback-101-thread-1) [] o.a.s.c.c.ZkStateReader A cluster state change: [WatchedEvent state:SyncConnected type:NodeCreated path:/collections/collection1/state.json zxid: -1] for collection [collection1] has occurred - updating... (live nodes size: [1])
  2> 11521 INFO  (OverseerStateUpdate-72089654984638469-127.0.0.1:33513_solr-n_0000000000) [n:127.0.0.1:33513_solr] o.a.s.c.o.SliceMutator createReplica() {
  2>   "core":"collection1_shard1_replica_n1",
  2>   "node_name":"127.0.0.1:33513_solr",
  2>   "base_url":"http://127.0.0.1:33513/solr",
  2>   "collection":"collection1",
  2>   "shard":"shard1",
  2>   "state":"down",
  2>   "type":"NRT",
  2>   "operation":"ADDREPLICA",
  2>   "waitForFinalState":"false"} 
  2> 11624 INFO  (zkCallback-101-thread-2) [] o.a.s.c.c.ZkStateReader A cluster state change: [WatchedEvent state:SyncConnected type:NodeDataChanged path:/collections/collection1/state.json zxid: -1] for collection [collection1] has occurred - updating... (live nodes size: [1])
  2> 11630 INFO  (qtp1657393152-193-null-5) [n:127.0.0.1:33513_solr x:collection1_shard1_replica_n1 t:null-5] o.a.s.h.a.a.CreateCore core create command "org.apache.solr.client.api.model.CreateCoreParams@33980703"
  2> 11643 INFO  (qtp1657393152-193-null-5) [n:127.0.0.1:33513_solr c:collection1 s:shard1 r:core_node2 x:collection1_shard1_replica_n1 t:null-5] o.a.s.s.IndexSchema Loaded schema minimal/1.1 with uniqueid field id
  2> 11643 INFO  (qtp1657393152-193-null-5) [n:127.0.0.1:33513_solr c:collection1 s:shard1 r:core_node2 x:collection1_shard1_replica_n1 t:null-5] o.a.s.c.CoreContainer Creating SolrCore 'collection1_shard1_replica_n1' using configuration from configset conf
  2> 11643 INFO  (qtp1657393152-193-null-5) [n:127.0.0.1:33513_solr c:collection1 s:shard1 r:core_node2 x:collection1_shard1_replica_n1 t:null-5] o.a.s.c.SolrCore Opening new SolrCore at [/home/jenkins/jenkins-agent/workspace/Solr/Solr-Test-main/solr/cross-dc-manager/build/tmp/tests-tmp/org.apache.solr.crossdc.manager.ZkConfigIntegrationTest_70BC127F4429CBD9-001/tempDir-001/node1/collection1_shard1_replica_n1], dataDir=[/home/jenkins/jenkins-agent/workspace/Solr/Solr-Test-main/solr/cross-dc-manager/build/tmp/tests-tmp/org.apache.solr.crossdc.manager.ZkConfigIntegrationTest_70BC127F4429CBD9-001/tempDir-001/node1/collection1_shard1_replica_n1/data/]
  2> 11702 INFO  (qtp1657393152-193-null-5) [n:127.0.0.1:33513_solr c:collection1 s:shard1 r:core_node2 x:collection1_shard1_replica_n1 t:null-5] o.a.s.u.UpdateLog Initializing UpdateLog: dataDir=null defaultSyncLevel=FLUSH numRecordsToKeep=100 maxNumLogsToKeep=10
  2> 11702 INFO  (qtp1657393152-193-null-5) [n:127.0.0.1:33513_solr c:collection1 s:shard1 r:core_node2 x:collection1_shard1_replica_n1 t:null-5] o.a.s.u.CommitTracker Hard AutoCommit: if uncommitted for 60000ms; 
  2> 11702 INFO  (qtp1657393152-193-null-5) [n:127.0.0.1:33513_solr c:collection1 s:shard1 r:core_node2 x:collection1_shard1_replica_n1 t:null-5] o.a.s.u.CommitTracker Soft AutoCommit: disabled
  2> 11706 INFO  (qtp1657393152-193-null-5) [n:127.0.0.1:33513_solr c:collection1 s:shard1 r:core_node2 x:collection1_shard1_replica_n1 t:null-5] o.a.s.r.ManagedResourceStorage Configured ZooKeeperStorageIO with znodeBase: /configs/conf
  2> 11706 INFO  (qtp1657393152-193-null-5) [n:127.0.0.1:33513_solr c:collection1 s:shard1 r:core_node2 x:collection1_shard1_replica_n1 t:null-5] o.a.s.r.ManagedResourceStorage Loaded null at path _rest_managed.json using ZooKeeperStorageIO:path=/configs/conf
  2> 11706 INFO  (qtp1657393152-193-null-5) [n:127.0.0.1:33513_solr c:collection1 s:shard1 r:core_node2 x:collection1_shard1_replica_n1 t:null-5] o.a.s.c.u.p.MirroringUpdateRequestProcessorFactory KafkaRequestMirroringHandler inform enabled=true
  2> 11706 INFO  (qtp1657393152-193-null-5) [n:127.0.0.1:33513_solr c:collection1 s:shard1 r:core_node2 x:collection1_shard1_replica_n1 t:null-5] o.a.s.c.u.p.MirroringUpdateRequestProcessorFactory Producer startup config properties before adding additional properties from Zookeeper={}
  2> 11712 INFO  (qtp1657393152-193-null-5) [n:127.0.0.1:33513_solr c:collection1 s:shard1 r:core_node2 x:collection1_shard1_replica_n1 t:null-5] o.a.s.c.c.KafkaMirroringSink Starting CrossDC Producer KafkaCrossDcConf{solr.crossdc.topicName=topicDst,solr.crossdc.bootstrapServers=localhost:35213,solr.crossdc.manager.port=-1}
  2> 11721 INFO  (qtp1657393152-193-null-5) [n:127.0.0.1:33513_solr c:collection1 s:shard1 r:core_node2 x:collection1_shard1_replica_n1 t:null-5] o.a.k.c.c.AbstractConfig ProducerConfig values: 
  2> 	acks = -1
  2> 	batch.size = 2097152
  2> 	bootstrap.servers = [localhost:35213]
  2> 	buffer.memory = 536870912
  2> 	client.dns.lookup = use_all_dns_ips
  2> 	client.id = producer-1
  2> 	compression.gzip.level = -1
  2> 	compression.lz4.level = 9
  2> 	compression.type = none
  2> 	compression.zstd.level = 3
  2> 	config.providers = []
  2> 	connections.max.idle.ms = 540000
  2> 	delivery.timeout.ms = 120000
  2> 	enable.idempotence = true
  2> 	enable.metrics.push = true
  2> 	interceptor.classes = []
  2> 	key.serializer = class org.apache.kafka.common.serialization.StringSerializer
  2> 	linger.ms = 30
  2> 	max.block.ms = 60000
  2> 	max.in.flight.requests.per.connection = 5
  2> 	max.request.size = 5242880
  2> 	metadata.max.age.ms = 300000
  2> 	metadata.max.idle.ms = 300000
  2> 	metadata.recovery.rebootstrap.trigger.ms = 300000
  2> 	metadata.recovery.strategy = rebootstrap
  2> 	metric.reporters = [org.apache.kafka.common.metrics.JmxReporter]
  2> 	metrics.num.samples = 2
  2> 	metrics.recording.level = INFO
  2> 	metrics.sample.window.ms = 30000
  2> 	partitioner.adaptive.partitioning.enable = true
  2> 	partitioner.availability.timeout.ms = 0
  2> 	partitioner.class = null
  2> 	partitioner.ignore.keys = false
  2> 	receive.buffer.bytes = 32768
  2> 	reconnect.backoff.max.ms = 1000
  2> 	reconnect.backoff.ms = 50
  2> 	request.timeout.ms = 60000
  2> 	retries = 2147483647
  2> 	retry.backoff.max.ms = 1000
  2> 	retry.backoff.ms = 500
  2> 	sasl.client.callback.handler.class = null
  2> 	sasl.jaas.config = null
  2> 	sasl.kerberos.kinit.cmd = /usr/bin/kinit
  2> 	sasl.kerberos.min.time.before.relogin = 60000
  2> 	sasl.kerberos.service.name = null
  2> 	sasl.kerberos.ticket.renew.jitter = 0.05
  2> 	sasl.kerberos.ticket.renew.window.factor = 0.8
  2> 	sasl.login.callback.handler.class = null
  2> 	sasl.login.class = null
  2> 	sasl.login.connect.timeout.ms = null
  2> 	sasl.login.read.timeout.ms = null
  2> 	sasl.login.refresh.buffer.seconds = 300
  2> 	sasl.login.refresh.min.period.seconds = 60
  2> 	sasl.login.refresh.window.factor = 0.8
  2> 	sasl.login.refresh.window.jitter = 0.05
  2> 	sasl.login.retry.backoff.max.ms = 10000
  2> 	sasl.login.retry.backoff.ms = 100
  2> 	sasl.mechanism = GSSAPI
  2> 	sasl.oauthbearer.assertion.algorithm = RS256
  2> 	sasl.oauthbearer.assertion.claim.aud = null
  2> 	sasl.oauthbearer.assertion.claim.exp.seconds = 300
  2> 	sasl.oauthbearer.assertion.claim.iss = null
  2> 	sasl.oauthbearer.assertion.claim.jti.include = false
  2> 	sasl.oauthbearer.assertion.claim.nbf.seconds = 60
  2> 	sasl.oauthbearer.assertion.claim.sub = null
  2> 	sasl.oauthbearer.assertion.file = null
  2> 	sasl.oauthbearer.assertion.private.key.file = null
  2> 	sasl.oauthbearer.assertion.private.key.passphrase = null
  2> 	sasl.oauthbearer.assertion.template.file = null
  2> 	sasl.oauthbearer.client.credentials.client.id = null
  2> 	sasl.oauthbearer.client.credentials.client.secret = null
  2> 	sasl.oauthbearer.clock.skew.seconds = 30
  2> 	sasl.oauthbearer.expected.audience = []
  2> 	sasl.oauthbearer.expected.issuer = null
  2> 	sasl.oauthbearer.header.urlencode = false
  2> 	sasl.oauthbearer.jwks.endpoint.refresh.ms = 3600000
  2> 	sasl.oauthbearer.jwks.endpoint.retry.backoff.max.ms = 10000
  2> 	sasl.oauthbearer.jwks.endpoint.retry.backoff.ms = 100
  2> 	sasl.oauthbearer.jwks.endpoint.url = null
  2> 	sasl.oauthbearer.jwt.retriever.class = class org.apache.kafka.common.security.oauthbearer.DefaultJwtRetriever
  2> 	sasl.oauthbearer.jwt.validator.class = class org.apache.kafka.common.security.oauthbearer.DefaultJwtValidator
  2> 	sasl.oauthbearer.scope = null
  2> 	sasl.oauthbearer.scope.claim.name = scope
  2> 	sasl.oauthbearer.sub.claim.name = sub
  2> 	sasl.oauthbearer.token.endpoint.url = null
  2> 	security.protocol = PLAINTEXT
  2> 	security.providers = null
  2> 	send.buffer.bytes = 131072
  2> 	socket.connection.setup.timeout.max.ms = 30000
  2> 	socket.connection.setup.timeout.ms = 10000
  2> 	ssl.cipher.suites = []
  2> 	ssl.enabled.protocols = [TLSv1.2, TLSv1.3]
  2> 	ssl.endpoint.identification.algorithm = https
  2> 	ssl.engine.factory.class = null
  2> 	ssl.key.password = null
  2> 	ssl.keymanager.algorithm = SunX509
  2> 	ssl.keystore.certificate.chain = null
  2> 	ssl.keystore.key = null
  2> 	ssl.keystore.location = null
  2> 	ssl.keystore.password = null
  2> 	ssl.keystore.type = JKS
  2> 	ssl.protocol = TLSv1.3
  2> 	ssl.provider = null
  2> 	ssl.secure.random.implementation = null
  2> 	ssl.trustmanager.algorithm = PKIX
  2> 	ssl.truststore.certificates = null
  2> 	ssl.truststore.location = null
  2> 	ssl.truststore.password = null
  2> 	ssl.truststore.type = JKS
  2> 	transaction.timeout.ms = 60000
  2> 	transaction.two.phase.commit.enable = false
  2> 	transactional.id = null
  2> 	value.serializer = class org.apache.solr.crossdc.common.MirroredSolrRequestSerializer
  2> 
  2> 11740 INFO  (qtp1657393152-193-null-5) [n:127.0.0.1:33513_solr c:collection1 s:shard1 r:core_node2 x:collection1_shard1_replica_n1 t:null-5] o.a.k.c.t.i.KafkaMetricsCollector initializing Kafka metrics collector
  2> 11749 INFO  (qtp1657393152-193-null-5) [n:127.0.0.1:33513_solr c:collection1 s:shard1 r:core_node2 x:collection1_shard1_replica_n1 t:null-5] o.a.k.c.p.KafkaProducer [Producer clientId=producer-1] Instantiated an idempotent producer.
  2> 11762 INFO  (qtp1657393152-193-null-5) [n:127.0.0.1:33513_solr c:collection1 s:shard1 r:core_node2 x:collection1_shard1_replica_n1 t:null-5] o.a.k.c.u.AppInfoParser Kafka version: 4.3.1
  2> 11762 INFO  (qtp1657393152-193-null-5) [n:127.0.0.1:33513_solr c:collection1 s:shard1 r:core_node2 x:collection1_shard1_replica_n1 t:null-5] o.a.k.c.u.AppInfoParser Kafka commitId: 26b251a451ce941d
  2> 11762 INFO  (qtp1657393152-193-null-5) [n:127.0.0.1:33513_solr c:collection1 s:shard1 r:core_node2 x:collection1_shard1_replica_n1 t:null-5] o.a.k.c.u.AppInfoParser Kafka startTimeMs: 1790632733046
  2> 11770 INFO  (qtp1657393152-193-null-5) [n:127.0.0.1:33513_solr c:collection1 s:shard1 r:core_node2 x:collection1_shard1_replica_n1 t:null-5] o.a.k.c.c.AbstractConfig ConsumerConfig values: 
  2> 	allow.auto.create.topics = true
  2> 	auto.commit.interval.ms = 5000
  2> 	auto.offset.reset = earliest
  2> 	bootstrap.servers = [localhost:35213]
  2> 	check.crcs = true
  2> 	client.dns.lookup = use_all_dns_ips
  2> 	client.id = consumer-SolrCrossDCManager-1
  2> 	client.rack = 
  2> 	config.providers = []
  2> 	connections.max.idle.ms = 540000
  2> 	default.api.timeout.ms = 60000
  2> 	enable.auto.commit = false
  2> 	enable.metrics.push = true
  2> 	exclude.internal.topics = true
  2> 	fetch.max.bytes = 100663296
  2> 	fetch.max.wait.ms = 500
  2> 	fetch.min.bytes = 1
  2> 	group.id = SolrCrossDCManager
  2> 	group.instance.id = null
  2> 	group.protocol = classic
  2> 	group.remote.assignor = null
  2> 	heartbeat.interval.ms = 3000
  2> 	interceptor.classes = []
  2> 	internal.throw.on.fetch.stable.offset.unsupported = false
  2> 	isolation.level = read_uncommitted
  2> 	key.deserializer = class org.apache.kafka.common.serialization.StringDeserializer
  2> 	max.partition.fetch.bytes = 1048576
  2> 	max.poll.interval.ms = 90000
  2> 	max.poll.records = 500
  2> 	metadata.max.age.ms = 300000
  2> 	metadata.recovery.rebootstrap.trigger.ms = 300000
  2> 	metadata.recovery.strategy = rebootstrap
  2> 	metric.reporters = [org.apache.kafka.common.metrics.JmxReporter]
  2> 	metrics.num.samples = 2
  2> 	metrics.recording.level = INFO
  2> 	metrics.sample.window.ms = 30000
  2> 	partition.assignment.strategy = [class org.apache.kafka.clients.consumer.RangeAssignor, class org.apache.kafka.clients.consumer.CooperativeStickyAssignor]
  2> 	receive.buffer.bytes = 65536
  2> 	reconnect.backoff.max.ms = 1000
  2> 	reconnect.backoff.ms = 50
  2> 	request.timeout.ms = 60000
  2> 	retry.backoff.max.ms = 1000
  2> 	retry.backoff.ms = 100
  2> 	sasl.client.callback.handler.class = null
  2> 	sasl.jaas.config = null
  2> 	sasl.kerberos.kinit.cmd = /usr/bin/kinit
  2> 	sasl.kerberos.min.time.before.relogin = 60000
  2> 	sasl.kerberos.service.name = null
  2> 	sasl.kerberos.ticket.renew.jitter = 0.05
  2> 	sasl.kerberos.ticket.renew.window.factor = 0.8
  2> 	sasl.login.callback.handler.class = null
  2> 	sasl.login.class = null
  2> 	sasl.login.connect.timeout.ms = null
  2> 	sasl.login.read.timeout.ms = null
  2> 	sasl.login.refresh.buffer.seconds = 300
  2> 	sasl.login.refresh.min.period.seconds = 60
  2> 	sasl.login.refresh.window.factor = 0.8
  2> 	sasl.login.refresh.window.jitter = 0.05
  2> 	sasl.login.retry.backoff.max.ms = 10000
  2> 	sasl.login.retry.backoff.ms = 100
  2> 	sasl.mechanism = GSSAPI
  2> 	sasl.oauthbearer.assertion.algorithm = RS256
  2> 	sasl.oauthbearer.assertion.claim.aud = null
  2> 	sasl.oauthbearer.assertion.claim.exp.seconds = 300
  2> 	sasl.oauthbearer.assertion.claim.iss = null
  2> 	sasl.oauthbearer.assertion.claim.jti.include = false
  2> 	sasl.oauthbearer.assertion.claim.nbf.seconds = 60
  2> 	sasl.oauthbearer.assertion.claim.sub = null
  2> 	sasl.oauthbearer.assertion.file = null
  2> 	sasl.oauthbearer.assertion.private.key.file = null
  2> 	sasl.oauthbearer.assertion.private.key.passphrase = null
  2> 	sasl.oauthbearer.assertion.template.file = null
  2> 	sasl.oauthbearer.client.credentials.client.id = null
  2> 	sasl.oauthbearer.client.credentials.client.secret = null
  2> 	sasl.oauthbearer.clock.skew.seconds = 30
  2> 	sasl.oauthbearer.expected.audience = []
  2> 	sasl.oauthbearer.expected.issuer = null
  2> 	sasl.oauthbearer.header.urlencode = false
  2> 	sasl.oauthbearer.jwks.endpoint.refresh.ms = 3600000
  2> 	sasl.oauthbearer.jwks.endpoint.retry.backoff.max.ms = 10000
  2> 	sasl.oauthbearer.jwks.endpoint.retry.backoff.ms = 100
  2> 	sasl.oauthbearer.jwks.endpoint.url = null
  2> 	sasl.oauthbearer.jwt.retriever.class = class org.apache.kafka.common.security.oauthbearer.DefaultJwtRetriever
  2> 	sasl.oauthbearer.jwt.validator.class = class org.apache.kafka.common.security.oauthbearer.DefaultJwtValidator
  2> 	sasl.oauthbearer.scope = null
  2> 	sasl.oauthbearer.scope.claim.name = scope
  2> 	sasl.oauthbearer.sub.claim.name = sub
  2> 	sasl.oauthbearer.token.endpoint.url = null
  2> 	security.protocol = PLAINTEXT
  2> 	security.providers = null
  2> 	send.buffer.bytes = 131072
  2> 	session.timeout.ms = 10000
  2> 	share.acknowledgement.mode = implicit
  2> 	share.acquire.mode = BATCH_OPTIMIZED
  2> 	socket.connection.setup.timeout.max.ms = 30000
  2> 	socket.connection.setup.timeout.ms = 10000
  2> 	ssl.cipher.suites = []
  2> 	ssl.enabled.protocols = [TLSv1.2, TLSv1.3]
  2> 	ssl.endpoint.identification.algorithm = https
  2> 	ssl.engine.factory.class = null
  2> 	ssl.key.password = null
  2> 	ssl.keymanager.algorithm = SunX509
  2> 	ssl.keystore.certificate.chain = null
  2> 	ssl.keystore.key = null
  2> 	ssl.keystore.location = null
  2> 	ssl.keystore.password = null
  2> 	ssl.keystore.type = JKS
  2> 	ssl.protocol = TLSv1.3
  2> 	ssl.provider = null
  2> 	ssl.secure.random.implementation = null
  2> 	ssl.trustmanager.algorithm = PKIX
  2> 	ssl.truststore.certificates = null
  2> 	ssl.truststore.location = null
  2> 	ssl.truststore.password = null
  2> 	ssl.truststore.type = JKS
  2> 	value.deserializer = class org.apache.solr.crossdc.common.MirroredSolrRequestSerializer
  2> 
  2> 11771 INFO  (kafka-producer-network-thread | producer-1) [] o.a.k.c.Metadata [Producer clientId=producer-1] Cluster ID: 4L6g3nShT-eMCtK--X86sw
  2> 11777 INFO  (qtp1657393152-193-null-5) [n:127.0.0.1:33513_solr c:collection1 s:shard1 r:core_node2 x:collection1_shard1_replica_n1 t:null-5] o.a.k.c.t.i.KafkaMetricsCollector initializing Kafka metrics collector
  2> 11788 INFO  (qtp1657393152-193-null-5) [n:127.0.0.1:33513_solr c:collection1 s:shard1 r:core_node2 x:collection1_shard1_replica_n1 t:null-5] o.a.k.c.c.i.ClassicKafkaConsumer [Consumer clientId=consumer-SolrCrossDCManager-1, groupId=SolrCrossDCManager] 
  2> ****************************************************************
  2> * The consumer rebalance protocol (KIP-848) is production-ready!
  2> * Set the consumer configuration group.protocol=consumer to try it out.
  2> * See https://kafka.apache.org/documentation/#consumer_rebalance_protocol
  2> ****************************************************************
  2> 11808 INFO  (qtp1657393152-193-null-5) [n:127.0.0.1:33513_solr c:collection1 s:shard1 r:core_node2 x:collection1_shard1_replica_n1 t:null-5] o.a.k.c.u.AppInfoParser Kafka version: 4.3.1
  2> 11808 INFO  (qtp1657393152-193-null-5) [n:127.0.0.1:33513_solr c:collection1 s:shard1 r:core_node2 x:collection1_shard1_replica_n1 t:null-5] o.a.k.c.u.AppInfoParser Kafka commitId: 26b251a451ce941d
  2> 11808 INFO  (qtp1657393152-193-null-5) [n:127.0.0.1:33513_solr c:collection1 s:shard1 r:core_node2 x:collection1_shard1_replica_n1 t:null-5] o.a.k.c.u.AppInfoParser Kafka startTimeMs: 1790632733092
  2> 11813 INFO  (qtp1657393152-193-null-5) [n:127.0.0.1:33513_solr c:collection1 s:shard1 r:core_node2 x:collection1_shard1_replica_n1 t:null-5] o.a.k.c.Metadata [Consumer clientId=consumer-SolrCrossDCManager-1, groupId=SolrCrossDCManager] Cluster ID: 4L6g3nShT-eMCtK--X86sw
  2> 11818 INFO  (qtp1657393152-193-null-5) [n:127.0.0.1:33513_solr c:collection1 s:shard1 r:core_node2 x:collection1_shard1_replica_n1 t:null-5] o.a.s.h.ReplicationHandler Commits will be reserved for 10000 ms
  2> 11820 INFO  (searcherExecutor-118-thread-1-processing-127.0.0.1:33513_solr collection1_shard1_replica_n1 null-5 collection1 shard1 core_node2) [n:127.0.0.1:33513_solr c:collection1 s:shard1 r:core_node2 x:collection1_shard1_replica_n1 t:null-5] o.a.s.c.SolrCore Registered new searcher autowarm time: 0 ms
  2> 11823 INFO  (qtp1657393152-193-null-5) [n:127.0.0.1:33513_solr c:collection1 s:shard1 r:core_node2 x:collection1_shard1_replica_n1 t:null-5] o.a.s.c.ZkShardTerms Successful update of terms at /collections/collection1/terms/shard1 to Terms{values={core_node2=0}, version=0} for registerTerm
  2> 11824 INFO  (qtp1657393152-193-null-5) [n:127.0.0.1:33513_solr c:collection1 s:shard1 r:core_node2 x:collection1_shard1_replica_n1 t:null-5] o.a.s.c.ShardLeaderElectionContextBase make sure parent is created /collections/collection1/leaders/shard1
  2> 11830 INFO  (qtp1657393152-193-null-5) [n:127.0.0.1:33513_solr c:collection1 s:shard1 r:core_node2 x:collection1_shard1_replica_n1 t:null-5] o.a.s.c.ShardLeaderElectionContext Enough replicas found to continue.
  2> 11830 INFO  (qtp1657393152-193-null-5) [n:127.0.0.1:33513_solr c:collection1 s:shard1 r:core_node2 x:collection1_shard1_replica_n1 t:null-5] o.a.s.c.ShardLeaderElectionContext I may be the new leader - try and sync
  2> 11831 INFO  (qtp1657393152-193-null-5) [n:127.0.0.1:33513_solr c:collection1 s:shard1 r:core_node2 x:collection1_shard1_replica_n1 t:null-5] o.a.s.c.SyncStrategy Sync replicas to http://127.0.0.1:33513/solr/collection1_shard1_replica_n1/
  2> 11831 INFO  (qtp1657393152-193-null-5) [n:127.0.0.1:33513_solr c:collection1 s:shard1 r:core_node2 x:collection1_shard1_replica_n1 t:null-5] o.a.s.c.SyncStrategy Sync Success - now sync replicas to me
  2> 11831 INFO  (qtp1657393152-193-null-5) [n:127.0.0.1:33513_solr c:collection1 s:shard1 r:core_node2 x:collection1_shard1_replica_n1 t:null-5] o.a.s.c.SyncStrategy http://127.0.0.1:33513/solr/collection1_shard1_replica_n1/ has no replicas
  2> 11831 INFO  (qtp1657393152-193-null-5) [n:127.0.0.1:33513_solr c:collection1 s:shard1 r:core_node2 x:collection1_shard1_replica_n1 t:null-5] o.a.s.c.ShardLeaderElectionContextBase Creating leader registration node /collections/collection1/leaders/shard1/leader after winning as /collections/collection1/leader_elect/shard1/election/72089654984638469-core_node2-n_0000000000
  2> 11936 INFO  (zkCallback-101-thread-2) [] o.a.s.c.c.ZkStateReader A cluster state change: [WatchedEvent state:SyncConnected type:NodeDataChanged path:/collections/collection1/state.json zxid: -1] for collection [collection1] has occurred - updating... (live nodes size: [1])
  2> 11937 INFO  (qtp1657393152-193-null-5) [n:127.0.0.1:33513_solr c:collection1 s:shard1 r:core_node2 x:collection1_shard1_replica_n1 t:null-5] o.a.s.c.ShardLeaderElectionContext I am the new leader: http://127.0.0.1:33513/solr/collection1_shard1_replica_n1/ shard1
  2> 11940 INFO  (qtp1657393152-193-null-5) [n:127.0.0.1:33513_solr c:collection1 s:shard1 r:core_node2 x:collection1_shard1_replica_n1 t:null-5] o.a.s.c.ZkController I am the leader, no recovery necessary
  2> 11943 INFO  (qtp1657393152-193-null-5) [n:127.0.0.1:33513_solr t:null-5] o.a.s.s.HttpSolrCall [admin] path=/admin/cores params={coreNodeName=core_node2&collection.configName=conf&newCollection=true&name=collection1_shard1_replica_n1&action=CREATE&numShards=1&collection=collection1&shard=shard1&wt=javabin&replicaType=NRT} status=0 QTime=313
  2> 11946 INFO  (qtp1657393152-190-null-4) [n:127.0.0.1:33513_solr c:collection1 t:null-4] o.a.s.h.a.CollectionsHandler Wait for new collection to be active for at most 45 seconds. Check all shard replicas
  2> 12043 INFO  (zkCallback-101-thread-1) [] o.a.s.c.c.ZkStateReader A cluster state change: [WatchedEvent state:SyncConnected type:NodeDataChanged path:/collections/collection1/state.json zxid: -1] for collection [collection1] has occurred - updating... (live nodes size: [1])
  2> 12044 INFO  (qtp1657393152-190-null-4) [n:127.0.0.1:33513_solr c:collection1 t:null-4] o.a.s.s.HttpSolrCall [admin] path=/admin/collections params={collection.configName=conf&name=collection1&nrtReplicas=1&action=CREATE&numShards=1&wt=javabin} status=0 QTime=537
  2> 12045 INFO  (SUITE-ZkConfigIntegrationTest-seed#[70BC127F4429CBD9]-worker) [] o.a.s.c.MiniSolrCloudCluster waitForActiveCollection: collection1
  2> 12046 INFO  (SUITE-ZkConfigIntegrationTest-seed#[70BC127F4429CBD9]-worker) [] o.a.s.c.MiniSolrCloudCluster Starting cluster of 1 servers in /home/jenkins/jenkins-agent/workspace/Solr/Solr-Test-main/solr/cross-dc-manager/build/tmp/tests-tmp/org.apache.solr.crossdc.manager.ZkConfigIntegrationTest_70BC127F4429CBD9-001/tempDir-002
  2> 12046 INFO  (SUITE-ZkConfigIntegrationTest-seed#[70BC127F4429CBD9]-worker) [] o.a.s.c.ZkTestServer STARTING ZK TEST SERVER
  2> 12047 INFO  (ZkTestServer Run Thread) [] o.a.s.c.ZkTestServer client port: /127.0.0.1:0
  2> 12047 INFO  (ZkTestServer Run Thread) [] o.a.s.c.ZkTestServer Starting server
  2> 12048 WARN  (ZkTestServer Run Thread) [] o.a.z.s.ServerCnxnFactory maxCnxns is not configured, using default value 0.
  2> 12147 INFO  (SUITE-ZkConfigIntegrationTest-seed#[70BC127F4429CBD9]-worker) [] o.a.s.c.ZkTestServer start zk server on port: 33829
  2> 12148 WARN  (SUITE-ZkConfigIntegrationTest-seed#[70BC127F4429CBD9]-worker) [] o.a.s.c.c.SolrZkClient Using default ZkCredentialsInjector. ZkCredentialsInjector is not secure, it creates an empty list of credentials which leads to 'OPEN_ACL_UNSAFE' ACLs to Zookeeper nodes
  2> 12148 WARN  (SUITE-ZkConfigIntegrationTest-seed#[70BC127F4429CBD9]-worker) [] o.a.s.c.c.SolrZkClient Using default ZkACLProvider. DefaultZkACLProvider is not secure, it creates 'OPEN_ACL_UNSAFE' ACLs to Zookeeper nodes
  2> 12149 INFO  (SUITE-ZkConfigIntegrationTest-seed#[70BC127F4429CBD9]-worker) [] o.a.c.f.i.CuratorFrameworkImpl Starting
  2> 12150 INFO  (SUITE-ZkConfigIntegrationTest-seed#[70BC127F4429CBD9]-worker) [] o.a.c.f.i.CuratorFrameworkImpl Default schema
  2> 12151 INFO  (SUITE-ZkConfigIntegrationTest-seed#[70BC127F4429CBD9]-worker-EventThread) [] o.a.c.f.s.ConnectionStateManager State change: CONNECTED
  2> 12152 INFO  (SUITE-ZkConfigIntegrationTest-seed#[70BC127F4429CBD9]-worker-EventThread) [] o.a.c.f.i.EnsembleTracker New config event received: {}
  2> 12152 INFO  (SUITE-ZkConfigIntegrationTest-seed#[70BC127F4429CBD9]-worker-EventThread) [] o.a.c.f.i.EnsembleTracker New config event received: {}
  2> 12153 WARN  (SUITE-ZkConfigIntegrationTest-seed#[70BC127F4429CBD9]-worker) [] o.a.s.c.c.SolrZkClient Using default ZkCredentialsInjector. ZkCredentialsInjector is not secure, it creates an empty list of credentials which leads to 'OPEN_ACL_UNSAFE' ACLs to Zookeeper nodes
  2> 12153 WARN  (SUITE-ZkConfigIntegrationTest-seed#[70BC127F4429CBD9]-worker) [] o.a.s.c.c.SolrZkClient Using default ZkACLProvider. DefaultZkACLProvider is not secure, it creates 'OPEN_ACL_UNSAFE' ACLs to Zookeeper nodes
  2> 12153 INFO  (SUITE-ZkConfigIntegrationTest-seed#[70BC127F4429CBD9]-worker) [] o.a.c.

[...truncated too long message...]

ava.net.URLPermission:
	java.util.ServiceConfigurationError: Locale provider adapter "CLDR"cannot be instantiated.
java.security.policy: error adding Permission, java.net.URLPermission:
	java.util.ServiceConfigurationError: Locale provider adapter "CLDR"cannot be instantiated.
java.security.policy: error adding Permission, java.net.URLPermission:
	java.util.ServiceConfigurationError: Locale provider adapter "CLDR"cannot be instantiated.
java.security.policy: error adding Permission, java.net.URLPermission:
	java.util.ServiceConfigurationError: Locale provider adapter "CLDR"cannot be instantiated.
java.security.policy: error adding Permission, java.net.URLPermission:
	java.util.ServiceConfigurationError: Locale provider adapter "CLDR"cannot be instantiated.
java.security.policy: error adding Permission, java.net.URLPermission:
	java.util.ServiceConfigurationError: Locale provider adapter "CLDR"cannot be instantiated.
java.security.policy: error adding Permission, java.net.URLPermission:
	java.util.ServiceConfigurationError: Locale provider adapter "CLDR"cannot be instantiated.
java.security.policy: error adding Permission, java.net.URLPermission:
	java.util.ServiceConfigurationError: Locale provider adapter "CLDR"cannot be instantiated.
java.security.policy: error adding Permission, java.net.URLPermission:
java.security.policy: error adding Permission, java.net.URLPermission:
	java.util.ServiceConfigurationError: Locale provider adapter "CLDR"cannot be instantiated.
	java.util.ServiceConfigurationError: Locale provider adapter "CLDR"cannot be instantiated.
java.security.policy: error adding Permission, java.net.URLPermission:
	java.util.ServiceConfigurationError: Locale provider adapter "CLDR"cannot be instantiated.
java.security.policy: error adding Permission, java.net.URLPermission:
	java.util.ServiceConfigurationError: Locale provider adapter "CLDR"cannot be instantiated.
java.security.policy: error adding Permission, java.net.URLPermission:
	java.util.ServiceConfigurationError: Locale provider adapter "CLDR"cannot be instantiated.
java.security.policy: error adding Permission, java.net.URLPermission:
	java.util.ServiceConfigurationError: Locale provider adapter "CLDR"cannot be instantiated.
java.security.policy: error adding Permission, java.net.URLPermission:
	java.util.ServiceConfigurationError: Locale provider adapter "CLDR"cannot be instantiated.
java.security.policy: error adding Permission, java.net.URLPermission:
	java.util.ServiceConfigurationError: Locale provider adapter "CLDR"cannot be instantiated.
java.security.policy: error adding Permission, java.net.URLPermission:
	java.util.ServiceConfigurationError: Locale provider adapter "CLDR"cannot be instantiated.
java.security.policy: error adding Permission, java.net.URLPermission:
	java.util.ServiceConfigurationError: Locale provider adapter "CLDR"cannot be instantiated.
:solr:modules:scripting:test (SUCCESS): 24 test(s), 19 skipped

> Task :solr:modules:scripting:wipeTaskTemp
> Task :solr:modules:sql:compileTestJava
> Task :solr:modules:sql:copySolrCoreTestResources
> Task :solr:modules:sql:processTestResources
> Task :solr:modules:sql:testClasses

> Task :solr:modules:sql:test
WARNING: Using incubator modules: jdk.incubator.vector
WARNING: Using incubator modules: jdk.incubator.vector
WARNING: Using incubator modules: jdk.incubator.vector
WARNING: A command line option has enabled the Security Manager
WARNING: The Security Manager is deprecated and will be removed in a future release
WARNING: A command line option has enabled the Security Manager
WARNING: The Security Manager is deprecated and will be removed in a future release
WARNING: A command line option has enabled the Security Manager
WARNING: The Security Manager is deprecated and will be removed in a future release
java.security.policy: error adding Permission, java.net.URLPermission:
	java.util.ServiceConfigurationError: Locale provider adapter "CLDR"cannot be instantiated.
java.security.policy: error adding Permission, java.net.URLPermission:
	java.util.ServiceConfigurationError: Locale provider adapter "CLDR"cannot be instantiated.
java.security.policy: error adding Permission, java.net.URLPermission:
	java.util.ServiceConfigurationError: Locale provider adapter "CLDR"cannot be instantiated.
java.security.policy: error adding Permission, java.net.URLPermission:
	java.util.ServiceConfigurationError: Locale provider adapter "CLDR"cannot be instantiated.
java.security.policy: error adding Permission, java.net.URLPermission:
	java.util.ServiceConfigurationError: Locale provider adapter "CLDR"cannot be instantiated.
java.security.policy: error adding Permission, java.net.URLPermission:
	java.util.ServiceConfigurationError: Locale provider adapter "CLDR"cannot be instantiated.
java.security.policy: error adding Permission, java.net.URLPermission:
	java.util.ServiceConfigurationError: Locale provider adapter "CLDR"cannot be instantiated.
java.security.policy: error adding Permission, java.net.URLPermission:
	java.util.ServiceConfigurationError: Locale provider adapter "CLDR"cannot be instantiated.
java.security.policy: error adding Permission, java.net.URLPermission:
	java.util.ServiceConfigurationError: Locale provider adapter "CLDR"cannot be instantiated.
java.security.policy: error adding Permission, java.net.URLPermission:
	java.util.ServiceConfigurationError: Locale provider adapter "CLDR"cannot be instantiated.
java.security.policy: error adding Permission, java.net.URLPermission:
	java.util.ServiceConfigurationError: Locale provider adapter "CLDR"cannot be instantiated.
java.security.policy: error adding Permission, java.net.URLPermission:
	java.util.ServiceConfigurationError: Locale provider adapter "CLDR"cannot be instantiated.
java.security.policy: error adding Permission, java.net.URLPermission:
	java.util.ServiceConfigurationError: Locale provider adapter "CLDR"cannot be instantiated.
java.security.policy: error adding Permission, java.net.URLPermission:
	java.util.ServiceConfigurationError: Locale provider adapter "CLDR"cannot be instantiated.
java.security.policy: error adding Permission, java.net.URLPermission:
	java.util.ServiceConfigurationError: Locale provider adapter "CLDR"cannot be instantiated.
:solr:modules:sql:test (SUCCESS): 36 test(s)

> Task :checkWorkingCopyClean
> Task :solr:modules:sql:wipeTaskTemp
ERROR: The following test(s) have failed:
  - org.apache.solr.crossdc.manager.ZkConfigIntegrationTest (:solr:cross-dc-manager)
    Test history: https://develocity.apache.org/scans/tests?search.rootProjectNames=solr-root&tests.container=org.apache.solr.crossdc.manager.ZkConfigIntegrationTest
    Test output: /home/jenkins/jenkins-agent/workspace/Solr/Solr-Test-main/solr/cross-dc-manager/build/test-results/test/outputs/OUTPUT-org.apache.solr.crossdc.manager.ZkConfigIntegrationTest.txt
    Reproduce with: ./gradlew :solr:cross-dc-manager:test --tests "org.apache.solr.crossdc.manager.ZkConfigIntegrationTest" -Ptests.haltonfailure=false "-Ptests.jvmargs=-XX:TieredStopAtLevel=1 -XX:+UseParallelGC -XX:ActiveProcessorCount=1 -XX:ReservedCodeCacheSize=120m" -Ptests.seed=70BC127F4429CBD9 -Ptests.multiplier=2 -Ptests.useSecurityManager=true -Ptests.badapples=false -Ptests.file.encoding=ISO-8859-1

  - null.Gradle Test Run :solr:cross-dc-manager:test (:solr:cross-dc-manager)
    Test history: https://develocity.apache.org/scans/tests?search.rootProjectNames=solr-root&tests.container=null&tests.test=Gradle Test Run :solr:cross-dc-manager:test http://fucit.org/solr-jenkins-reports/history-trend-of-recent-failures.html#series/null.Gradle Test Run :solr:cross-dc-manager:test
    Test output: /home/jenkins/jenkins-agent/workspace/Solr/Solr-Test-main/solr/cross-dc-manager/build/test-results/test/outputs/OUTPUT-Gradle Test Run _solr_cross-dc-manager_test.txt
    Reproduce with: ./gradlew :solr:cross-dc-manager:test --tests "null.Gradle Test Run :solr:cross-dc-manager:test" -Ptests.haltonfailure=false "-Ptests.jvmargs=-XX:TieredStopAtLevel=1 -XX:+UseParallelGC -XX:ActiveProcessorCount=1 -XX:ReservedCodeCacheSize=120m" -Ptests.seed=70BC127F4429CBD9 -Ptests.multiplier=2 -Ptests.useSecurityManager=true -Ptests.badapples=false -Ptests.file.encoding=ISO-8859-1


[Incubating] Problems report is available at: file:///home/jenkins/jenkins-agent/workspace/Solr/Solr-Test-main/build/reports/problems/problems-report.html

FAILURE: Build failed with an exception.

* What went wrong:
Execution failed for task ':solr:cross-dc-manager:test' (registered by plugin 'org.gradle.jvm-test-suite').
> Test process encountered an unexpected problem.
   > An internal test structure error occurred. Please file a new issue on https://github.com/gradle/gradle/issues, and if possible include the test class causing this failure.

* Try:
> Check common problems https://docs.gradle.org/9.7.0/userguide/java_testing.html#sec:java_testing_troubleshooting.
> Run with --stacktrace option to get the stack trace.
> Run with --info or --debug option to get more log output.
> Get more help at https://help.gradle.org.

Deprecated Gradle features were used in this build, making it incompatible with Gradle 10.

You can use '--warning-mode all' to show the individual deprecation warnings and determine if they come from your own scripts or plugins.

For more on this, please refer to https://docs.gradle.org/9.7.0/userguide/command_line_interface.html#sec:command_line_warnings in the Gradle documentation.

BUILD FAILED in 42m 5s
159 actionable tasks: 159 executed

Publishing Build Scan to Develocity...

The Develocity server (develocity.apache.org) rejected the credential with prefix '7x3jzizm4zpygv7psbkg6byvm4'.
Your credential has expired.

Build step 'Invoke Gradle script' changed build result to FAILURE
Build step 'Invoke Gradle script' marked build as failure
Archiving artifacts
Recording test results
[Checks API] No suitable checks publisher found.
Email was triggered for: Failure - Any
Sending email for trigger: Failure - Any