You are viewing a plain text version of this content. The canonical link for it is here.
Posted to builds@cassandra.apache.org by Apache Jenkins Server <je...@builds.apache.org> on 2024/12/17 06:19:22 UTC

Build complete: Cassandra-trunk #1964 [UNSTABLE] 849245a5620f34566ae999fed94bf10c971870f2

-------------------------------------------------------------------------------
  Build Cassandra-trunk #1964 Still Unstable
  URL: https://ci-cassandra.apache.org/job/Cassandra-trunk/1964/
  -------------------------------------------------------------------------------
  Changes:
  No changes

  -------------------------------------------------------------------------------
  Failed Tests:
  534 tests failed.
FAILED:  dtest-large.snitch_test.TestDynamicEndpointSnitch.Tests / dtest-large jdk11 6/8 / test_multidatacenter_local_quorum
FAILED:  dtest-latest.cqlsh_tests.test_cqlsh_copy.TestCqlshCopy.Tests / dtest-latest jdk11 57/64 / test_bulk_round_trip_non_prepared_statements
FAILED:  dtest-latest.cqlsh_tests.test_cqlsh_copy.TestCqlshCopy.Tests / dtest-latest jdk17 63/64 / test_bulk_round_trip_with_backoff
FAILED:  dtest-latest.disk_balance_test.TestDiskBalance.Tests / dtest-latest jdk11 40/64 / test_disk_balance_after_boundary_change_stcs
FAILED:  dtest-latest.disk_balance_test.TestDiskBalance.Tests / dtest-latest jdk11 42/64 / test_disk_balance_after_joining_ring_stcs
FAILED:  dtest-latest.disk_balance_test.TestDiskBalance.Tests / dtest-latest jdk11 42/64 / test_disk_balance_after_joining_ring_stcs
FAILED:  dtest-latest.read_repair_test.TestSpeculativeReadRepair.Tests / dtest-latest jdk11 59/64 / test_failed_read_repair
FAILED:  dtest-latest.read_repair_test.TestSpeculativeReadRepair.Tests / dtest-latest jdk11 63/64 / test_quorum_requirement
FAILED:  dtest-latest.read_repair_test.TestSpeculativeReadRepair.Tests / dtest-latest jdk17 64/64 / test_quorum_requirement_on_speculated_read
FAILED:  dtest-latest.read_repair_test.TestSpeculativeReadRepair.Tests / dtest-latest jdk11 64/64 / test_quorum_requirement_on_speculated_read
FAILED:  dtest-latest.read_repair_test.TestSpeculativeReadRepair.Tests / dtest-latest jdk11 62/64 / test_speculative_write
FAILED:  dtest-latest.snapshot_test.TestArchiveCommitlog.Tests / dtest-latest jdk11 20/64 / test_archive_commitlog_point_in_time
FAILED:  dtest-latest.snapshot_test.TestArchiveCommitlog.Tests / dtest-latest jdk11 21/64 / test_archive_commitlog_point_in_time_ln
FAILED:  dtest-latest.snapshot_test.TestArchiveCommitlog.Tests / dtest-latest jdk11 19/64 / test_dont_archive_commitlog
FAILED:  dtest-latest.topology_test.TestTopology.Tests / dtest-latest jdk17 63/64 / test_decommissioned_node_cant_rejoin
FAILED:  dtest-novnode.gossip_test.TestGossip.Tests / dtest-novnode jdk11 55/64 / test_assassinate_valid_node
FAILED:  dtest-novnode.materialized_views_test.TestMaterializedViews.Tests / dtest-novnode jdk11 58/64 / test_interrupt_build_process
FAILED:  dtest.cqlsh_tests.test_cqlsh_copy.TestCqlshCopy.Tests / dtest jdk17 62/64 / test_bulk_round_trip_with_single_core
FAILED:  org.apache.cassandra.db.commitlog.CommitLogSegmentManagerCDCTest.Tests / test-latest jdk11 3/8 / testSwitchingCDCWriteModes-cassandra.testtag_IS_UNDEFINED
FAILED:  org.apache.cassandra.db.commitlog.CommitlogShutdownTest.Tests / test-oa jdk11 4/8 / testShutdownWithPendingTasks-oa_jdk11_x86_64
FAILED:  dtest-large-latest.consistency_test.TestAccuracy.Tests / dtest-large-latest jdk11 7/8 / test_network_topology_strategy_counters
FAILED:  dtest-large-latest.consistency_test.TestAccuracy.Tests / dtest-large-latest jdk11 7/8 / test_network_topology_strategy_counters
FAILED:  dtest-large-latest.consistency_test.TestAccuracy.Tests / dtest-large-latest jdk17 7/8 / test_network_topology_strategy_counters
FAILED:  dtest-large-latest.consistency_test.TestAccuracy.Tests / dtest-large-latest jdk17 7/8 / test_network_topology_strategy_counters
FAILED:  dtest-large-latest.consistency_test.TestAccuracy.Tests / dtest-large-latest jdk17 8/8 / test_network_topology_strategy_each_quorum_counters
FAILED:  dtest-large-latest.consistency_test.TestAccuracy.Tests / dtest-large-latest jdk17 8/8 / test_network_topology_strategy_each_quorum_counters
FAILED:  dtest-large-latest.consistency_test.TestAccuracy.Tests / dtest-large-latest jdk11 8/8 / test_network_topology_strategy_each_quorum_counters
FAILED:  dtest-large-latest.consistency_test.TestAccuracy.Tests / dtest-large-latest jdk11 8/8 / test_network_topology_strategy_each_quorum_counters
FAILED:  dtest-large-latest.consistency_test.TestAccuracy.Tests / dtest-large-latest jdk17 6/8 / test_network_topology_strategy_each_quorum_users
FAILED:  dtest-large-latest.consistency_test.TestAccuracy.Tests / dtest-large-latest jdk17 6/8 / test_network_topology_strategy_each_quorum_users
FAILED:  dtest-large-latest.consistency_test.TestAccuracy.Tests / dtest-large-latest jdk11 6/8 / test_network_topology_strategy_each_quorum_users
FAILED:  dtest-large-latest.consistency_test.TestAccuracy.Tests / dtest-large-latest jdk11 6/8 / test_network_topology_strategy_each_quorum_users
FAILED:  dtest-large-latest.consistency_test.TestAccuracy.Tests / dtest-large-latest jdk17 5/8 / test_network_topology_strategy_users
FAILED:  dtest-large-latest.consistency_test.TestAccuracy.Tests / dtest-large-latest jdk11 5/8 / test_network_topology_strategy_users
FAILED:  dtest-large-latest.consistency_test.TestAccuracy.Tests / dtest-large-latest jdk11 5/8 / test_network_topology_strategy_users
FAILED:  dtest-large-latest.consistency_test.TestAccuracy.Tests / dtest-large-latest jdk17 5/8 / test_network_topology_strategy_users
FAILED:  dtest-large-latest.consistency_test.TestAccuracy.Tests / dtest-large-latest jdk11 3/8 / test_simple_strategy_users
FAILED:  dtest-large-latest.consistency_test.TestAccuracy.Tests / dtest-large-latest jdk11 3/8 / test_simple_strategy_users
FAILED:  dtest-large-latest.consistency_test.TestAccuracy.Tests / dtest-large-latest jdk17 3/8 / test_simple_strategy_users
FAILED:  dtest-large-latest.consistency_test.TestAccuracy.Tests / dtest-large-latest jdk17 3/8 / test_simple_strategy_users
FAILED:  dtest-large-latest.consistency_test.TestAvailability.Tests / dtest-large-latest jdk17 1/8 / test_network_topology_strategy
FAILED:  dtest-large-latest.consistency_test.TestAvailability.Tests / dtest-large-latest jdk11 1/8 / test_network_topology_strategy
FAILED:  dtest-large-latest.consistency_test.TestAvailability.Tests / dtest-large-latest jdk11 1/8 / test_network_topology_strategy
FAILED:  dtest-large-latest.consistency_test.TestAvailability.Tests / dtest-large-latest jdk17 1/8 / test_network_topology_strategy
FAILED:  dtest-large-latest.consistency_test.TestAvailability.Tests / dtest-large-latest jdk11 2/8 / test_network_topology_strategy_each_quorum
FAILED:  dtest-large-latest.consistency_test.TestAvailability.Tests / dtest-large-latest jdk17 2/8 / test_network_topology_strategy_each_quorum
FAILED:  dtest-large-latest.consistency_test.TestAvailability.Tests / dtest-large-latest jdk17 2/8 / test_network_topology_strategy_each_quorum
FAILED:  dtest-large-latest.consistency_test.TestAvailability.Tests / dtest-large-latest jdk11 2/8 / test_network_topology_strategy_each_quorum
FAILED:  dtest-large-latest.materialized_views_test.TestMaterializedViews.Tests / dtest-large-latest jdk11 3/8 / test_add_dc_after_mv_network_replication
FAILED:  dtest-large-latest.materialized_views_test.TestMaterializedViews.Tests / dtest-large-latest jdk11 3/8 / test_add_dc_after_mv_network_replication
FAILED:  dtest-large-latest.materialized_views_test.TestMaterializedViews.Tests / dtest-large-latest jdk17 3/8 / test_add_dc_after_mv_network_replication
FAILED:  dtest-large-latest.materialized_views_test.TestMaterializedViews.Tests / dtest-large-latest jdk17 3/8 / test_add_dc_after_mv_network_replication
FAILED:  dtest-large-latest.materialized_views_test.TestMaterializedViews.Tests / dtest-large-latest jdk11 3/8 / test_add_dc_after_mv_network_replication
FAILED:  dtest-large-latest.materialized_views_test.TestMaterializedViews.Tests / dtest-large-latest jdk17 3/8 / test_add_dc_after_mv_network_replication
FAILED:  dtest-large-latest.materialized_views_test.TestMaterializedViews.Tests / dtest-large-latest jdk11 2/8 / test_add_dc_after_mv_simple_replication
FAILED:  dtest-large-latest.materialized_views_test.TestMaterializedViews.Tests / dtest-large-latest jdk17 2/8 / test_add_dc_after_mv_simple_replication
FAILED:  dtest-large-latest.materialized_views_test.TestMaterializedViews.Tests / dtest-large-latest jdk11 2/8 / test_add_dc_after_mv_simple_replication
FAILED:  dtest-large-latest.materialized_views_test.TestMaterializedViews.Tests / dtest-large-latest jdk17 2/8 / test_add_dc_after_mv_simple_replication
FAILED:  dtest-large-latest.materialized_views_test.TestMaterializedViews.Tests / dtest-large-latest jdk11 2/8 / test_add_dc_after_mv_simple_replication
FAILED:  dtest-large-latest.materialized_views_test.TestMaterializedViews.Tests / dtest-large-latest jdk17 2/8 / test_add_dc_after_mv_simple_replication
FAILED:  dtest-large-latest.materialized_views_test.TestMaterializedViews.Tests / dtest-large-latest jdk11 4/8 / test_add_node_after_mv
FAILED:  dtest-large-latest.materialized_views_test.TestMaterializedViews.Tests / dtest-large-latest jdk17 4/8 / test_add_node_after_mv
FAILED:  dtest-large-latest.materialized_views_test.TestMaterializedViews.Tests / dtest-large-latest jdk11 4/8 / test_add_node_after_mv
FAILED:  dtest-large-latest.materialized_views_test.TestMaterializedViews.Tests / dtest-large-latest jdk17 4/8 / test_add_node_after_mv
FAILED:  dtest-large-latest.materialized_views_test.TestMaterializedViews.Tests / dtest-large-latest jdk17 4/8 / test_add_node_after_mv
FAILED:  dtest-large-latest.materialized_views_test.TestMaterializedViews.Tests / dtest-large-latest jdk11 4/8 / test_add_node_after_mv
FAILED:  dtest-large-latest.materialized_views_test.TestMaterializedViews.Tests / dtest-large-latest jdk11 6/8 / test_add_node_after_very_wide_mv
FAILED:  dtest-large-latest.materialized_views_test.TestMaterializedViews.Tests / dtest-large-latest jdk17 6/8 / test_add_node_after_very_wide_mv
FAILED:  dtest-large-latest.materialized_views_test.TestMaterializedViews.Tests / dtest-large-latest jdk17 6/8 / test_add_node_after_very_wide_mv
FAILED:  dtest-large-latest.materialized_views_test.TestMaterializedViews.Tests / dtest-large-latest jdk11 6/8 / test_add_node_after_very_wide_mv
FAILED:  dtest-large-latest.materialized_views_test.TestMaterializedViews.Tests / dtest-large-latest jdk11 6/8 / test_add_node_after_very_wide_mv
FAILED:  dtest-large-latest.materialized_views_test.TestMaterializedViews.Tests / dtest-large-latest jdk17 6/8 / test_add_node_after_very_wide_mv
FAILED:  dtest-large-latest.materialized_views_test.TestMaterializedViews.Tests / dtest-large-latest jdk11 5/8 / test_add_node_after_wide_mv_with_range_deletions
FAILED:  dtest-large-latest.materialized_views_test.TestMaterializedViews.Tests / dtest-large-latest jdk17 5/8 / test_add_node_after_wide_mv_with_range_deletions
FAILED:  dtest-large-latest.materialized_views_test.TestMaterializedViews.Tests / dtest-large-latest jdk17 5/8 / test_add_node_after_wide_mv_with_range_deletions
FAILED:  dtest-large-latest.materialized_views_test.TestMaterializedViews.Tests / dtest-large-latest jdk17 5/8 / test_add_node_after_wide_mv_with_range_deletions
FAILED:  dtest-large-latest.materialized_views_test.TestMaterializedViews.Tests / dtest-large-latest jdk11 5/8 / test_add_node_after_wide_mv_with_range_deletions
FAILED:  dtest-large-latest.materialized_views_test.TestMaterializedViews.Tests / dtest-large-latest jdk11 5/8 / test_add_node_after_wide_mv_with_range_deletions
FAILED:  dtest-large-latest.materialized_views_test.TestMaterializedViews.Tests / dtest-large-latest jdk17 7/8 / test_add_write_survey_node_after_mv
FAILED:  dtest-large-latest.materialized_views_test.TestMaterializedViews.Tests / dtest-large-latest jdk17 7/8 / test_add_write_survey_node_after_mv
FAILED:  dtest-large-latest.materialized_views_test.TestMaterializedViews.Tests / dtest-large-latest jdk17 7/8 / test_add_write_survey_node_after_mv
FAILED:  dtest-large-latest.materialized_views_test.TestMaterializedViews.Tests / dtest-large-latest jdk11 7/8 / test_add_write_survey_node_after_mv
FAILED:  dtest-large-latest.materialized_views_test.TestMaterializedViews.Tests / dtest-large-latest jdk11 7/8 / test_add_write_survey_node_after_mv
FAILED:  dtest-large-latest.materialized_views_test.TestMaterializedViews.Tests / dtest-large-latest jdk11 7/8 / test_add_write_survey_node_after_mv
FAILED:  dtest-large-latest.materialized_views_test.TestMaterializedViews.Tests / dtest-large-latest jdk11 8/8 / test_complex_repair
FAILED:  dtest-large-latest.materialized_views_test.TestMaterializedViews.Tests / dtest-large-latest jdk17 8/8 / test_complex_repair
FAILED:  dtest-large-latest.materialized_views_test.TestMaterializedViews.Tests / dtest-large-latest jdk17 8/8 / test_complex_repair
FAILED:  dtest-large-latest.materialized_views_test.TestMaterializedViews.Tests / dtest-large-latest jdk17 8/8 / test_complex_repair
FAILED:  dtest-large-latest.materialized_views_test.TestMaterializedViews.Tests / dtest-large-latest jdk11 8/8 / test_complex_repair
FAILED:  dtest-large-latest.materialized_views_test.TestMaterializedViews.Tests / dtest-large-latest jdk11 8/8 / test_complex_repair
FAILED:  dtest-large-latest.materialized_views_test.TestMaterializedViews.Tests / dtest-large-latest jdk17 2/8 / test_really_complex_repair
FAILED:  dtest-large-latest.materialized_views_test.TestMaterializedViews.Tests / dtest-large-latest jdk11 2/8 / test_really_complex_repair
FAILED:  dtest-large-latest.materialized_views_test.TestMaterializedViews.Tests / dtest-large-latest jdk11 2/8 / test_really_complex_repair
FAILED:  dtest-large-latest.materialized_views_test.TestMaterializedViews.Tests / dtest-large-latest jdk11 2/8 / test_really_complex_repair
FAILED:  dtest-large-latest.materialized_views_test.TestMaterializedViews.Tests / dtest-large-latest jdk17 2/8 / test_really_complex_repair
FAILED:  dtest-large-latest.materialized_views_test.TestMaterializedViews.Tests / dtest-large-latest jdk17 2/8 / test_really_complex_repair
FAILED:  dtest-large-latest.materialized_views_test.TestMaterializedViews.Tests / dtest-large-latest jdk17 1/8 / test_throttled_partition_update
FAILED:  dtest-large-latest.materialized_views_test.TestMaterializedViews.Tests / dtest-large-latest jdk11 1/8 / test_throttled_partition_update
FAILED:  dtest-large-latest.materialized_views_test.TestMaterializedViews.Tests / dtest-large-latest jdk17 1/8 / test_throttled_partition_update
FAILED:  dtest-large-latest.materialized_views_test.TestMaterializedViews.Tests / dtest-large-latest jdk11 1/8 / test_throttled_partition_update
FAILED:  dtest-large-latest.materialized_views_test.TestMaterializedViews.Tests / dtest-large-latest jdk11 1/8 / test_throttled_partition_update
FAILED:  dtest-large-latest.materialized_views_test.TestMaterializedViews.Tests / dtest-large-latest jdk17 1/8 / test_throttled_partition_update
FAILED:  dtest-large-latest.snitch_test.TestDynamicEndpointSnitch.Tests / dtest-large-latest jdk17 6/8 / test_multidatacenter_local_quorum
FAILED:  dtest-large-latest.snitch_test.TestDynamicEndpointSnitch.Tests / dtest-large-latest jdk17 6/8 / test_multidatacenter_local_quorum
FAILED:  dtest-large-latest.snitch_test.TestDynamicEndpointSnitch.Tests / dtest-large-latest jdk11 6/8 / test_multidatacenter_local_quorum
FAILED:  dtest-large-latest.snitch_test.TestDynamicEndpointSnitch.Tests / dtest-large-latest jdk17 6/8 / test_multidatacenter_local_quorum
FAILED:  dtest-large-latest.snitch_test.TestDynamicEndpointSnitch.Tests / dtest-large-latest jdk11 6/8 / test_multidatacenter_local_quorum
FAILED:  dtest-large-latest.snitch_test.TestDynamicEndpointSnitch.Tests / dtest-large-latest jdk11 6/8 / test_multidatacenter_local_quorum
FAILED:  dtest-large-latest.topology_test.TestTopology.Tests / dtest-large-latest jdk17 7/8 / test_stop_decommission_too_few_replicas_multi_dc
FAILED:  dtest-large-latest.topology_test.TestTopology.Tests / dtest-large-latest jdk11 7/8 / test_stop_decommission_too_few_replicas_multi_dc
FAILED:  dtest-latest.auth_test.TestNetworkAuth.Tests / dtest-latest jdk17 37/64 / test_alter_dc_validation
FAILED:  dtest-latest.auth_test.TestNetworkAuth.Tests / dtest-latest jdk11 37/64 / test_alter_dc_validation
FAILED:  dtest-latest.auth_test.TestNetworkAuth.Tests / dtest-latest jdk17 36/64 / test_create_dc_validation
FAILED:  dtest-latest.auth_test.TestNetworkAuth.Tests / dtest-latest jdk11 36/64 / test_create_dc_validation
FAILED:  dtest-latest.auth_test.TestNetworkAuth.Tests / dtest-latest jdk11 33/64 / test_full_dc_access
FAILED:  dtest-latest.auth_test.TestNetworkAuth.Tests / dtest-latest jdk17 33/64 / test_full_dc_access
FAILED:  dtest-latest.auth_test.TestNetworkAuth.Tests / dtest-latest jdk17 35/64 / test_revoked_dc_access
FAILED:  dtest-latest.auth_test.TestNetworkAuth.Tests / dtest-latest jdk11 35/64 / test_revoked_dc_access
FAILED:  dtest-latest.auth_test.TestNetworkAuth.Tests / dtest-latest jdk11 38/64 / test_revoked_login
FAILED:  dtest-latest.auth_test.TestNetworkAuth.Tests / dtest-latest jdk17 38/64 / test_revoked_login
FAILED:  dtest-latest.auth_test.TestNetworkAuth.Tests / dtest-latest jdk11 34/64 / test_single_dc_access
FAILED:  dtest-latest.auth_test.TestNetworkAuth.Tests / dtest-latest jdk17 34/64 / test_single_dc_access
FAILED:  dtest-latest.bootstrap_test.TestBootstrap.Tests / dtest-latest jdk11 12/64 / test_local_quorum_bootstrap
FAILED:  dtest-latest.bootstrap_test.TestBootstrap.Tests / dtest-latest jdk17 12/64 / test_local_quorum_bootstrap
FAILED:  dtest-latest.bootstrap_test.TestBootstrap.Tests / dtest-latest jdk11 8/64 / test_rf_gt_nodes_multidc_should_succeed
FAILED:  dtest-latest.bootstrap_test.TestBootstrap.Tests / dtest-latest jdk17 8/64 / test_rf_gt_nodes_multidc_should_succeed
FAILED:  dtest-latest.consistency_test.TestAccuracy.Tests / dtest-latest jdk17 35/64 / test_simple_strategy_counters
FAILED:  dtest-latest.consistency_test.TestAccuracy.Tests / dtest-latest jdk11 35/64 / test_simple_strategy_counters
FAILED:  dtest-latest.consistency_test.TestAccuracy.Tests / dtest-latest jdk11 35/64 / test_simple_strategy_counters
FAILED:  dtest-latest.consistency_test.TestAccuracy.Tests / dtest-latest jdk17 35/64 / test_simple_strategy_counters
FAILED:  dtest-latest.delete_insert_test.TestDeleteInsert.Tests / dtest-latest jdk17 31/64 / test_delete_insert_search
FAILED:  dtest-latest.delete_insert_test.TestDeleteInsert.Tests / dtest-latest jdk17 31/64 / test_delete_insert_search
FAILED:  dtest-latest.delete_insert_test.TestDeleteInsert.Tests / dtest-latest jdk11 31/64 / test_delete_insert_search
FAILED:  dtest-latest.delete_insert_test.TestDeleteInsert.Tests / dtest-latest jdk11 31/64 / test_delete_insert_search
FAILED:  dtest-latest.gossip_test.TestGossip.Tests / dtest-latest jdk11 51/64 / test_2dc_parallel_startup
FAILED:  dtest-latest.gossip_test.TestGossip.Tests / dtest-latest jdk11 51/64 / test_2dc_parallel_startup
FAILED:  dtest-latest.gossip_test.TestGossip.Tests / dtest-latest jdk17 51/64 / test_2dc_parallel_startup
FAILED:  dtest-latest.gossip_test.TestGossip.Tests / dtest-latest jdk17 51/64 / test_2dc_parallel_startup
FAILED:  dtest-latest.gossip_test.TestGossip.Tests / dtest-latest jdk11 52/64 / test_2dc_parallel_startup_one_seed
FAILED:  dtest-latest.gossip_test.TestGossip.Tests / dtest-latest jdk17 52/64 / test_2dc_parallel_startup_one_seed
FAILED:  dtest-latest.gossip_test.TestGossip.Tests / dtest-latest jdk11 52/64 / test_2dc_parallel_startup_one_seed
FAILED:  dtest-latest.gossip_test.TestGossip.Tests / dtest-latest jdk17 52/64 / test_2dc_parallel_startup_one_seed
FAILED:  dtest-latest.hintedhandoff_test.TestHintedHandoffConfig.Tests / dtest-latest jdk11 57/64 / test_hintedhandoff_dc_disabled
FAILED:  dtest-latest.hintedhandoff_test.TestHintedHandoffConfig.Tests / dtest-latest jdk17 57/64 / test_hintedhandoff_dc_disabled
FAILED:  dtest-latest.hintedhandoff_test.TestHintedHandoffConfig.Tests / dtest-latest jdk17 57/64 / test_hintedhandoff_dc_disabled
FAILED:  dtest-latest.hintedhandoff_test.TestHintedHandoffConfig.Tests / dtest-latest jdk11 57/64 / test_hintedhandoff_dc_disabled
FAILED:  dtest-latest.hintedhandoff_test.TestHintedHandoffConfig.Tests / dtest-latest jdk17 58/64 / test_hintedhandoff_dc_reenabled
FAILED:  dtest-latest.hintedhandoff_test.TestHintedHandoffConfig.Tests / dtest-latest jdk11 58/64 / test_hintedhandoff_dc_reenabled
FAILED:  dtest-latest.hintedhandoff_test.TestHintedHandoffConfig.Tests / dtest-latest jdk17 58/64 / test_hintedhandoff_dc_reenabled
FAILED:  dtest-latest.hintedhandoff_test.TestHintedHandoffConfig.Tests / dtest-latest jdk11 58/64 / test_hintedhandoff_dc_reenabled
FAILED:  dtest-latest.hintedhandoff_test.TestHintedHandoffConfig.Tests / dtest-latest jdk17 54/64 / test_hintedhandoff_disabled
FAILED:  dtest-latest.hintedhandoff_test.TestHintedHandoffConfig.Tests / dtest-latest jdk11 54/64 / test_hintedhandoff_disabled
FAILED:  dtest-latest.hintedhandoff_test.TestHintedHandoffConfig.Tests / dtest-latest jdk11 54/64 / test_hintedhandoff_disabled
FAILED:  dtest-latest.hintedhandoff_test.TestHintedHandoffConfig.Tests / dtest-latest jdk17 54/64 / test_hintedhandoff_disabled
FAILED:  dtest-latest.hintedhandoff_test.TestHintedHandoffConfig.Tests / dtest-latest jdk17 55/64 / test_hintedhandoff_enabled
FAILED:  dtest-latest.hintedhandoff_test.TestHintedHandoffConfig.Tests / dtest-latest jdk11 55/64 / test_hintedhandoff_enabled
FAILED:  dtest-latest.hintedhandoff_test.TestHintedHandoffConfig.Tests / dtest-latest jdk17 55/64 / test_hintedhandoff_enabled
FAILED:  dtest-latest.hintedhandoff_test.TestHintedHandoffConfig.Tests / dtest-latest jdk11 55/64 / test_hintedhandoff_enabled
FAILED:  dtest-latest.hintedhandoff_test.TestHintedHandoffConfig.Tests / dtest-latest jdk17 56/64 / test_hintedhandoff_setmaxwindow
FAILED:  dtest-latest.hintedhandoff_test.TestHintedHandoffConfig.Tests / dtest-latest jdk11 56/64 / test_hintedhandoff_setmaxwindow
FAILED:  dtest-latest.hintedhandoff_test.TestHintedHandoffConfig.Tests / dtest-latest jdk11 56/64 / test_hintedhandoff_setmaxwindow
FAILED:  dtest-latest.hintedhandoff_test.TestHintedHandoffConfig.Tests / dtest-latest jdk17 56/64 / test_hintedhandoff_setmaxwindow
FAILED:  dtest-latest.materialized_views_test.TestMaterializedViews.Tests / dtest-latest jdk11 44/64 / test_allow_filtering
FAILED:  dtest-latest.materialized_views_test.TestMaterializedViews.Tests / dtest-latest jdk11 44/64 / test_allow_filtering
FAILED:  dtest-latest.materialized_views_test.TestMaterializedViews.Tests / dtest-latest jdk11 44/64 / test_allow_filtering
FAILED:  dtest-latest.materialized_views_test.TestMaterializedViews.Tests / dtest-latest jdk17 44/64 / test_allow_filtering
FAILED:  dtest-latest.materialized_views_test.TestMaterializedViews.Tests / dtest-latest jdk17 44/64 / test_allow_filtering
FAILED:  dtest-latest.materialized_views_test.TestMaterializedViews.Tests / dtest-latest jdk17 44/64 / test_allow_filtering
FAILED:  dtest-latest.materialized_views_test.TestMaterializedViews.Tests / dtest-latest jdk17 1/64 / test_base_column_in_view_pk_commutative_tombstone_with_flush
FAILED:  dtest-latest.materialized_views_test.TestMaterializedViews.Tests / dtest-latest jdk17 1/64 / test_base_column_in_view_pk_commutative_tombstone_with_flush
FAILED:  dtest-latest.materialized_views_test.TestMaterializedViews.Tests / dtest-latest jdk11 1/64 / test_base_column_in_view_pk_commutative_tombstone_with_flush
FAILED:  dtest-latest.materialized_views_test.TestMaterializedViews.Tests / dtest-latest jdk11 1/64 / test_base_column_in_view_pk_commutative_tombstone_with_flush
FAILED:  dtest-latest.materialized_views_test.TestMaterializedViews.Tests / dtest-latest jdk11 1/64 / test_base_column_in_view_pk_commutative_tombstone_with_flush
FAILED:  dtest-latest.materialized_views_test.TestMaterializedViews.Tests / dtest-latest jdk17 1/64 / test_base_column_in_view_pk_commutative_tombstone_with_flush
FAILED:  dtest-latest.materialized_views_test.TestMaterializedViews.Tests / dtest-latest jdk17 2/64 / test_base_column_in_view_pk_commutative_tombstone_without_flush
FAILED:  dtest-latest.materialized_views_test.TestMaterializedViews.Tests / dtest-latest jdk17 2/64 / test_base_column_in_view_pk_commutative_tombstone_without_flush
FAILED:  dtest-latest.materialized_views_test.TestMaterializedViews.Tests / dtest-latest jdk11 2/64 / test_base_column_in_view_pk_commutative_tombstone_without_flush
FAILED:  dtest-latest.materialized_views_test.TestMaterializedViews.Tests / dtest-latest jdk11 2/64 / test_base_column_in_view_pk_commutative_tombstone_without_flush
FAILED:  dtest-latest.materialized_views_test.TestMaterializedViews.Tests / dtest-latest jdk17 2/64 / test_base_column_in_view_pk_commutative_tombstone_without_flush
FAILED:  dtest-latest.materialized_views_test.TestMaterializedViews.Tests / dtest-latest jdk11 2/64 / test_base_column_in_view_pk_commutative_tombstone_without_flush
FAILED:  dtest-latest.materialized_views_test.TestMaterializedViews.Tests / dtest-latest jdk17 60/64 / test_base_column_in_view_pk_complex_timestamp_with_flush
FAILED:  dtest-latest.materialized_views_test.TestMaterializedViews.Tests / dtest-latest jdk11 60/64 / test_base_column_in_view_pk_complex_timestamp_with_flush
FAILED:  dtest-latest.materialized_views_test.TestMaterializedViews.Tests / dtest-latest jdk11 60/64 / test_base_column_in_view_pk_complex_timestamp_with_flush
FAILED:  dtest-latest.materialized_views_test.TestMaterializedViews.Tests / dtest-latest jdk17 60/64 / test_base_column_in_view_pk_complex_timestamp_with_flush
FAILED:  dtest-latest.materialized_views_test.TestMaterializedViews.Tests / dtest-latest jdk17 60/64 / test_base_column_in_view_pk_complex_timestamp_with_flush
FAILED:  dtest-latest.materialized_views_test.TestMaterializedViews.Tests / dtest-latest jdk11 60/64 / test_base_column_in_view_pk_complex_timestamp_with_flush
FAILED:  dtest-latest.materialized_views_test.TestMaterializedViews.Tests / dtest-latest jdk11 61/64 / test_base_column_in_view_pk_complex_timestamp_without_flush
FAILED:  dtest-latest.materialized_views_test.TestMaterializedViews.Tests / dtest-latest jdk17 61/64 / test_base_column_in_view_pk_complex_timestamp_without_flush
FAILED:  dtest-latest.materialized_views_test.TestMaterializedViews.Tests / dtest-latest jdk17 61/64 / test_base_column_in_view_pk_complex_timestamp_without_flush
FAILED:  dtest-latest.materialized_views_test.TestMaterializedViews.Tests / dtest-latest jdk11 61/64 / test_base_column_in_view_pk_complex_timestamp_without_flush
FAILED:  dtest-latest.materialized_views_test.TestMaterializedViews.Tests / dtest-latest jdk11 61/64 / test_base_column_in_view_pk_complex_timestamp_without_flush
FAILED:  dtest-latest.materialized_views_test.TestMaterializedViews.Tests / dtest-latest jdk17 61/64 / test_base_column_in_view_pk_complex_timestamp_without_flush
FAILED:  dtest-latest.materialized_views_test.TestMaterializedViews.Tests / dtest-latest jdk11 6/64 / test_base_replica_repair
FAILED:  dtest-latest.materialized_views_test.TestMaterializedViews.Tests / dtest-latest jdk17 6/64 / test_base_replica_repair
FAILED:  dtest-latest.materialized_views_test.TestMaterializedViews.Tests / dtest-latest jdk17 6/64 / test_base_replica_repair
FAILED:  dtest-latest.materialized_views_test.TestMaterializedViews.Tests / dtest-latest jdk11 6/64 / test_base_replica_repair
FAILED:  dtest-latest.materialized_views_test.TestMaterializedViews.Tests / dtest-latest jdk17 6/64 / test_base_replica_repair
FAILED:  dtest-latest.materialized_views_test.TestMaterializedViews.Tests / dtest-latest jdk11 6/64 / test_base_replica_repair
FAILED:  dtest-latest.materialized_views_test.TestMaterializedViews.Tests / dtest-latest jdk11 7/64 / test_base_replica_repair_with_contention
FAILED:  dtest-latest.materialized_views_test.TestMaterializedViews.Tests / dtest-latest jdk17 7/64 / test_base_replica_repair_with_contention
FAILED:  dtest-latest.materialized_views_test.TestMaterializedViews.Tests / dtest-latest jdk17 7/64 / test_base_replica_repair_with_contention
FAILED:  dtest-latest.materialized_views_test.TestMaterializedViews.Tests / dtest-latest jdk17 7/64 / test_base_replica_repair_with_contention
FAILED:  dtest-latest.materialized_views_test.TestMaterializedViews.Tests / dtest-latest jdk11 7/64 / test_base_replica_repair_with_contention
FAILED:  dtest-latest.materialized_views_test.TestMaterializedViews.Tests / dtest-latest jdk11 7/64 / test_base_replica_repair_with_contention
FAILED:  dtest-latest.materialized_views_test.TestMaterializedViews.Tests / dtest-latest jdk17 9/64 / test_base_view_consistency_on_failure_after_mv_apply
FAILED:  dtest-latest.materialized_views_test.TestMaterializedViews.Tests / dtest-latest jdk17 9/64 / test_base_view_consistency_on_failure_after_mv_apply
FAILED:  dtest-latest.materialized_views_test.TestMaterializedViews.Tests / dtest-latest jdk11 9/64 / test_base_view_consistency_on_failure_after_mv_apply
FAILED:  dtest-latest.materialized_views_test.TestMaterializedViews.Tests / dtest-latest jdk11 9/64 / test_base_view_consistency_on_failure_after_mv_apply
FAILED:  dtest-latest.materialized_views_test.TestMaterializedViews.Tests / dtest-latest jdk11 9/64 / test_base_view_consistency_on_failure_after_mv_apply
FAILED:  dtest-latest.materialized_views_test.TestMaterializedViews.Tests / dtest-latest jdk17 9/64 / test_base_view_consistency_on_failure_after_mv_apply
FAILED:  dtest-latest.materialized_views_test.TestMaterializedViews.Tests / dtest-latest jdk17 10/64 / test_base_view_consistency_on_failure_before_mv_apply
FAILED:  dtest-latest.materialized_views_test.TestMaterializedViews.Tests / dtest-latest jdk17 10/64 / test_base_view_consistency_on_failure_before_mv_apply
FAILED:  dtest-latest.materialized_views_test.TestMaterializedViews.Tests / dtest-latest jdk11 10/64 / test_base_view_consistency_on_failure_before_mv_apply
FAILED:  dtest-latest.materialized_views_test.TestMaterializedViews.Tests / dtest-latest jdk17 10/64 / test_base_view_consistency_on_failure_before_mv_apply
FAILED:  dtest-latest.materialized_views_test.TestMaterializedViews.Tests / dtest-latest jdk11 10/64 / test_base_view_consistency_on_failure_before_mv_apply
FAILED:  dtest-latest.materialized_views_test.TestMaterializedViews.Tests / dtest-latest jdk11 10/64 / test_base_view_consistency_on_failure_before_mv_apply
FAILED:  dtest-latest.materialized_views_test.TestMaterializedViews.Tests / dtest-latest jdk11 40/64 / test_clustering_column
FAILED:  dtest-latest.materialized_views_test.TestMaterializedViews.Tests / dtest-latest jdk17 40/64 / test_clustering_column
FAILED:  dtest-latest.materialized_views_test.TestMaterializedViews.Tests / dtest-latest jdk11 40/64 / test_clustering_column
FAILED:  dtest-latest.materialized_views_test.TestMaterializedViews.Tests / dtest-latest jdk17 40/64 / test_clustering_column
FAILED:  dtest-latest.materialized_views_test.TestMaterializedViews.Tests / dtest-latest jdk11 40/64 / test_clustering_column
FAILED:  dtest-latest.materialized_views_test.TestMaterializedViews.Tests / dtest-latest jdk17 40/64 / test_clustering_column
FAILED:  dtest-latest.materialized_views_test.TestMaterializedViews.Tests / dtest-latest jdk17 34/64 / test_crc_check_chance
FAILED:  dtest-latest.materialized_views_test.TestMaterializedViews.Tests / dtest-latest jdk17 34/64 / test_crc_check_chance
FAILED:  dtest-latest.materialized_views_test.TestMaterializedViews.Tests / dtest-latest jdk11 34/64 / test_crc_check_chance
FAILED:  dtest-latest.materialized_views_test.TestMaterializedViews.Tests / dtest-latest jdk11 34/64 / test_crc_check_chance
FAILED:  dtest-latest.materialized_views_test.TestMaterializedViews.Tests / dtest-latest jdk17 34/64 / test_crc_check_chance
FAILED:  dtest-latest.materialized_views_test.TestMaterializedViews.Tests / dtest-latest jdk11 34/64 / test_crc_check_chance
FAILED:  dtest-latest.materialized_views_test.TestMaterializedViews.Tests / dtest-latest jdk11 28/64 / test_create
FAILED:  dtest-latest.materialized_views_test.TestMaterializedViews.Tests / dtest-latest jdk11 28/64 / test_create
FAILED:  dtest-latest.materialized_views_test.TestMaterializedViews.Tests / dtest-latest jdk17 28/64 / test_create
FAILED:  dtest-latest.materialized_views_test.TestMaterializedViews.Tests / dtest-latest jdk17 28/64 / test_create
FAILED:  dtest-latest.materialized_views_test.TestMaterializedViews.Tests / dtest-latest jdk17 28/64 / test_create
FAILED:  dtest-latest.materialized_views_test.TestMaterializedViews.Tests / dtest-latest jdk11 28/64 / test_create
FAILED:  dtest-latest.materialized_views_test.TestMaterializedViews.Tests / dtest-latest jdk11 38/64 / test_drop_column
FAILED:  dtest-latest.materialized_views_test.TestMaterializedViews.Tests / dtest-latest jdk11 38/64 / test_drop_column
FAILED:  dtest-latest.materialized_views_test.TestMaterializedViews.Tests / dtest-latest jdk17 38/64 / test_drop_column
FAILED:  dtest-latest.materialized_views_test.TestMaterializedViews.Tests / dtest-latest jdk17 38/64 / test_drop_column
FAILED:  dtest-latest.materialized_views_test.TestMaterializedViews.Tests / dtest-latest jdk11 38/64 / test_drop_column
FAILED:  dtest-latest.materialized_views_test.TestMaterializedViews.Tests / dtest-latest jdk17 38/64 / test_drop_column
FAILED:  dtest-latest.materialized_views_test.TestMaterializedViews.Tests / dtest-latest jdk17 37/64 / test_drop_mv
FAILED:  dtest-latest.materialized_views_test.TestMaterializedViews.Tests / dtest-latest jdk17 37/64 / test_drop_mv
FAILED:  dtest-latest.materialized_views_test.TestMaterializedViews.Tests / dtest-latest jdk11 37/64 / test_drop_mv
FAILED:  dtest-latest.materialized_views_test.TestMaterializedViews.Tests / dtest-latest jdk11 37/64 / test_drop_mv
FAILED:  dtest-latest.materialized_views_test.TestMaterializedViews.Tests / dtest-latest jdk17 37/64 / test_drop_mv
FAILED:  dtest-latest.materialized_views_test.TestMaterializedViews.Tests / dtest-latest jdk11 37/64 / test_drop_mv
FAILED:  dtest-latest.materialized_views_test.TestMaterializedViews.Tests / dtest-latest jdk11 39/64 / test_drop_table
FAILED:  dtest-latest.materialized_views_test.TestMaterializedViews.Tests / dtest-latest jdk11 39/64 / test_drop_table
FAILED:  dtest-latest.materialized_views_test.TestMaterializedViews.Tests / dtest-latest jdk17 39/64 / test_drop_table
FAILED:  dtest-latest.materialized_views_test.TestMaterializedViews.Tests / dtest-latest jdk17 39/64 / test_drop_table
FAILED:  dtest-latest.materialized_views_test.TestMaterializedViews.Tests / dtest-latest jdk17 39/64 / test_drop_table
FAILED:  dtest-latest.materialized_views_test.TestMaterializedViews.Tests / dtest-latest jdk11 39/64 / test_drop_table
FAILED:  dtest-latest.materialized_views_test.TestMaterializedViews.Tests / dtest-latest jdk11 54/64 / test_drop_with_stopped_build
FAILED:  dtest-latest.materialized_views_test.TestMaterializedViews.Tests / dtest-latest jdk11 54/64 / test_drop_with_stopped_build
FAILED:  dtest-latest.materialized_views_test.TestMaterializedViews.Tests / dtest-latest jdk17 54/64 / test_drop_with_stopped_build
FAILED:  dtest-latest.materialized_views_test.TestMaterializedViews.Tests / dtest-latest jdk17 54/64 / test_drop_with_stopped_build
FAILED:  dtest-latest.materialized_views_test.TestMaterializedViews.Tests / dtest-latest jdk17 54/64 / test_drop_with_stopped_build
FAILED:  dtest-latest.materialized_views_test.TestMaterializedViews.Tests / dtest-latest jdk11 54/64 / test_drop_with_stopped_build
FAILED:  dtest-latest.materialized_views_test.TestMaterializedViews.Tests / dtest-latest jdk11 62/64 / test_expired_liveness_with_limit_rf1_nodes1
FAILED:  dtest-latest.materialized_views_test.TestMaterializedViews.Tests / dtest-latest jdk17 62/64 / test_expired_liveness_with_limit_rf1_nodes1
FAILED:  dtest-latest.materialized_views_test.TestMaterializedViews.Tests / dtest-latest jdk11 62/64 / test_expired_liveness_with_limit_rf1_nodes1
FAILED:  dtest-latest.materialized_views_test.TestMaterializedViews.Tests / dtest-latest jdk11 62/64 / test_expired_liveness_with_limit_rf1_nodes1
FAILED:  dtest-latest.materialized_views_test.TestMaterializedViews.Tests / dtest-latest jdk17 62/64 / test_expired_liveness_with_limit_rf1_nodes1
FAILED:  dtest-latest.materialized_views_test.TestMaterializedViews.Tests / dtest-latest jdk17 62/64 / test_expired_liveness_with_limit_rf1_nodes1
FAILED:  dtest-latest.materialized_views_test.TestMaterializedViews.Tests / dtest-latest jdk17 63/64 / test_expired_liveness_with_limit_rf1_nodes3
FAILED:  dtest-latest.materialized_views_test.TestMaterializedViews.Tests / dtest-latest jdk17 63/64 / test_expired_liveness_with_limit_rf1_nodes3
FAILED:  dtest-latest.materialized_views_test.TestMaterializedViews.Tests / dtest-latest jdk11 63/64 / test_expired_liveness_with_limit_rf1_nodes3
FAILED:  dtest-latest.materialized_views_test.TestMaterializedViews.Tests / dtest-latest jdk11 63/64 / test_expired_liveness_with_limit_rf1_nodes3
FAILED:  dtest-latest.materialized_views_test.TestMaterializedViews.Tests / dtest-latest jdk11 63/64 / test_expired_liveness_with_limit_rf1_nodes3
FAILED:  dtest-latest.materialized_views_test.TestMaterializedViews.Tests / dtest-latest jdk17 63/64 / test_expired_liveness_with_limit_rf1_nodes3
FAILED:  dtest-latest.materialized_views_test.TestMaterializedViews.Tests / dtest-latest jdk11 64/64 / test_expired_liveness_with_limit_rf3
FAILED:  dtest-latest.materialized_views_test.TestMaterializedViews.Tests / dtest-latest jdk11 64/64 / test_expired_liveness_with_limit_rf3
FAILED:  dtest-latest.materialized_views_test.TestMaterializedViews.Tests / dtest-latest jdk17 64/64 / test_expired_liveness_with_limit_rf3
FAILED:  dtest-latest.materialized_views_test.TestMaterializedViews.Tests / dtest-latest jdk11 64/64 / test_expired_liveness_with_limit_rf3
FAILED:  dtest-latest.materialized_views_test.TestMaterializedViews.Tests / dtest-latest jdk17 64/64 / test_expired_liveness_with_limit_rf3
FAILED:  dtest-latest.materialized_views_test.TestMaterializedViews.Tests / dtest-latest jdk17 64/64 / test_expired_liveness_with_limit_rf3
FAILED:  dtest-latest.materialized_views_test.TestMaterializedViews.Tests / dtest-latest jdk17 29/64 / test_gcgs_validation
FAILED:  dtest-latest.materialized_views_test.TestMaterializedViews.Tests / dtest-latest jdk17 29/64 / test_gcgs_validation
FAILED:  dtest-latest.materialized_views_test.TestMaterializedViews.Tests / dtest-latest jdk17 29/64 / test_gcgs_validation
FAILED:  dtest-latest.materialized_views_test.TestMaterializedViews.Tests / dtest-latest jdk11 29/64 / test_gcgs_validation
FAILED:  dtest-latest.materialized_views_test.TestMaterializedViews.Tests / dtest-latest jdk11 29/64 / test_gcgs_validation
FAILED:  dtest-latest.materialized_views_test.TestMaterializedViews.Tests / dtest-latest jdk11 29/64 / test_gcgs_validation
FAILED:  dtest-latest.materialized_views_test.TestMaterializedViews.Tests / dtest-latest jdk17 36/64 / test_immutable
FAILED:  dtest-latest.materialized_views_test.TestMaterializedViews.Tests / dtest-latest jdk11 36/64 / test_immutable
FAILED:  dtest-latest.materialized_views_test.TestMaterializedViews.Tests / dtest-latest jdk11 36/64 / test_immutable
FAILED:  dtest-latest.materialized_views_test.TestMaterializedViews.Tests / dtest-latest jdk11 36/64 / test_immutable
FAILED:  dtest-latest.materialized_views_test.TestMaterializedViews.Tests / dtest-latest jdk17 36/64 / test_immutable
FAILED:  dtest-latest.materialized_views_test.TestMaterializedViews.Tests / dtest-latest jdk17 36/64 / test_immutable
FAILED:  dtest-latest.materialized_views_test.TestMaterializedViews.Tests / dtest-latest jdk17 30/64 / test_insert
FAILED:  dtest-latest.materialized_views_test.TestMaterializedViews.Tests / dtest-latest jdk17 30/64 / test_insert
FAILED:  dtest-latest.materialized_views_test.TestMaterializedViews.Tests / dtest-latest jdk17 30/64 / test_insert
FAILED:  dtest-latest.materialized_views_test.TestMaterializedViews.Tests / dtest-latest jdk11 30/64 / test_insert
FAILED:  dtest-latest.materialized_views_test.TestMaterializedViews.Tests / dtest-latest jdk11 30/64 / test_insert
FAILED:  dtest-latest.materialized_views_test.TestMaterializedViews.Tests / dtest-latest jdk11 30/64 / test_insert
FAILED:  dtest-latest.materialized_views_test.TestMaterializedViews.Tests / dtest-latest jdk17 41/64 / test_insert_during_range_movement_rf1
FAILED:  dtest-latest.materialized_views_test.TestMaterializedViews.Tests / dtest-latest jdk17 41/64 / test_insert_during_range_movement_rf1
FAILED:  dtest-latest.materialized_views_test.TestMaterializedViews.Tests / dtest-latest jdk17 41/64 / test_insert_during_range_movement_rf1
FAILED:  dtest-latest.materialized_views_test.TestMaterializedViews.Tests / dtest-latest jdk11 41/64 / test_insert_during_range_movement_rf1
FAILED:  dtest-latest.materialized_views_test.TestMaterializedViews.Tests / dtest-latest jdk11 41/64 / test_insert_during_range_movement_rf1
FAILED:  dtest-latest.materialized_views_test.TestMaterializedViews.Tests / dtest-latest jdk11 41/64 / test_insert_during_range_movement_rf1
FAILED:  dtest-latest.materialized_views_test.TestMaterializedViews.Tests / dtest-latest jdk17 42/64 / test_insert_during_range_movement_rf2
FAILED:  dtest-latest.materialized_views_test.TestMaterializedViews.Tests / dtest-latest jdk11 42/64 / test_insert_during_range_movement_rf2
FAILED:  dtest-latest.materialized_views_test.TestMaterializedViews.Tests / dtest-latest jdk17 42/64 / test_insert_during_range_movement_rf2
FAILED:  dtest-latest.materialized_views_test.TestMaterializedViews.Tests / dtest-latest jdk17 42/64 / test_insert_during_range_movement_rf2
FAILED:  dtest-latest.materialized_views_test.TestMaterializedViews.Tests / dtest-latest jdk11 42/64 / test_insert_during_range_movement_rf2
FAILED:  dtest-latest.materialized_views_test.TestMaterializedViews.Tests / dtest-latest jdk11 42/64 / test_insert_during_range_movement_rf2
FAILED:  dtest-latest.materialized_views_test.TestMaterializedViews.Tests / dtest-latest jdk17 43/64 / test_insert_during_range_movement_rf3
FAILED:  dtest-latest.materialized_views_test.TestMaterializedViews.Tests / dtest-latest jdk11 43/64 / test_insert_during_range_movement_rf3
FAILED:  dtest-latest.materialized_views_test.TestMaterializedViews.Tests / dtest-latest jdk11 43/64 / test_insert_during_range_movement_rf3
FAILED:  dtest-latest.materialized_views_test.TestMaterializedViews.Tests / dtest-latest jdk11 43/64 / test_insert_during_range_movement_rf3
FAILED:  dtest-latest.materialized_views_test.TestMaterializedViews.Tests / dtest-latest jdk17 43/64 / test_insert_during_range_movement_rf3
FAILED:  dtest-latest.materialized_views_test.TestMaterializedViews.Tests / dtest-latest jdk17 43/64 / test_insert_during_range_movement_rf3
FAILED:  dtest-latest.materialized_views_test.TestMaterializedViews.Tests / dtest-latest jdk11 52/64 / test_interrupt_build_process
FAILED:  dtest-latest.materialized_views_test.TestMaterializedViews.Tests / dtest-latest jdk17 52/64 / test_interrupt_build_process
FAILED:  dtest-latest.materialized_views_test.TestMaterializedViews.Tests / dtest-latest jdk11 52/64 / test_interrupt_build_process
FAILED:  dtest-latest.materialized_views_test.TestMaterializedViews.Tests / dtest-latest jdk11 52/64 / test_interrupt_build_process
FAILED:  dtest-latest.materialized_views_test.TestMaterializedViews.Tests / dtest-latest jdk17 52/64 / test_interrupt_build_process
FAILED:  dtest-latest.materialized_views_test.TestMaterializedViews.Tests / dtest-latest jdk17 52/64 / test_interrupt_build_process
FAILED:  dtest-latest.materialized_views_test.TestMaterializedViews.Tests / dtest-latest jdk11 51/64 / test_lwt
FAILED:  dtest-latest.materialized_views_test.TestMaterializedViews.Tests / dtest-latest jdk17 51/64 / test_lwt
FAILED:  dtest-latest.materialized_views_test.TestMaterializedViews.Tests / dtest-latest jdk11 51/64 / test_lwt
FAILED:  dtest-latest.materialized_views_test.TestMaterializedViews.Tests / dtest-latest jdk17 51/64 / test_lwt
FAILED:  dtest-latest.materialized_views_test.TestMaterializedViews.Tests / dtest-latest jdk17 51/64 / test_lwt
FAILED:  dtest-latest.materialized_views_test.TestMaterializedViews.Tests / dtest-latest jdk11 51/64 / test_lwt
FAILED:  dtest-latest.materialized_views_test.TestMaterializedViews.Tests / dtest-latest jdk11 56/64 / test_mv_with_default_ttl_with_flush
FAILED:  dtest-latest.materialized_views_test.TestMaterializedViews.Tests / dtest-latest jdk11 56/64 / test_mv_with_default_ttl_with_flush
FAILED:  dtest-latest.materialized_views_test.TestMaterializedViews.Tests / dtest-latest jdk17 56/64 / test_mv_with_default_ttl_with_flush
FAILED:  dtest-latest.materialized_views_test.TestMaterializedViews.Tests / dtest-latest jdk11 56/64 / test_mv_with_default_ttl_with_flush
FAILED:  dtest-latest.materialized_views_test.TestMaterializedViews.Tests / dtest-latest jdk17 56/64 / test_mv_with_default_ttl_with_flush
FAILED:  dtest-latest.materialized_views_test.TestMaterializedViews.Tests / dtest-latest jdk17 56/64 / test_mv_with_default_ttl_with_flush
FAILED:  dtest-latest.materialized_views_test.TestMaterializedViews.Tests / dtest-latest jdk17 57/64 / test_mv_with_default_ttl_without_flush
FAILED:  dtest-latest.materialized_views_test.TestMaterializedViews.Tests / dtest-latest jdk17 57/64 / test_mv_with_default_ttl_without_flush
FAILED:  dtest-latest.materialized_views_test.TestMaterializedViews.Tests / dtest-latest jdk11 57/64 / test_mv_with_default_ttl_without_flush
FAILED:  dtest-latest.materialized_views_test.TestMaterializedViews.Tests / dtest-latest jdk11 57/64 / test_mv_with_default_ttl_without_flush
FAILED:  dtest-latest.materialized_views_test.TestMaterializedViews.Tests / dtest-latest jdk11 57/64 / test_mv_with_default_ttl_without_flush
FAILED:  dtest-latest.materialized_views_test.TestMaterializedViews.Tests / dtest-latest jdk17 57/64 / test_mv_with_default_ttl_without_flush
FAILED:  dtest-latest.materialized_views_test.TestMaterializedViews.Tests / dtest-latest jdk17 58/64 / test_no_base_column_in_view_pk_complex_timestamp_with_flush
FAILED:  dtest-latest.materialized_views_test.TestMaterializedViews.Tests / dtest-latest jdk17 58/64 / test_no_base_column_in_view_pk_complex_timestamp_with_flush
FAILED:  dtest-latest.materialized_views_test.TestMaterializedViews.Tests / dtest-latest jdk11 58/64 / test_no_base_column_in_view_pk_complex_timestamp_with_flush
FAILED:  dtest-latest.materialized_views_test.TestMaterializedViews.Tests / dtest-latest jdk11 58/64 / test_no_base_column_in_view_pk_complex_timestamp_with_flush
FAILED:  dtest-latest.materialized_views_test.TestMaterializedViews.Tests / dtest-latest jdk11 58/64 / test_no_base_column_in_view_pk_complex_timestamp_with_flush
FAILED:  dtest-latest.materialized_views_test.TestMaterializedViews.Tests / dtest-latest jdk17 58/64 / test_no_base_column_in_view_pk_complex_timestamp_with_flush
FAILED:  dtest-latest.materialized_views_test.TestMaterializedViews.Tests / dtest-latest jdk17 31/64 / test_populate_mv_after_insert
FAILED:  dtest-latest.materialized_views_test.TestMaterializedViews.Tests / dtest-latest jdk11 31/64 / test_populate_mv_after_insert
FAILED:  dtest-latest.materialized_views_test.TestMaterializedViews.Tests / dtest-latest jdk17 31/64 / test_populate_mv_after_insert
FAILED:  dtest-latest.materialized_views_test.TestMaterializedViews.Tests / dtest-latest jdk17 31/64 / test_populate_mv_after_insert
FAILED:  dtest-latest.materialized_views_test.TestMaterializedViews.Tests / dtest-latest jdk11 31/64 / test_populate_mv_after_insert
FAILED:  dtest-latest.materialized_views_test.TestMaterializedViews.Tests / dtest-latest jdk11 31/64 / test_populate_mv_after_insert
FAILED:  dtest-latest.materialized_views_test.TestMaterializedViews.Tests / dtest-latest jdk11 35/64 / test_prepared_statement
FAILED:  dtest-latest.materialized_views_test.TestMaterializedViews.Tests / dtest-latest jdk11 35/64 / test_prepared_statement
FAILED:  dtest-latest.materialized_views_test.TestMaterializedViews.Tests / dtest-latest jdk17 35/64 / test_prepared_statement
FAILED:  dtest-latest.materialized_views_test.TestMaterializedViews.Tests / dtest-latest jdk17 35/64 / test_prepared_statement
FAILED:  dtest-latest.materialized_views_test.TestMaterializedViews.Tests / dtest-latest jdk11 35/64 / test_prepared_statement
FAILED:  dtest-latest.materialized_views_test.TestMaterializedViews.Tests / dtest-latest jdk17 35/64 / test_prepared_statement
FAILED:  dtest-latest.materialized_views_test.TestMaterializedViews.Tests / dtest-latest jdk17 47/64 / test_query_all_new_column
FAILED:  dtest-latest.materialized_views_test.TestMaterializedViews.Tests / dtest-latest jdk17 47/64 / test_query_all_new_column
FAILED:  dtest-latest.materialized_views_test.TestMaterializedViews.Tests / dtest-latest jdk11 47/64 / test_query_all_new_column
FAILED:  dtest-latest.materialized_views_test.TestMaterializedViews.Tests / dtest-latest jdk11 47/64 / test_query_all_new_column
FAILED:  dtest-latest.materialized_views_test.TestMaterializedViews.Tests / dtest-latest jdk17 47/64 / test_query_all_new_column
FAILED:  dtest-latest.materialized_views_test.TestMaterializedViews.Tests / dtest-latest jdk11 47/64 / test_query_all_new_column
FAILED:  dtest-latest.materialized_views_test.TestMaterializedViews.Tests / dtest-latest jdk11 48/64 / test_query_new_column
FAILED:  dtest-latest.materialized_views_test.TestMaterializedViews.Tests / dtest-latest jdk11 48/64 / test_query_new_column
FAILED:  dtest-latest.materialized_views_test.TestMaterializedViews.Tests / dtest-latest jdk17 48/64 / test_query_new_column
FAILED:  dtest-latest.materialized_views_test.TestMaterializedViews.Tests / dtest-latest jdk17 48/64 / test_query_new_column
FAILED:  dtest-latest.materialized_views_test.TestMaterializedViews.Tests / dtest-latest jdk17 48/64 / test_query_new_column
FAILED:  dtest-latest.materialized_views_test.TestMaterializedViews.Tests / dtest-latest jdk11 48/64 / test_query_new_column
FAILED:  dtest-latest.materialized_views_test.TestMaterializedViews.Tests / dtest-latest jdk17 49/64 / test_rename_column
FAILED:  dtest-latest.materialized_views_test.TestMaterializedViews.Tests / dtest-latest jdk11 49/64 / test_rename_column
FAILED:  dtest-latest.materialized_views_test.TestMaterializedViews.Tests / dtest-latest jdk11 49/64 / test_rename_column
FAILED:  dtest-latest.materialized_views_test.TestMaterializedViews.Tests / dtest-latest jdk17 49/64 / test_rename_column
FAILED:  dtest-latest.materialized_views_test.TestMaterializedViews.Tests / dtest-latest jdk17 49/64 / test_rename_column
FAILED:  dtest-latest.materialized_views_test.TestMaterializedViews.Tests / dtest-latest jdk11 49/64 / test_rename_column
FAILED:  dtest-latest.materialized_views_test.TestMaterializedViews.Tests / dtest-latest jdk17 50/64 / test_rename_column_atomicity
FAILED:  dtest-latest.materialized_views_test.TestMaterializedViews.Tests / dtest-latest jdk17 50/64 / test_rename_column_atomicity
FAILED:  dtest-latest.materialized_views_test.TestMaterializedViews.Tests / dtest-latest jdk11 50/64 / test_rename_column_atomicity
FAILED:  dtest-latest.materialized_views_test.TestMaterializedViews.Tests / dtest-latest jdk11 50/64 / test_rename_column_atomicity
FAILED:  dtest-latest.materialized_views_test.TestMaterializedViews.Tests / dtest-latest jdk11 50/64 / test_rename_column_atomicity
FAILED:  dtest-latest.materialized_views_test.TestMaterializedViews.Tests / dtest-latest jdk17 50/64 / test_rename_column_atomicity
FAILED:  dtest-latest.materialized_views_test.TestMaterializedViews.Tests / dtest-latest jdk17 55/64 / test_resume_stopped_build
FAILED:  dtest-latest.materialized_views_test.TestMaterializedViews.Tests / dtest-latest jdk11 55/64 / test_resume_stopped_build
FAILED:  dtest-latest.materialized_views_test.TestMaterializedViews.Tests / dtest-latest jdk17 55/64 / test_resume_stopped_build
FAILED:  dtest-latest.materialized_views_test.TestMaterializedViews.Tests / dtest-latest jdk17 55/64 / test_resume_stopped_build
FAILED:  dtest-latest.materialized_views_test.TestMaterializedViews.Tests / dtest-latest jdk11 55/64 / test_resume_stopped_build
FAILED:  dtest-latest.materialized_views_test.TestMaterializedViews.Tests / dtest-latest jdk11 55/64 / test_resume_stopped_build
FAILED:  dtest-latest.materialized_views_test.TestMaterializedViews.Tests / dtest-latest jdk11 45/64 / test_secondary_index
FAILED:  dtest-latest.materialized_views_test.TestMaterializedViews.Tests / dtest-latest jdk11 45/64 / test_secondary_index
FAILED:  dtest-latest.materialized_views_test.TestMaterializedViews.Tests / dtest-latest jdk17 45/64 / test_secondary_index
FAILED:  dtest-latest.materialized_views_test.TestMaterializedViews.Tests / dtest-latest jdk17 45/64 / test_secondary_index
FAILED:  dtest-latest.materialized_views_test.TestMaterializedViews.Tests / dtest-latest jdk11 45/64 / test_secondary_index
FAILED:  dtest-latest.materialized_views_test.TestMaterializedViews.Tests / dtest-latest jdk17 45/64 / test_secondary_index
FAILED:  dtest-latest.materialized_views_test.TestMaterializedViews.Tests / dtest-latest jdk11 4/64 / test_simple_repair_by_base
FAILED:  dtest-latest.materialized_views_test.TestMaterializedViews.Tests / dtest-latest jdk11 4/64 / test_simple_repair_by_base
FAILED:  dtest-latest.materialized_views_test.TestMaterializedViews.Tests / dtest-latest jdk11 4/64 / test_simple_repair_by_base
FAILED:  dtest-latest.materialized_views_test.TestMaterializedViews.Tests / dtest-latest jdk17 4/64 / test_simple_repair_by_base
FAILED:  dtest-latest.materialized_views_test.TestMaterializedViews.Tests / dtest-latest jdk17 4/64 / test_simple_repair_by_base
FAILED:  dtest-latest.materialized_views_test.TestMaterializedViews.Tests / dtest-latest jdk17 4/64 / test_simple_repair_by_base
FAILED:  dtest-latest.materialized_views_test.TestMaterializedViews.Tests / dtest-latest jdk11 5/64 / test_simple_repair_by_view
FAILED:  dtest-latest.materialized_views_test.TestMaterializedViews.Tests / dtest-latest jdk11 5/64 / test_simple_repair_by_view
FAILED:  dtest-latest.materialized_views_test.TestMaterializedViews.Tests / dtest-latest jdk17 5/64 / test_simple_repair_by_view
FAILED:  dtest-latest.materialized_views_test.TestMaterializedViews.Tests / dtest-latest jdk17 5/64 / test_simple_repair_by_view
FAILED:  dtest-latest.materialized_views_test.TestMaterializedViews.Tests / dtest-latest jdk17 5/64 / test_simple_repair_by_view
FAILED:  dtest-latest.materialized_views_test.TestMaterializedViews.Tests / dtest-latest jdk11 5/64 / test_simple_repair_by_view
FAILED:  dtest-latest.materialized_views_test.TestMaterializedViews.Tests / dtest-latest jdk17 46/64 / test_ttl
FAILED:  dtest-latest.materialized_views_test.TestMaterializedViews.Tests / dtest-latest jdk17 46/64 / test_ttl
FAILED:  dtest-latest.materialized_views_test.TestMaterializedViews.Tests / dtest-latest jdk17 46/64 / test_ttl
FAILED:  dtest-latest.materialized_views_test.TestMaterializedViews.Tests / dtest-latest jdk11 46/64 / test_ttl
FAILED:  dtest-latest.materialized_views_test.TestMaterializedViews.Tests / dtest-latest jdk11 46/64 / test_ttl
FAILED:  dtest-latest.materialized_views_test.TestMaterializedViews.Tests / dtest-latest jdk11 46/64 / test_ttl
FAILED:  dtest-latest.materialized_views_test.TestMaterializedViews.Tests / dtest-latest jdk11 27/64 / test_view_metadata_cleanup
FAILED:  dtest-latest.materialized_views_test.TestMaterializedViews.Tests / dtest-latest jdk11 27/64 / test_view_metadata_cleanup
FAILED:  dtest-latest.materialized_views_test.TestMaterializedViews.Tests / dtest-latest jdk17 27/64 / test_view_metadata_cleanup
FAILED:  dtest-latest.materialized_views_test.TestMaterializedViews.Tests / dtest-latest jdk17 27/64 / test_view_metadata_cleanup
FAILED:  dtest-latest.materialized_views_test.TestMaterializedViews.Tests / dtest-latest jdk17 27/64 / test_view_metadata_cleanup
FAILED:  dtest-latest.materialized_views_test.TestMaterializedViews.Tests / dtest-latest jdk11 27/64 / test_view_metadata_cleanup
FAILED:  dtest-latest.materialized_views_test.TestMaterializedViews.Tests / dtest-latest jdk11 3/64 / test_view_tombstone
FAILED:  dtest-latest.materialized_views_test.TestMaterializedViews.Tests / dtest-latest jdk17 3/64 / test_view_tombstone
FAILED:  dtest-latest.materialized_views_test.TestMaterializedViews.Tests / dtest-latest jdk17 3/64 / test_view_tombstone
FAILED:  dtest-latest.materialized_views_test.TestMaterializedViews.Tests / dtest-latest jdk11 3/64 / test_view_tombstone
FAILED:  dtest-latest.materialized_views_test.TestMaterializedViews.Tests / dtest-latest jdk11 3/64 / test_view_tombstone
FAILED:  dtest-latest.materialized_views_test.TestMaterializedViews.Tests / dtest-latest jdk17 3/64 / test_view_tombstone
FAILED:  dtest-latest.multidc_putget_test.TestMultiDCPutGet.Tests / dtest-latest jdk17 16/64 / test_putget_2dc_rf1
FAILED:  dtest-latest.multidc_putget_test.TestMultiDCPutGet.Tests / dtest-latest jdk11 16/64 / test_putget_2dc_rf1
FAILED:  dtest-latest.multidc_putget_test.TestMultiDCPutGet.Tests / dtest-latest jdk17 16/64 / test_putget_2dc_rf1
FAILED:  dtest-latest.multidc_putget_test.TestMultiDCPutGet.Tests / dtest-latest jdk11 16/64 / test_putget_2dc_rf1
FAILED:  dtest-latest.multidc_putget_test.TestMultiDCPutGet.Tests / dtest-latest jdk17 17/64 / test_putget_2dc_rf2
FAILED:  dtest-latest.multidc_putget_test.TestMultiDCPutGet.Tests / dtest-latest jdk17 17/64 / test_putget_2dc_rf2
FAILED:  dtest-latest.multidc_putget_test.TestMultiDCPutGet.Tests / dtest-latest jdk11 17/64 / test_putget_2dc_rf2
FAILED:  dtest-latest.multidc_putget_test.TestMultiDCPutGet.Tests / dtest-latest jdk11 17/64 / test_putget_2dc_rf2
FAILED:  dtest-latest.nodetool_test.TestNodetool.Tests / dtest-latest jdk11 25/64 / test_cleanup_when_no_replica_with_index
FAILED:  dtest-latest.nodetool_test.TestNodetool.Tests / dtest-latest jdk17 25/64 / test_cleanup_when_no_replica_with_index
FAILED:  dtest-latest.nodetool_test.TestNodetool.Tests / dtest-latest jdk17 25/64 / test_cleanup_when_no_replica_with_index
FAILED:  dtest-latest.nodetool_test.TestNodetool.Tests / dtest-latest jdk11 25/64 / test_cleanup_when_no_replica_with_index
FAILED:  dtest-latest.nodetool_test.TestNodetool.Tests / dtest-latest jdk11 26/64 / test_cleanup_when_no_replica_without_index
FAILED:  dtest-latest.nodetool_test.TestNodetool.Tests / dtest-latest jdk11 26/64 / test_cleanup_when_no_replica_without_index
FAILED:  dtest-latest.nodetool_test.TestNodetool.Tests / dtest-latest jdk17 26/64 / test_cleanup_when_no_replica_without_index
FAILED:  dtest-latest.nodetool_test.TestNodetool.Tests / dtest-latest jdk17 26/64 / test_cleanup_when_no_replica_without_index
FAILED:  dtest-latest.nodetool_test.TestNodetool.Tests / dtest-latest jdk11 23/64 / test_correct_dc_rack_in_nodetool_info
FAILED:  dtest-latest.nodetool_test.TestNodetool.Tests / dtest-latest jdk17 23/64 / test_correct_dc_rack_in_nodetool_info
FAILED:  dtest-latest.nodetool_test.TestNodetool.Tests / dtest-latest jdk17 23/64 / test_correct_dc_rack_in_nodetool_info
FAILED:  dtest-latest.nodetool_test.TestNodetool.Tests / dtest-latest jdk11 23/64 / test_correct_dc_rack_in_nodetool_info
FAILED:  dtest-latest.nodetool_test.TestNodetool.Tests / dtest-latest jdk11 22/64 / test_decommission_after_drain_is_invalid
FAILED:  dtest-latest.nodetool_test.TestNodetool.Tests / dtest-latest jdk17 22/64 / test_decommission_after_drain_is_invalid
FAILED:  dtest-latest.nodetool_test.TestNodetool.Tests / dtest-latest jdk17 22/64 / test_decommission_after_drain_is_invalid
FAILED:  dtest-latest.nodetool_test.TestNodetool.Tests / dtest-latest jdk11 22/64 / test_decommission_after_drain_is_invalid
FAILED:  dtest-latest.nodetool_test.TestNodetool.Tests / dtest-latest jdk11 32/64 / test_describecluster_more_information_three_datacenters
FAILED:  dtest-latest.nodetool_test.TestNodetool.Tests / dtest-latest jdk17 32/64 / test_describecluster_more_information_three_datacenters
FAILED:  dtest-latest.nodetool_test.TestNodetool.Tests / dtest-latest jdk17 32/64 / test_describecluster_more_information_three_datacenters
FAILED:  dtest-latest.nodetool_test.TestNodetool.Tests / dtest-latest jdk11 32/64 / test_describecluster_more_information_three_datacenters
FAILED:  dtest-latest.nodetool_test.TestNodetool.Tests / dtest-latest jdk11 27/64 / test_meaningless_notice_in_status
FAILED:  dtest-latest.nodetool_test.TestNodetool.Tests / dtest-latest jdk11 27/64 / test_meaningless_notice_in_status
FAILED:  dtest-latest.nodetool_test.TestNodetool.Tests / dtest-latest jdk17 27/64 / test_meaningless_notice_in_status
FAILED:  dtest-latest.nodetool_test.TestNodetool.Tests / dtest-latest jdk17 27/64 / test_meaningless_notice_in_status
FAILED:  dtest-latest.nodetool_test.TestNodetool.Tests / dtest-latest jdk17 24/64 / test_nodetool_timeout_commands
FAILED:  dtest-latest.nodetool_test.TestNodetool.Tests / dtest-latest jdk17 24/64 / test_nodetool_timeout_commands
FAILED:  dtest-latest.nodetool_test.TestNodetool.Tests / dtest-latest jdk11 24/64 / test_nodetool_timeout_commands
FAILED:  dtest-latest.nodetool_test.TestNodetool.Tests / dtest-latest jdk11 24/64 / test_nodetool_timeout_commands
FAILED:  dtest-latest.nodetool_test.TestNodetool.Tests / dtest-latest jdk17 33/64 / test_sjk
FAILED:  dtest-latest.nodetool_test.TestNodetool.Tests / dtest-latest jdk17 33/64 / test_sjk
FAILED:  dtest-latest.nodetool_test.TestNodetool.Tests / dtest-latest jdk11 33/64 / test_sjk
FAILED:  dtest-latest.nodetool_test.TestNodetool.Tests / dtest-latest jdk11 33/64 / test_sjk
FAILED:  dtest-latest.read_repair_test.TestSpeculativeReadRepair.Tests / dtest-latest jdk17 59/64 / test_failed_read_repair
FAILED:  dtest-latest.rebuild_test.TestRebuild.Tests / dtest-latest jdk17 7/64 / test_rebuild_ranges
FAILED:  dtest-latest.rebuild_test.TestRebuild.Tests / dtest-latest jdk11 7/64 / test_rebuild_ranges
FAILED:  dtest-latest.rebuild_test.TestRebuild.Tests / dtest-latest jdk11 6/64 / test_resumable_rebuild
FAILED:  dtest-latest.rebuild_test.TestRebuild.Tests / dtest-latest jdk17 6/64 / test_resumable_rebuild
FAILED:  dtest-latest.rebuild_test.TestRebuild.Tests / dtest-latest jdk17 5/64 / test_simple_rebuild
FAILED:  dtest-latest.rebuild_test.TestRebuild.Tests / dtest-latest jdk11 5/64 / test_simple_rebuild
FAILED:  dtest-latest.repair_tests.repair_test.TestRepair.Tests / dtest-latest jdk17 45/64 / test_anticompaction_after_normal_repair
FAILED:  dtest-latest.repair_tests.repair_test.TestRepair.Tests / dtest-latest jdk11 45/64 / test_anticompaction_after_normal_repair
FAILED:  dtest-latest.repair_tests.repair_test.TestRepair.Tests / dtest-latest jdk11 45/64 / test_anticompaction_after_normal_repair
FAILED:  dtest-latest.repair_tests.repair_test.TestRepair.Tests / dtest-latest jdk17 45/64 / test_anticompaction_after_normal_repair
FAILED:  dtest-latest.repair_tests.repair_test.TestRepair.Tests / dtest-latest jdk11 58/64 / test_dc_parallel_repair
FAILED:  dtest-latest.repair_tests.repair_test.TestRepair.Tests / dtest-latest jdk17 58/64 / test_dc_parallel_repair
FAILED:  dtest-latest.repair_tests.repair_test.TestRepair.Tests / dtest-latest jdk17 58/64 / test_dc_parallel_repair
FAILED:  dtest-latest.repair_tests.repair_test.TestRepair.Tests / dtest-latest jdk11 58/64 / test_dc_parallel_repair
FAILED:  dtest-latest.repair_tests.repair_test.TestRepair.Tests / dtest-latest jdk11 57/64 / test_dc_repair
FAILED:  dtest-latest.repair_tests.repair_test.TestRepair.Tests / dtest-latest jdk17 57/64 / test_dc_repair
FAILED:  dtest-latest.repair_tests.repair_test.TestRepair.Tests / dtest-latest jdk11 57/64 / test_dc_repair
FAILED:  dtest-latest.repair_tests.repair_test.TestRepair.Tests / dtest-latest jdk17 57/64 / test_dc_repair
FAILED:  dtest-latest.repair_tests.repair_test.TestRepair.Tests / dtest-latest jdk11 56/64 / test_local_dc_repair
FAILED:  dtest-latest.repair_tests.repair_test.TestRepair.Tests / dtest-latest jdk17 56/64 / test_local_dc_repair
FAILED:  dtest-latest.repair_tests.repair_test.TestRepair.Tests / dtest-latest jdk17 56/64 / test_local_dc_repair
FAILED:  dtest-latest.repair_tests.repair_test.TestRepair.Tests / dtest-latest jdk11 56/64 / test_local_dc_repair
FAILED:  dtest-latest.repair_tests.repair_test.TestRepair.Tests / dtest-latest jdk11 60/64 / test_non_replicated_ks_repair
FAILED:  dtest-latest.repair_tests.repair_test.TestRepair.Tests / dtest-latest jdk17 60/64 / test_non_replicated_ks_repair
FAILED:  dtest-latest.repair_tests.repair_test.TestRepair.Tests / dtest-latest jdk17 60/64 / test_non_replicated_ks_repair
FAILED:  dtest-latest.repair_tests.repair_test.TestRepair.Tests / dtest-latest jdk11 60/64 / test_non_replicated_ks_repair
FAILED:  dtest-latest.repair_tests.repair_test.TestRepair.Tests / dtest-latest jdk11 59/64 / test_repair_validates_dc
FAILED:  dtest-latest.repair_tests.repair_test.TestRepair.Tests / dtest-latest jdk11 59/64 / test_repair_validates_dc
FAILED:  dtest-latest.repair_tests.repair_test.TestRepair.Tests / dtest-latest jdk17 59/64 / test_repair_validates_dc
FAILED:  dtest-latest.repair_tests.repair_test.TestRepair.Tests / dtest-latest jdk17 59/64 / test_repair_validates_dc
FAILED:  dtest-latest.replace_address_test.TestReplaceAddress.Tests / dtest-latest jdk17 15/64 / test_multi_dc_replace_with_rf1
FAILED:  dtest-latest.replace_address_test.TestReplaceAddress.Tests / dtest-latest jdk17 15/64 / test_multi_dc_replace_with_rf1
FAILED:  dtest-latest.replace_address_test.TestReplaceAddress.Tests / dtest-latest jdk11 15/64 / test_multi_dc_replace_with_rf1
FAILED:  dtest-latest.replace_address_test.TestReplaceAddress.Tests / dtest-latest jdk11 15/64 / test_multi_dc_replace_with_rf1
FAILED:  dtest-latest.replication_test.TestSnitchConfigurationUpdate.Tests / dtest-latest jdk17 16/64 / test_cannot_restart_with_different_rack
FAILED:  dtest-latest.replication_test.TestSnitchConfigurationUpdate.Tests / dtest-latest jdk11 16/64 / test_cannot_restart_with_different_rack
FAILED:  dtest-latest.replication_test.TestSnitchConfigurationUpdate.Tests / dtest-latest jdk11 16/64 / test_cannot_restart_with_different_rack
FAILED:  dtest-latest.replication_test.TestSnitchConfigurationUpdate.Tests / dtest-latest jdk17 16/64 / test_cannot_restart_with_different_rack
FAILED:  dtest-latest.replication_test.TestSnitchConfigurationUpdate.Tests / dtest-latest jdk11 20/64 / test_switch_data_center_startup_fails
... and 34 other failed tests.

  -------------------------------------------------------------------------------
  For complete test report and logs see https://nightlies.apache.org/cassandra/Cassandra-trunk/1964/