You are viewing a plain text version of this content. The canonical link for it is here.
Posted to dev@zookeeper.apache.org by Apache Jenkins Server <je...@builds.apache.org> on 2015/08/07 09:58:07 UTC
ZooKeeper_branch34_solaris - Build # 1036 - Failure
See https://builds.apache.org/job/ZooKeeper_branch34_solaris/1036/
###################################################################################
########################## LAST 60 LINES OF THE CONSOLE ###########################
[...truncated 171862 lines...]
[junit] 2015-08-07 07:58:38,961 [myid:] - INFO [main:ClientBase@490] - STOPPING server
[junit] 2015-08-07 07:58:38,962 [myid:] - INFO [main:ZooKeeperServer@441] - shutting down
[junit] 2015-08-07 07:58:38,962 [myid:] - INFO [main:SessionTrackerImpl@225] - Shutting down
[junit] 2015-08-07 07:58:38,962 [myid:] - INFO [main:PrepRequestProcessor@769] - Shutting down
[junit] 2015-08-07 07:58:38,962 [myid:] - INFO [main:SyncRequestProcessor@209] - Shutting down
[junit] 2015-08-07 07:58:38,962 [myid:] - INFO [ProcessThread(sid:0 cport:11221)::PrepRequestProcessor@145] - PrepRequestProcessor exited loop!
[junit] 2015-08-07 07:58:38,963 [myid:] - INFO [SyncThread:0:SyncRequestProcessor@187] - SyncRequestProcessor exited!
[junit] 2015-08-07 07:58:38,963 [myid:] - INFO [main:FinalRequestProcessor@415] - shutdown of request processor complete
[junit] 2015-08-07 07:58:38,963 [myid:] - INFO [main:FourLetterWordMain@62] - connecting to 127.0.0.1 11221
[junit] 2015-08-07 07:58:38,964 [myid:] - INFO [main:JMXEnv@146] - ensureOnly:[]
[junit] 2015-08-07 07:58:38,964 [myid:] - INFO [main:ClientBase@443] - STARTING server
[junit] 2015-08-07 07:58:38,965 [myid:] - INFO [main:ClientBase@364] - CREATING server instance 127.0.0.1:11221
[junit] 2015-08-07 07:58:38,965 [myid:] - INFO [main:NIOServerCnxnFactory@89] - binding to port 0.0.0.0/0.0.0.0:11221
[junit] 2015-08-07 07:58:38,965 [myid:] - INFO [main:ClientBase@339] - STARTING server instance 127.0.0.1:11221
[junit] 2015-08-07 07:58:38,965 [myid:] - INFO [main:ZooKeeperServer@162] - Created server with tickTime 3000 minSessionTimeout 6000 maxSessionTimeout 60000 datadir /zonestorage/hudson_solaris/home/hudson/hudson-slave/workspace/ZooKeeper_branch34_solaris/trunk/build/test/tmp/test3780266787992217674.junit.dir/version-2 snapdir /zonestorage/hudson_solaris/home/hudson/hudson-slave/workspace/ZooKeeper_branch34_solaris/trunk/build/test/tmp/test3780266787992217674.junit.dir/version-2
[junit] 2015-08-07 07:58:38,968 [myid:] - INFO [main:FourLetterWordMain@62] - connecting to 127.0.0.1 11221
[junit] 2015-08-07 07:58:38,968 [myid:] - INFO [NIOServerCxn.Factory:0.0.0.0/0.0.0.0:11221:NIOServerCnxnFactory@192] - Accepted socket connection from /127.0.0.1:57569
[junit] 2015-08-07 07:58:38,968 [myid:] - INFO [NIOServerCxn.Factory:0.0.0.0/0.0.0.0:11221:NIOServerCnxn@827] - Processing stat command from /127.0.0.1:57569
[junit] 2015-08-07 07:58:38,969 [myid:] - INFO [Thread-5:NIOServerCnxn$StatCommand@663] - Stat command output
[junit] 2015-08-07 07:58:38,969 [myid:] - INFO [Thread-5:NIOServerCnxn@1007] - Closed socket connection for client /127.0.0.1:57569 (no session established for client)
[junit] 2015-08-07 07:58:38,969 [myid:] - INFO [main:JMXEnv@229] - ensureParent:[InMemoryDataTree, StandaloneServer_port]
[junit] 2015-08-07 07:58:38,970 [myid:] - INFO [main:JMXEnv@246] - expect:InMemoryDataTree
[junit] 2015-08-07 07:58:38,970 [myid:] - INFO [main:JMXEnv@250] - found:InMemoryDataTree org.apache.ZooKeeperService:name0=StandaloneServer_port11221,name1=InMemoryDataTree
[junit] 2015-08-07 07:58:38,971 [myid:] - INFO [main:JMXEnv@246] - expect:StandaloneServer_port
[junit] 2015-08-07 07:58:38,971 [myid:] - INFO [main:JMXEnv@250] - found:StandaloneServer_port org.apache.ZooKeeperService:name0=StandaloneServer_port11221
[junit] 2015-08-07 07:58:38,971 [myid:] - INFO [main:JUnit4ZKTestRunner$LoggedInvokeMethod@58] - Memory used 8712
[junit] 2015-08-07 07:58:38,971 [myid:] - INFO [main:JUnit4ZKTestRunner$LoggedInvokeMethod@63] - Number of threads 20
[junit] 2015-08-07 07:58:38,971 [myid:] - INFO [main:JUnit4ZKTestRunner$LoggedInvokeMethod@78] - FINISHED TEST METHOD testQuota
[junit] 2015-08-07 07:58:38,971 [myid:] - INFO [main:ClientBase@520] - tearDown starting
[junit] 2015-08-07 07:58:39,001 [myid:] - INFO [SessionTracker:SessionTrackerImpl@162] - SessionTrackerImpl exited loop!
[junit] 2015-08-07 07:58:39,001 [myid:] - INFO [SessionTracker:SessionTrackerImpl@162] - SessionTrackerImpl exited loop!
[junit] 2015-08-07 07:58:39,051 [myid:] - INFO [main:ZooKeeper@684] - Session: 0x14f072b3ecf0000 closed
[junit] 2015-08-07 07:58:39,051 [myid:] - INFO [main-EventThread:ClientCnxn$EventThread@519] - EventThread shut down for session: 0x14f072b3ecf0000
[junit] 2015-08-07 07:58:39,052 [myid:] - INFO [main:ClientBase@490] - STOPPING server
[junit] 2015-08-07 07:58:39,053 [myid:] - INFO [main:ZooKeeperServer@441] - shutting down
[junit] 2015-08-07 07:58:39,053 [myid:] - INFO [main:SessionTrackerImpl@225] - Shutting down
[junit] 2015-08-07 07:58:39,053 [myid:] - INFO [main:PrepRequestProcessor@769] - Shutting down
[junit] 2015-08-07 07:58:39,053 [myid:] - INFO [main:SyncRequestProcessor@209] - Shutting down
[junit] 2015-08-07 07:58:39,053 [myid:] - INFO [ProcessThread(sid:0 cport:11221)::PrepRequestProcessor@145] - PrepRequestProcessor exited loop!
[junit] 2015-08-07 07:58:39,053 [myid:] - INFO [SyncThread:0:SyncRequestProcessor@187] - SyncRequestProcessor exited!
[junit] 2015-08-07 07:58:39,053 [myid:] - INFO [main:FinalRequestProcessor@415] - shutdown of request processor complete
[junit] 2015-08-07 07:58:39,054 [myid:] - INFO [main:FourLetterWordMain@62] - connecting to 127.0.0.1 11221
[junit] 2015-08-07 07:58:39,054 [myid:] - INFO [main:JMXEnv@146] - ensureOnly:[]
[junit] 2015-08-07 07:58:39,057 [myid:] - INFO [main:ClientBase@545] - fdcount after test is: 42 at start it was 28
[junit] 2015-08-07 07:58:39,057 [myid:] - INFO [main:ClientBase@547] - sleeping for 20 secs
[junit] 2015-08-07 07:58:39,058 [myid:] - INFO [main:ZKTestCase$1@60] - SUCCEEDED testQuota
[junit] 2015-08-07 07:58:39,058 [myid:] - INFO [main:ZKTestCase$1@55] - FINISHED testQuota
[junit] Tests run: 1, Failures: 0, Errors: 0, Time elapsed: 0.668 sec
BUILD FAILED
/zonestorage/hudson_solaris/home/hudson/hudson-slave/workspace/ZooKeeper_branch34_solaris/trunk/build.xml:1318: Tests failed!
Total time: 24 minutes 18 seconds
Build step 'Invoke Ant' marked build as failure
[locks-and-latches] Releasing all the locks
[locks-and-latches] All the locks released
Recording test results
Email was triggered for: Failure
Sending email for trigger: Failure
###################################################################################
############################## FAILED TESTS (if any) ##############################
1 tests failed.
REGRESSION: org.apache.zookeeper.test.QuorumZxidSyncTest.testLateLogs
Error Message:
KeeperErrorCode = ConnectionLoss for /1
Stack Trace:
org.apache.zookeeper.KeeperException$ConnectionLossException: KeeperErrorCode = ConnectionLoss for /1
at org.apache.zookeeper.KeeperException.create(KeeperException.java:99)
at org.apache.zookeeper.KeeperException.create(KeeperException.java:51)
at org.apache.zookeeper.ZooKeeper.create(ZooKeeper.java:783)
at org.apache.zookeeper.test.QuorumZxidSyncTest.testLateLogs(QuorumZxidSyncTest.java:124)
at org.apache.zookeeper.JUnit4ZKTestRunner$LoggedInvokeMethod.evaluate(JUnit4ZKTestRunner.java:55)