You are viewing a plain text version of this content. The canonical link for it is here.
Posted to builds@lucene.apache.org by Policeman Jenkins Server <je...@thetaphi.de> on 2025/02/03 18:52:21 UTC

[JENKINS] Lucene-10.x-Linux (64bit/hotspot/jdk-22) - Build # 2324 - Still Unstable!

Build: https://jenkins.thetaphi.de/job/Lucene-10.x-Linux/2324/
Java: 64bit/hotspot/jdk-22 -XX:-UseCompressedOops -XX:+UseG1GC

1 tests failed.
FAILED:  org.apache.lucene.search.TestSeededKnnByteVectorQuery.testSeedWithTimeout

Error Message:
java.lang.IllegalArgumentException: The number of entry points provided is less than the number of entry points requested

Stack Trace:
java.lang.IllegalArgumentException: The number of entry points provided is less than the number of entry points requested
	at __randomizedtesting.SeedInfo.seed([1D41B91E57EE6C18:21903CB74689D863]:0)
	at org.apache.lucene.util.hnsw.SeededHnswGraphSearcher.fromEntryPoints(SeededHnswGraphSearcher.java:48)
	at org.apache.lucene.util.hnsw.HnswGraphSearcher.search(HnswGraphSearcher.java:76)
	at org.apache.lucene.codecs.lucene99.Lucene99HnswVectorsReader.search(Lucene99HnswVectorsReader.java:321)
	at org.apache.lucene.codecs.lucene99.Lucene99HnswVectorsReader.search(Lucene99HnswVectorsReader.java:299)
	at org.apache.lucene.codecs.perfield.PerFieldKnnVectorsFormat$FieldsReader.search(PerFieldKnnVectorsFormat.java:322)
	at org.apache.lucene.index.CodecReader.searchNearestVectors(CodecReader.java:286)
	at org.apache.lucene.search.KnnByteVectorQuery.approximateSearch(KnnByteVectorQuery.java:96)
	at org.apache.lucene.search.SeededKnnVectorQuery.approximateSearch(SeededKnnVectorQuery.java:120)
	at org.apache.lucene.search.AbstractKnnVectorQuery.getLeafResults(AbstractKnnVectorQuery.java:128)
	at org.apache.lucene.search.AbstractKnnVectorQuery.searchLeaf(AbstractKnnVectorQuery.java:110)
	at org.apache.lucene.search.AbstractKnnVectorQuery.lambda$rewrite$0(AbstractKnnVectorQuery.java:93)
	at java.base/java.util.concurrent.FutureTask.run(FutureTask.java:317)
	at org.apache.lucene.search.TaskExecutor$Task.run(TaskExecutor.java:173)
	at org.apache.lucene.search.TaskExecutor.invokeAll(TaskExecutor.java:111)
	at org.apache.lucene.search.AbstractKnnVectorQuery.rewrite(AbstractKnnVectorQuery.java:95)
	at org.apache.lucene.search.SeededKnnVectorQuery.rewrite(SeededKnnVectorQuery.java:94)
	at org.apache.lucene.search.SeededKnnVectorQuery.rewrite(SeededKnnVectorQuery.java:98)
	at org.apache.lucene.search.ConstantScoreQuery.rewrite(ConstantScoreQuery.java:44)
	at org.apache.lucene.search.IndexSearcher.rewrite(IndexSearcher.java:875)
	at org.apache.lucene.tests.search.AssertingIndexSearcher.rewrite(AssertingIndexSearcher.java:67)
	at org.apache.lucene.search.IndexSearcher.count(IndexSearcher.java:504)
	at org.apache.lucene.search.TestSeededKnnByteVectorQuery.testSeedWithTimeout(TestSeededKnnByteVectorQuery.java:111)
	at java.base/jdk.internal.reflect.DirectMethodHandleAccessor.invoke(DirectMethodHandleAccessor.java:103)
	at java.base/java.lang.reflect.Method.invoke(Method.java:580)
	at com.carrotsearch.randomizedtesting.RandomizedRunner.invoke(RandomizedRunner.java:1758)
	at com.carrotsearch.randomizedtesting.RandomizedRunner$8.evaluate(RandomizedRunner.java:946)
	at com.carrotsearch.randomizedtesting.RandomizedRunner$9.evaluate(RandomizedRunner.java:982)
	at com.carrotsearch.randomizedtesting.RandomizedRunner$10.evaluate(RandomizedRunner.java:996)
	at org.apache.lucene.tests.util.TestRuleSetupTeardownChained$1.evaluate(TestRuleSetupTeardownChained.java:48)
	at org.apache.lucene.tests.util.AbstractBeforeAfterRule$1.evaluate(AbstractBeforeAfterRule.java:43)
	at org.apache.lucene.tests.util.TestRuleThreadAndTestName$1.evaluate(TestRuleThreadAndTestName.java:45)
	at org.apache.lucene.tests.util.TestRuleIgnoreAfterMaxFailures$1.evaluate(TestRuleIgnoreAfterMaxFailures.java:60)
	at org.apache.lucene.tests.util.TestRuleMarkFailure$1.evaluate(TestRuleMarkFailure.java:44)
	at org.junit.rules.RunRules.evaluate(RunRules.java:20)
	at com.carrotsearch.randomizedtesting.rules.StatementAdapter.evaluate(StatementAdapter.java:36)
	at com.carrotsearch.randomizedtesting.ThreadLeakControl$StatementRunner.run(ThreadLeakControl.java:390)
	at com.carrotsearch.randomizedtesting.ThreadLeakControl.forkTimeoutingTask(ThreadLeakControl.java:843)
	at com.carrotsearch.randomizedtesting.ThreadLeakControl$3.evaluate(ThreadLeakControl.java:490)
	at com.carrotsearch.randomizedtesting.RandomizedRunner.runSingleTest(RandomizedRunner.java:955)
	at com.carrotsearch.randomizedtesting.RandomizedRunner$5.evaluate(RandomizedRunner.java:840)
	at com.carrotsearch.randomizedtesting.RandomizedRunner$6.evaluate(RandomizedRunner.java:891)
	at com.carrotsearch.randomizedtesting.RandomizedRunner$7.evaluate(RandomizedRunner.java:902)
	at org.apache.lucene.tests.util.AbstractBeforeAfterRule$1.evaluate(AbstractBeforeAfterRule.java:43)
	at com.carrotsearch.randomizedtesting.rules.StatementAdapter.evaluate(StatementAdapter.java:36)
	at org.apache.lucene.tests.util.TestRuleStoreClassName$1.evaluate(TestRuleStoreClassName.java:38)
	at com.carrotsearch.randomizedtesting.rules.NoShadowingOrOverridesOnMethodsRule$1.evaluate(NoShadowingOrOverridesOnMethodsRule.java:40)
	at com.carrotsearch.randomizedtesting.rules.NoShadowingOrOverridesOnMethodsRule$1.evaluate(NoShadowingOrOverridesOnMethodsRule.java:40)
	at com.carrotsearch.randomizedtesting.rules.StatementAdapter.evaluate(StatementAdapter.java:36)
	at com.carrotsearch.randomizedtesting.rules.StatementAdapter.evaluate(StatementAdapter.java:36)
	at org.apache.lucene.tests.util.TestRuleAssertionsRequired$1.evaluate(TestRuleAssertionsRequired.java:53)
	at org.apache.lucene.tests.util.AbstractBeforeAfterRule$1.evaluate(AbstractBeforeAfterRule.java:43)
	at org.apache.lucene.tests.util.TestRuleMarkFailure$1.evaluate(TestRuleMarkFailure.java:44)
	at org.apache.lucene.tests.util.TestRuleIgnoreAfterMaxFailures$1.evaluate(TestRuleIgnoreAfterMaxFailures.java:60)
	at org.apache.lucene.tests.util.TestRuleIgnoreTestSuites$1.evaluate(TestRuleIgnoreTestSuites.java:47)
	at org.junit.rules.RunRules.evaluate(RunRules.java:20)
	at com.carrotsearch.randomizedtesting.rules.StatementAdapter.evaluate(StatementAdapter.java:36)
	at com.carrotsearch.randomizedtesting.ThreadLeakControl$StatementRunner.run(ThreadLeakControl.java:390)
	at com.carrotsearch.randomizedtesting.ThreadLeakControl.lambda$forkTimeoutingTask$0(ThreadLeakControl.java:850)
	at java.base/java.lang.Thread.run(Thread.java:1570)