You are viewing a plain text version of this content. The canonical link for it is here.
Posted to builds@beam.apache.org by Apache Jenkins Server <je...@builds.apache.org> on 2024/01/11 18:46:57 UTC
Build failed in Jenkins: beam_PostCommit_Python311 #1114
See <https://ci-beam.apache.org/job/beam_PostCommit_Python311/1114/display/redirect?page=changes>
Changes:
[noreply] update CHANGES.md with error handling for fileIO and bigtableIO (#29983)
------------------------------------------
[...truncated 8.90 MB...]
seconds: 1704994443
nanos: 114609241
}
message: "SDK Harness waiting for in-flight requests to complete"
log_location: "/usr/local/lib/python3.11/site-packages/apache_beam/runners/worker/sdk_worker.py:278"
thread: "MainThread"
INFO:root:severity: INFO
timestamp {
seconds: 1704994443
nanos: 114664077
}
message: "Closing all cached grpc data channels."
log_location: "/usr/local/lib/python3.11/site-packages/apache_beam/runners/worker/data_plane.py:820"
thread: "MainThread"
INFO:root:severity: INFO
timestamp {
seconds: 1704994443
nanos: 114714860
}
message: "Closing all cached gRPC state handlers."
log_location: "/usr/local/lib/python3.11/site-packages/apache_beam/runners/worker/sdk_worker.py:918"
thread: "MainThread"
INFO:root:severity: INFO
timestamp {
seconds: 1704994443
nanos: 115449666
}
message: "Done consuming work."
log_location: "/usr/local/lib/python3.11/site-packages/apache_beam/runners/worker/sdk_worker.py:290"
thread: "MainThread"
INFO:root:severity: INFO
timestamp {
seconds: 1704994443
nanos: 115555763
}
message: "Python sdk harness exiting."
log_location: "/usr/local/lib/python3.11/site-packages/apache_beam/runners/worker/sdk_worker_main.py:213"
thread: "MainThread"
INFO:apache_beam.runners.portability.local_job_service:Completed job in 27.028770923614502 seconds with state DONE.
INFO:root:Completed job in 27.028770923614502 seconds with state DONE.
INFO:apache_beam.runners.portability.portable_runner:Job state changed to DONE
> Task :sdks:python:test-suites:portable:py311:portableWordCountSparkRunnerBatch
INFO:apache_beam.runners.worker.worker_pool_main:Listening for workers at localhost:46271
INFO:apache_beam.runners.portability.fn_api_runner.translations:==================== <function pack_combiners at 0x7f7295c07740> ====================
INFO:apache_beam.runners.portability.fn_api_runner.translations:==================== <function lift_combiners at 0x7f7295c077e0> ====================
INFO:apache_beam.runners.portability.fn_api_runner.translations:==================== <function sort_stages at 0x7f7295c0c040> ====================
INFO:apache_beam.utils.subprocess_server:Starting service with ('java' '-jar' '<https://ci-beam.apache.org/job/beam_PostCommit_Python311/ws/src/runners/spark/3/job-server/build/libs/beam-runners-spark-3-job-server-2.54.0-SNAPSHOT.jar'> '--spark-master-url' 'local[4]' '--artifacts-dir' '/tmp/beam-temppz9nqmre/artifactsv7mudl2d' '--job-port' '45709' '--artifact-port' '0' '--expansion-port' '0')
INFO:apache_beam.utils.subprocess_server:24/01/11 17:34:14 WARN software.amazon.awssdk.regions.internal.util.EC2MetadataUtils: Unable to retrieve the requested metadata.
INFO:apache_beam.utils.subprocess_server:24/01/11 17:34:14 INFO org.apache.beam.runners.jobsubmission.JobServerDriver: ArtifactStagingService started on localhost:38705
INFO:apache_beam.utils.subprocess_server:24/01/11 17:34:14 INFO org.apache.beam.runners.jobsubmission.JobServerDriver: Java ExpansionService started on localhost:44379
INFO:apache_beam.utils.subprocess_server:24/01/11 17:34:14 INFO org.apache.beam.runners.jobsubmission.JobServerDriver: JobService started on localhost:45709
INFO:apache_beam.utils.subprocess_server:24/01/11 17:34:14 INFO org.apache.beam.runners.jobsubmission.JobServerDriver: Job server now running, terminate with Ctrl+C
INFO:apache_beam.utils.subprocess_server:24/01/11 17:34:16 INFO org.apache.beam.runners.fnexecution.artifact.ArtifactStagingService: Staging artifacts for job_f77f2c4f-03b6-4028-b00e-76b4d767568d.
INFO:apache_beam.utils.subprocess_server:24/01/11 17:34:16 INFO org.apache.beam.runners.fnexecution.artifact.ArtifactStagingService: Resolving artifacts for job_f77f2c4f-03b6-4028-b00e-76b4d767568d.0:ref_Environment_default_environment_1.
INFO:apache_beam.utils.subprocess_server:24/01/11 17:34:16 INFO org.apache.beam.runners.fnexecution.artifact.ArtifactStagingService: Getting 1 artifacts for job_f77f2c4f-03b6-4028-b00e-76b4d767568d.null.
INFO:apache_beam.utils.subprocess_server:24/01/11 17:34:16 INFO org.apache.beam.runners.fnexecution.artifact.ArtifactStagingService: Artifacts fully staged for job_f77f2c4f-03b6-4028-b00e-76b4d767568d.
INFO:apache_beam.utils.subprocess_server:24/01/11 17:34:16 INFO org.apache.beam.runners.spark.SparkJobInvoker: Invoking job BeamApp-jenkins-0111173416-2adcc34_47ab2924-117b-4b51-b3a6-7557e9add513
INFO:apache_beam.utils.subprocess_server:24/01/11 17:34:16 INFO org.apache.beam.runners.jobsubmission.JobInvocation: Starting job invocation BeamApp-jenkins-0111173416-2adcc34_47ab2924-117b-4b51-b3a6-7557e9add513
INFO:apache_beam.runners.portability.portable_runner:Environment "LOOPBACK" has started a component necessary for the execution. Be sure to run the pipeline using
with Pipeline() as p:
p.apply(..)
This ensures that the pipeline finishes before this program exits.
INFO:apache_beam.runners.portability.portable_runner:Job state changed to STOPPED
INFO:apache_beam.runners.portability.portable_runner:Job state changed to STARTING
INFO:apache_beam.runners.portability.portable_runner:Job state changed to RUNNING
INFO:apache_beam.utils.subprocess_server:24/01/11 17:34:17 INFO org.apache.beam.runners.spark.translation.SparkContextFactory: Creating a brand new Spark Context.
INFO:apache_beam.utils.subprocess_server:24/01/11 17:34:18 WARN org.apache.hadoop.util.NativeCodeLoader: Unable to load native-hadoop library for your platform... using builtin-java classes where applicable
INFO:apache_beam.utils.subprocess_server:24/01/11 17:34:19 INFO org.sparkproject.jetty.util.log: Logging initialized @8392ms to org.sparkproject.jetty.util.log.Slf4jLog
INFO:apache_beam.utils.subprocess_server:24/01/11 17:34:19 INFO org.sparkproject.jetty.server.Server: jetty-9.4.44.v20210927; built: 2021-09-27T23:02:44.612Z; git: 8da83308eeca865e495e53ef315a249d63ba9332; jvm 1.8.0_392-8u392-ga-1~20.04-b08
INFO:apache_beam.utils.subprocess_server:24/01/11 17:34:19 INFO org.sparkproject.jetty.server.Server: Started @8538ms
INFO:apache_beam.utils.subprocess_server:24/01/11 17:34:20 INFO org.sparkproject.jetty.server.AbstractConnector: Started ServerConnector@2396b3b9{HTTP/1.1, (http/1.1)}{127.0.0.1:4040}
INFO:apache_beam.utils.subprocess_server:24/01/11 17:34:20 INFO org.sparkproject.jetty.server.handler.ContextHandler: Started o.s.j.s.ServletContextHandler@d8f28c9{/jobs,null,AVAILABLE,@Spark}
INFO:apache_beam.utils.subprocess_server:24/01/11 17:34:20 INFO org.sparkproject.jetty.server.handler.ContextHandler: Started o.s.j.s.ServletContextHandler@591f94b{/jobs/json,null,AVAILABLE,@Spark}
INFO:apache_beam.utils.subprocess_server:24/01/11 17:34:20 INFO org.sparkproject.jetty.server.handler.ContextHandler: Started o.s.j.s.ServletContextHandler@4e16d6e0{/jobs/job,null,AVAILABLE,@Spark}
INFO:apache_beam.utils.subprocess_server:24/01/11 17:34:20 INFO org.sparkproject.jetty.server.handler.ContextHandler: Started o.s.j.s.ServletContextHandler@2bbe5cdf{/jobs/job/json,null,AVAILABLE,@Spark}
INFO:apache_beam.utils.subprocess_server:24/01/11 17:34:20 INFO org.sparkproject.jetty.server.handler.ContextHandler: Started o.s.j.s.ServletContextHandler@2d84702f{/stages,null,AVAILABLE,@Spark}
INFO:apache_beam.utils.subprocess_server:24/01/11 17:34:20 INFO org.sparkproject.jetty.server.handler.ContextHandler: Started o.s.j.s.ServletContextHandler@f30e44f{/stages/json,null,AVAILABLE,@Spark}
INFO:apache_beam.utils.subprocess_server:24/01/11 17:34:20 INFO org.sparkproject.jetty.server.handler.ContextHandler: Started o.s.j.s.ServletContextHandler@6b42b967{/stages/stage,null,AVAILABLE,@Spark}
INFO:apache_beam.utils.subprocess_server:24/01/11 17:34:20 INFO org.sparkproject.jetty.server.handler.ContextHandler: Started o.s.j.s.ServletContextHandler@6bf17b60{/stages/stage/json,null,AVAILABLE,@Spark}
INFO:apache_beam.utils.subprocess_server:24/01/11 17:34:20 INFO org.sparkproject.jetty.server.handler.ContextHandler: Started o.s.j.s.ServletContextHandler@37f41697{/stages/pool,null,AVAILABLE,@Spark}
INFO:apache_beam.utils.subprocess_server:24/01/11 17:34:20 INFO org.sparkproject.jetty.server.handler.ContextHandler: Started o.s.j.s.ServletContextHandler@71170d2e{/stages/pool/json,null,AVAILABLE,@Spark}
INFO:apache_beam.utils.subprocess_server:24/01/11 17:34:20 INFO org.sparkproject.jetty.server.handler.ContextHandler: Started o.s.j.s.ServletContextHandler@112b18f{/storage,null,AVAILABLE,@Spark}
INFO:apache_beam.utils.subprocess_server:24/01/11 17:34:20 INFO org.sparkproject.jetty.server.handler.ContextHandler: Started o.s.j.s.ServletContextHandler@33732e16{/storage/json,null,AVAILABLE,@Spark}
INFO:apache_beam.utils.subprocess_server:24/01/11 17:34:20 INFO org.sparkproject.jetty.server.handler.ContextHandler: Started o.s.j.s.ServletContextHandler@1beb7d91{/storage/rdd,null,AVAILABLE,@Spark}
INFO:apache_beam.utils.subprocess_server:24/01/11 17:34:20 INFO org.sparkproject.jetty.server.handler.ContextHandler: Started o.s.j.s.ServletContextHandler@6acd752f{/storage/rdd/json,null,AVAILABLE,@Spark}
INFO:apache_beam.utils.subprocess_server:24/01/11 17:34:20 INFO org.sparkproject.jetty.server.handler.ContextHandler: Started o.s.j.s.ServletContextHandler@2c34cc54{/environment,null,AVAILABLE,@Spark}
INFO:apache_beam.utils.subprocess_server:24/01/11 17:34:20 INFO org.sparkproject.jetty.server.handler.ContextHandler: Started o.s.j.s.ServletContextHandler@4ad77005{/environment/json,null,AVAILABLE,@Spark}
INFO:apache_beam.utils.subprocess_server:24/01/11 17:34:20 INFO org.sparkproject.jetty.server.handler.ContextHandler: Started o.s.j.s.ServletContextHandler@3590f973{/executors,null,AVAILABLE,@Spark}
INFO:apache_beam.utils.subprocess_server:24/01/11 17:34:20 INFO org.sparkproject.jetty.server.handler.ContextHandler: Started o.s.j.s.ServletContextHandler@1fdd459a{/executors/json,null,AVAILABLE,@Spark}
INFO:apache_beam.utils.subprocess_server:24/01/11 17:34:20 INFO org.sparkproject.jetty.server.handler.ContextHandler: Started o.s.j.s.ServletContextHandler@7484c9d8{/executors/threadDump,null,AVAILABLE,@Spark}
INFO:apache_beam.utils.subprocess_server:24/01/11 17:34:20 INFO org.sparkproject.jetty.server.handler.ContextHandler: Started o.s.j.s.ServletContextHandler@35f7ff46{/executors/threadDump/json,null,AVAILABLE,@Spark}
INFO:apache_beam.utils.subprocess_server:24/01/11 17:34:20 INFO org.sparkproject.jetty.server.handler.ContextHandler: Started o.s.j.s.ServletContextHandler@4ef3cff0{/static,null,AVAILABLE,@Spark}
INFO:apache_beam.utils.subprocess_server:24/01/11 17:34:20 INFO org.sparkproject.jetty.server.handler.ContextHandler: Started o.s.j.s.ServletContextHandler@1a774dc4{/,null,AVAILABLE,@Spark}
INFO:apache_beam.utils.subprocess_server:24/01/11 17:34:20 INFO org.sparkproject.jetty.server.handler.ContextHandler: Started o.s.j.s.ServletContextHandler@11a2ded4{/api,null,AVAILABLE,@Spark}
INFO:apache_beam.utils.subprocess_server:24/01/11 17:34:20 INFO org.sparkproject.jetty.server.handler.ContextHandler: Started o.s.j.s.ServletContextHandler@3c71f556{/jobs/job/kill,null,AVAILABLE,@Spark}
INFO:apache_beam.utils.subprocess_server:24/01/11 17:34:20 INFO org.sparkproject.jetty.server.handler.ContextHandler: Started o.s.j.s.ServletContextHandler@bb39909{/stages/stage/kill,null,AVAILABLE,@Spark}
INFO:apache_beam.utils.subprocess_server:24/01/11 17:34:20 INFO org.sparkproject.jetty.server.handler.ContextHandler: Started o.s.j.s.ServletContextHandler@3772b5ea{/metrics/json,null,AVAILABLE,@Spark}
INFO:apache_beam.utils.subprocess_server:24/01/11 17:34:20 INFO org.apache.beam.runners.spark.metrics.MetricsAccumulator: Instantiated metrics accumulator: MetricQueryResults()
INFO:apache_beam.utils.subprocess_server:24/01/11 17:34:20 WARN software.amazon.awssdk.regions.internal.util.EC2MetadataUtils: Unable to retrieve the requested metadata.
INFO:apache_beam.utils.subprocess_server:24/01/11 17:34:20 INFO org.apache.beam.runners.spark.SparkPipelineRunner: Running job BeamApp-jenkins-0111173416-2adcc34_47ab2924-117b-4b51-b3a6-7557e9add513 on Spark master local[4]
INFO:apache_beam.runners.worker.statecache:Creating state cache with size 104857600
INFO:apache_beam.runners.worker.sdk_worker:Creating insecure control channel for localhost:41087.
INFO:apache_beam.runners.worker.sdk_worker:Control channel established.
INFO:apache_beam.runners.worker.sdk_worker:Initializing SDKHarness with unbounded number of workers.
INFO:apache_beam.utils.subprocess_server:24/01/11 17:34:22 INFO org.apache.beam.runners.fnexecution.control.FnApiControlClientPoolService: Beam Fn Control client connected with id 1-1
INFO:apache_beam.utils.subprocess_server:24/01/11 17:34:22 INFO org.apache.beam.runners.fnexecution.control.FnApiControlClientPoolService: getProcessBundleDescriptor request with id 1-2
INFO:apache_beam.runners.worker.sdk_worker:Creating insecure state channel for localhost:42985.
INFO:apache_beam.runners.worker.sdk_worker:State channel established.
INFO:apache_beam.runners.worker.data_plane:Creating client data channel for localhost:41351
INFO:apache_beam.utils.subprocess_server:24/01/11 17:34:22 INFO org.apache.beam.runners.fnexecution.data.GrpcDataService: Beam Fn Data client connected.
INFO:apache_beam.utils.subprocess_server:24/01/11 17:34:22 INFO org.apache.beam.runners.fnexecution.control.FnApiControlClientPoolService: getProcessBundleDescriptor request with id 1-3
INFO:apache_beam.utils.subprocess_server:24/01/11 17:34:22 INFO org.apache.beam.runners.fnexecution.control.FnApiControlClientPoolService: getProcessBundleDescriptor request with id 1-4
INFO:apache_beam.utils.subprocess_server:24/01/11 17:34:23 INFO org.apache.beam.runners.fnexecution.control.FnApiControlClientPoolService: getProcessBundleDescriptor request with id 1-5
INFO:apache_beam.utils.subprocess_server:24/01/11 17:34:23 INFO org.apache.beam.runners.fnexecution.control.FnApiControlClientPoolService: getProcessBundleDescriptor request with id 1-7
INFO:apache_beam.utils.subprocess_server:24/01/11 17:34:23 INFO org.apache.beam.runners.fnexecution.control.FnApiControlClientPoolService: getProcessBundleDescriptor request with id 1-9
INFO:apache_beam.utils.subprocess_server:24/01/11 17:34:23 INFO org.apache.beam.runners.fnexecution.control.FnApiControlClientPoolService: getProcessBundleDescriptor request with id 1-8
INFO:apache_beam.utils.subprocess_server:24/01/11 17:34:23 INFO org.apache.beam.runners.fnexecution.control.FnApiControlClientPoolService: getProcessBundleDescriptor request with id 1-6
INFO:apache_beam.utils.subprocess_server:24/01/11 17:34:23 INFO org.apache.beam.runners.fnexecution.control.FnApiControlClientPoolService: getProcessBundleDescriptor request with id 1-10
INFO:apache_beam.utils.subprocess_server:24/01/11 17:34:23 INFO org.apache.beam.runners.fnexecution.control.FnApiControlClientPoolService: getProcessBundleDescriptor request with id 1-11
INFO:apache_beam.utils.subprocess_server:24/01/11 17:34:23 INFO org.apache.beam.runners.fnexecution.control.FnApiControlClientPoolService: getProcessBundleDescriptor request with id 1-13
INFO:apache_beam.utils.subprocess_server:24/01/11 17:34:23 INFO org.apache.beam.runners.fnexecution.control.FnApiControlClientPoolService: getProcessBundleDescriptor request with id 1-12
INFO:apache_beam.utils.subprocess_server:24/01/11 17:34:23 INFO org.apache.beam.runners.fnexecution.control.FnApiControlClientPoolService: getProcessBundleDescriptor request with id 1-14
INFO:apache_beam.utils.subprocess_server:24/01/11 17:34:23 INFO org.apache.beam.runners.fnexecution.control.FnApiControlClientPoolService: getProcessBundleDescriptor request with id 1-15
INFO:apache_beam.utils.subprocess_server:24/01/11 17:34:23 INFO org.apache.beam.runners.spark.SparkPipelineRunner: Job BeamApp-jenkins-0111173416-2adcc34_47ab2924-117b-4b51-b3a6-7557e9add513: Pipeline translated successfully. Computing outputs
INFO:apache_beam.utils.subprocess_server:24/01/11 17:34:23 INFO org.apache.beam.runners.fnexecution.control.FnApiControlClientPoolService: getProcessBundleDescriptor request with id 1-16
INFO:apache_beam.io.filebasedsink:Starting finalize_write threads with num_shards: 4 (skipped: 0), batches: 4, num_threads: 4
INFO:apache_beam.io.filebasedsink:Renamed 4 shards in 0.01 seconds.
INFO:apache_beam.utils.subprocess_server:24/01/11 17:34:23 INFO org.apache.beam.runners.spark.SparkPipelineRunner: Job BeamApp-jenkins-0111173416-2adcc34_47ab2924-117b-4b51-b3a6-7557e9add513 finished.
INFO:apache_beam.utils.subprocess_server:24/01/11 17:34:23 INFO org.sparkproject.jetty.server.AbstractConnector: Stopped Spark@2396b3b9{HTTP/1.1, (http/1.1)}{127.0.0.1:4040}
INFO:apache_beam.runners.portability.portable_runner:Job state changed to DONE
Exception in thread read_state:
Traceback (most recent call last):
File "/usr/lib/python3.11/threading.py", line 1038, in _bootstrap_inner
Exception in thread run_worker_1-1:
Traceback (most recent call last):
File "/usr/lib/python3.11/threading.py", line 1038, in _bootstrap_inner
self.run()
self.run()
ERROR:apache_beam.runners.worker.data_plane:Failed to read inputs in the data plane.
Traceback (most recent call last):
File "<https://ci-beam.apache.org/job/beam_PostCommit_Python311/ws/src/sdks/python/apache_beam/runners/worker/data_plane.py",> line 669, in _read_inputs
for elements in elements_iterator:
File "<https://ci-beam.apache.org/job/beam_PostCommit_Python311/ws/src/build/gradleenv/-1720702906/lib/python3.11/site-packages/grpc/_channel.py",> line 540, in __next__
return self._next()
^^^^^^^^^^^^
File "<https://ci-beam.apache.org/job/beam_PostCommit_Python311/ws/src/build/gradleenv/-1720702906/lib/python3.11/site-packages/grpc/_channel.py",> line 966, in _next
raise self
grpc._channel._MultiThreadedRendezvous: <_MultiThreadedRendezvous of RPC that terminated with:
status = StatusCode.UNAVAILABLE
details = "Socket closed"
debug_error_string = "UNKNOWN:Error received from peer ipv6:%5B::1%5D:41351 {created_time:"2024-01-11T17:34:24.218972092+00:00", grpc_status:14, grpc_message:"Socket closed"}"
>
File "/usr/lib/python3.11/threading.py", line 975, in run
File "/usr/lib/python3.11/threading.py", line 975, in run
Exception in thread read_grpc_client_inputs:
Traceback (most recent call last):
File "/usr/lib/python3.11/threading.py", line 1038, in _bootstrap_inner
self._target(*self._args, **self._kwargs)
File "<https://ci-beam.apache.org/job/beam_PostCommit_Python311/ws/src/sdks/python/apache_beam/runners/worker/sdk_worker.py",> line 265, in run
self.run()
self._target(*self._args, **self._kwargs)
File "/usr/lib/python3.11/threading.py", line 975, in run
for work_request in self._control_stub.Control(get_responses()):
File "<https://ci-beam.apache.org/job/beam_PostCommit_Python311/ws/src/sdks/python/apache_beam/runners/worker/sdk_worker.py",> line 1049, in pull_responses
self._target(*self._args, **self._kwargs)
File "<https://ci-beam.apache.org/job/beam_PostCommit_Python311/ws/src/build/gradleenv/-1720702906/lib/python3.11/site-packages/grpc/_channel.py",> line 540, in __next__
File "<https://ci-beam.apache.org/job/beam_PostCommit_Python311/ws/src/sdks/python/apache_beam/runners/worker/data_plane.py",> line 686, in <lambda>
for response in responses:
target=lambda: self._read_inputs(elements_iterator),
File "<https://ci-beam.apache.org/job/beam_PostCommit_Python311/ws/src/build/gradleenv/-1720702906/lib/python3.11/site-packages/grpc/_channel.py",> line 540, in __next__
return self._next()
^^^^^^^^^^^^^^^^^^^^^^^^^^^^^^^^^^^^
File "<https://ci-beam.apache.org/job/beam_PostCommit_Python311/ws/src/sdks/python/apache_beam/runners/worker/data_plane.py",> line 669, in _read_inputs
^^^^^^^^^^^^
return self._next()
File "<https://ci-beam.apache.org/job/beam_PostCommit_Python311/ws/src/build/gradleenv/-1720702906/lib/python3.11/site-packages/grpc/_channel.py",> line 966, in _next
for elements in elements_iterator:
^^^^^^^^^^^^
File "<https://ci-beam.apache.org/job/beam_PostCommit_Python311/ws/src/build/gradleenv/-1720702906/lib/python3.11/site-packages/grpc/_channel.py",> line 966, in _next
File "<https://ci-beam.apache.org/job/beam_PostCommit_Python311/ws/src/build/gradleenv/-1720702906/lib/python3.11/site-packages/grpc/_channel.py",> line 540, in __next__
raise self
raise self
grpc._channel._MultiThreadedRendezvous: <_MultiThreadedRendezvous of RPC that terminated with:
status = StatusCode.UNAVAILABLE
details = "Socket closed"
debug_error_string = "UNKNOWN:Error received from peer ipv6:%5B::1%5D:41087 {created_time:"2024-01-11T17:34:24.219000196+00:00", grpc_status:14, grpc_message:"Socket closed"}"
>
return self._next()
^^^^^^^^^^^^
grpc._channel._MultiThreadedRendezvous: <_MultiThreadedRendezvous of RPC that terminated with:
status = StatusCode.UNAVAILABLE
details = "Socket closed"
debug_error_string = "UNKNOWN:Error received from peer ipv6:%5B::1%5D:42985 {created_time:"2024-01-11T17:34:24.218979733+00:00", grpc_status:14, grpc_message:"Socket closed"}"
>
File "<https://ci-beam.apache.org/job/beam_PostCommit_Python311/ws/src/build/gradleenv/-1720702906/lib/python3.11/site-packages/grpc/_channel.py",> line 966, in _next
raise self
grpc._channel._MultiThreadedRendezvous: <_MultiThreadedRendezvous of RPC that terminated with:
status = StatusCode.UNAVAILABLE
details = "Socket closed"
debug_error_string = "UNKNOWN:Error received from peer ipv6:%5B::1%5D:41351 {created_time:"2024-01-11T17:34:24.218972092+00:00", grpc_status:14, grpc_message:"Socket closed"}"
>
> Task :sdks:python:test-suites:portable:py311:postCommitPy311
> Task :sdks:python:test-suites:dataflow:py311:postCommitIT
<https://ci-beam.apache.org/job/beam_PostCommit_Python311/ws/src/build/gradleenv/2050596099/bin/python3.11>: No module named build
warning: sdist: standard file not found: should have one of README, README.rst, README.txt, README.md
warning: check: missing required meta-data: url
warning: check: missing meta-data: either (author and author_email) or (maintainer and maintainer_email) should be supplied
> Task :sdks:python:test-suites:dataflow:py311:postCommitIT FAILED
FAILURE: Build failed with an exception.
* Where:
Script '<https://ci-beam.apache.org/job/beam_PostCommit_Python311/ws/src/sdks/python/test-suites/dataflow/common.gradle'> line: 139
* What went wrong:
Execution failed for task ':sdks:python:test-suites:dataflow:py311:postCommitIT'.
> Process 'command 'sh'' finished with non-zero exit value 1
* Try:
> Run with --stacktrace option to get the stack trace.
> Run with --info or --debug option to get more log output.
> Get more help at https://help.gradle.org.
Deprecated Gradle features were used in this build, making it incompatible with Gradle 9.0.
You can use '--warning-mode all' to show the individual deprecation warnings and determine if they come from your own scripts or plugins.
For more on this, please refer to https://docs.gradle.org/8.4/userguide/command_line_interface.html#sec:command_line_warnings in the Gradle documentation.
BUILD FAILED in 1h 43m 19s
217 actionable tasks: 151 executed, 62 from cache, 4 up-to-date
Publishing build scan...
https://ge.apache.org/s/ejorokxqtij36
Build step 'Invoke Gradle script' changed build result to FAILURE
Build step 'Invoke Gradle script' marked build as failure
---------------------------------------------------------------------
To unsubscribe, e-mail: builds-unsubscribe@beam.apache.org
For additional commands, e-mail: builds-help@beam.apache.org
Jenkins build is back to normal : beam_PostCommit_Python311 #1115
Posted by Apache Jenkins Server <je...@builds.apache.org>.
See <https://ci-beam.apache.org/job/beam_PostCommit_Python311/1115/display/redirect>
---------------------------------------------------------------------
To unsubscribe, e-mail: builds-unsubscribe@beam.apache.org
For additional commands, e-mail: builds-help@beam.apache.org