You are viewing a plain text version of this content. The canonical link for it is here.
Posted to dev@zookeeper.apache.org by Apache Jenkins Server <je...@builds.apache.org> on 2012/01/07 07:50:47 UTC

ZooKeeper_branch33_solaris - Build # 67 - Still Failing

See https://builds.apache.org/job/ZooKeeper_branch33_solaris/67/

###################################################################################
########################## LAST 60 LINES OF THE CONSOLE ###########################
[...truncated 81276 lines...]
    [junit] 2012-01-07 06:50:08,131 - INFO  [main:ZooKeeperServer@151] - Created server with tickTime 3000 minSessionTimeout 6000 maxSessionTimeout 60000 datadir /zonestorage/hudson_solaris/home/hudson/hudson-slave/workspace/ZooKeeper_branch33_solaris/trunk/build/test/tmp/test9151221181159633007.junit.dir/version-2 snapdir /zonestorage/hudson_solaris/home/hudson/hudson-slave/workspace/ZooKeeper_branch33_solaris/trunk/build/test/tmp/test9151221181159633007.junit.dir/version-2
    [junit] 2012-01-07 06:50:08,132 - INFO  [main:NIOServerCnxn$Factory@143] - binding to port 0.0.0.0/0.0.0.0:11221
    [junit] 2012-01-07 06:50:08,133 - INFO  [main:FileSnap@82] - Reading snapshot /zonestorage/hudson_solaris/home/hudson/hudson-slave/workspace/ZooKeeper_branch33_solaris/trunk/build/test/tmp/test9151221181159633007.junit.dir/version-2/snapshot.0
    [junit] 2012-01-07 06:50:08,135 - INFO  [main:FileTxnSnapLog@254] - Snapshotting: b
    [junit] 2012-01-07 06:50:08,137 - INFO  [main:FourLetterWordMain@43] - connecting to 127.0.0.1 11221
    [junit] 2012-01-07 06:50:08,138 - INFO  [NIOServerCxn.Factory:0.0.0.0/0.0.0.0:11221:NIOServerCnxn$Factory@251] - Accepted socket connection from /127.0.0.1:40729
    [junit] 2012-01-07 06:50:08,138 - INFO  [NIOServerCxn.Factory:0.0.0.0/0.0.0.0:11221:NIOServerCnxn@1237] - Processing stat command from /127.0.0.1:40729
    [junit] 2012-01-07 06:50:08,139 - INFO  [Thread-4:NIOServerCnxn$StatCommand@1153] - Stat command output
    [junit] 2012-01-07 06:50:08,139 - INFO  [Thread-4:NIOServerCnxn@1435] - Closed socket connection for client /127.0.0.1:40729 (no session established for client)
    [junit] ensureOnly:[InMemoryDataTree, StandaloneServer_port]
    [junit] expect:InMemoryDataTree
    [junit] found:InMemoryDataTree org.apache.ZooKeeperService:name0=StandaloneServer_port-1,name1=InMemoryDataTree
    [junit] expect:StandaloneServer_port
    [junit] found:StandaloneServer_port org.apache.ZooKeeperService:name0=StandaloneServer_port-1
    [junit] 2012-01-07 06:50:08,141 - INFO  [main:ClientBase@385] - STOPPING server
    [junit] 2012-01-07 06:50:08,142 - INFO  [ProcessThread:-1:PrepRequestProcessor@120] - PrepRequestProcessor exited loop!
    [junit] 2012-01-07 06:50:08,142 - INFO  [SyncThread:0:SyncRequestProcessor@151] - SyncRequestProcessor exited!
    [junit] 2012-01-07 06:50:08,142 - INFO  [main:FinalRequestProcessor@378] - shutdown of request processor complete
    [junit] 2012-01-07 06:50:08,143 - INFO  [main:FourLetterWordMain@43] - connecting to 127.0.0.1 11221
    [junit] ensureOnly:[]
    [junit] 2012-01-07 06:50:08,144 - INFO  [main:ClientBase@378] - STARTING server
    [junit] 2012-01-07 06:50:08,145 - INFO  [main:ZooKeeperServer@151] - Created server with tickTime 3000 minSessionTimeout 6000 maxSessionTimeout 60000 datadir /zonestorage/hudson_solaris/home/hudson/hudson-slave/workspace/ZooKeeper_branch33_solaris/trunk/build/test/tmp/test9151221181159633007.junit.dir/version-2 snapdir /zonestorage/hudson_solaris/home/hudson/hudson-slave/workspace/ZooKeeper_branch33_solaris/trunk/build/test/tmp/test9151221181159633007.junit.dir/version-2
    [junit] 2012-01-07 06:50:08,145 - INFO  [main:NIOServerCnxn$Factory@143] - binding to port 0.0.0.0/0.0.0.0:11221
    [junit] 2012-01-07 06:50:08,146 - INFO  [main:FileSnap@82] - Reading snapshot /zonestorage/hudson_solaris/home/hudson/hudson-slave/workspace/ZooKeeper_branch33_solaris/trunk/build/test/tmp/test9151221181159633007.junit.dir/version-2/snapshot.b
    [junit] 2012-01-07 06:50:08,148 - INFO  [main:FileTxnSnapLog@254] - Snapshotting: b
    [junit] 2012-01-07 06:50:08,150 - INFO  [main:FourLetterWordMain@43] - connecting to 127.0.0.1 11221
    [junit] 2012-01-07 06:50:08,151 - INFO  [NIOServerCxn.Factory:0.0.0.0/0.0.0.0:11221:NIOServerCnxn$Factory@251] - Accepted socket connection from /127.0.0.1:40731
    [junit] 2012-01-07 06:50:08,152 - INFO  [NIOServerCxn.Factory:0.0.0.0/0.0.0.0:11221:NIOServerCnxn@1237] - Processing stat command from /127.0.0.1:40731
    [junit] 2012-01-07 06:50:08,152 - INFO  [Thread-5:NIOServerCnxn$StatCommand@1153] - Stat command output
    [junit] 2012-01-07 06:50:08,153 - INFO  [Thread-5:NIOServerCnxn@1435] - Closed socket connection for client /127.0.0.1:40731 (no session established for client)
    [junit] ensureOnly:[InMemoryDataTree, StandaloneServer_port]
    [junit] expect:InMemoryDataTree
    [junit] found:InMemoryDataTree org.apache.ZooKeeperService:name0=StandaloneServer_port-1,name1=InMemoryDataTree
    [junit] expect:StandaloneServer_port
    [junit] found:StandaloneServer_port org.apache.ZooKeeperService:name0=StandaloneServer_port-1
    [junit] 2012-01-07 06:50:08,155 - INFO  [main:ClientBase@408] - tearDown starting
    [junit] 2012-01-07 06:50:08,155 - INFO  [main:ClientBase@420] - fdcount after test is: 41
    [junit] 2012-01-07 06:50:08,230 - INFO  [main:ZooKeeper@544] - Session: 0x134b6ee74ca0000 closed
    [junit] 2012-01-07 06:50:08,230 - INFO  [main-EventThread:ClientCnxn$EventThread@521] - EventThread shut down
    [junit] 2012-01-07 06:50:08,231 - INFO  [main:ClientBase@385] - STOPPING server
    [junit] 2012-01-07 06:50:08,232 - INFO  [ProcessThread:-1:PrepRequestProcessor@120] - PrepRequestProcessor exited loop!
    [junit] 2012-01-07 06:50:08,232 - INFO  [SyncThread:0:SyncRequestProcessor@151] - SyncRequestProcessor exited!
    [junit] 2012-01-07 06:50:08,233 - INFO  [main:FinalRequestProcessor@378] - shutdown of request processor complete
    [junit] 2012-01-07 06:50:08,234 - INFO  [main:FourLetterWordMain@43] - connecting to 127.0.0.1 11221
    [junit] ensureOnly:[]
    [junit] 2012-01-07 06:50:08,238 - INFO  [main:ClientBase@437] - FINISHED testQuota
    [junit] 2012-01-07 06:50:08,239 - INFO  [main:ZooKeeperQuotaTest@52] - STOPPING org.apache.zookeeper.test.ZooKeeperQuotaTest
    [junit] Tests run: 1, Failures: 0, Errors: 0, Time elapsed: 1.011 sec

BUILD FAILED
/zonestorage/hudson_solaris/home/hudson/hudson-slave/workspace/ZooKeeper_branch33_solaris/trunk/build.xml:845: Tests failed!

Total time: 17 minutes 47 seconds
Build step 'Invoke Ant' marked build as failure
[locks-and-latches] Releasing all the locks
[locks-and-latches] All the locks released
Recording test results
Email was triggered for: Failure
Sending email for trigger: Failure



###################################################################################
############################## FAILED TESTS (if any) ##############################
1 tests failed.
FAILED:  org.apache.zookeeper.test.LETest.testLE

Error Message:
Threads didn't join

Stack Trace:
junit.framework.AssertionFailedError: Threads didn't join
	at org.apache.zookeeper.test.LETest.testLE(LETest.java:118)




ZooKeeper_branch33_solaris - Build # 69 - Still Failing

Posted by Apache Jenkins Server <je...@builds.apache.org>.
See https://builds.apache.org/job/ZooKeeper_branch33_solaris/69/

###################################################################################
########################## LAST 60 LINES OF THE CONSOLE ###########################
[...truncated 3 lines...]
hudson.remoting.RequestAbortedException: hudson.remoting.RequestAbortedException: java.io.WriteAbortedException: writing aborted; java.io.InterruptedIOException
	at hudson.remoting.Request.call(Request.java:149)
	at hudson.remoting.Channel.call(Channel.java:681)
	at hudson.FilePath.act(FilePath.java:773)
	at hudson.FilePath.act(FilePath.java:766)
	at hudson.scm.SubversionSCM.checkout(SubversionSCM.java:731)
	at hudson.scm.SubversionSCM.checkout(SubversionSCM.java:676)
	at hudson.model.AbstractProject.checkout(AbstractProject.java:1195)
	at hudson.model.AbstractBuild$AbstractRunner.checkout(AbstractBuild.java:573)
	at hudson.model.AbstractBuild$AbstractRunner.run(AbstractBuild.java:462)
	at hudson.model.Run.run(Run.java:1404)
	at hudson.model.FreeStyleBuild.run(FreeStyleBuild.java:46)
	at hudson.model.ResourceController.execute(ResourceController.java:88)
	at hudson.model.Executor.run(Executor.java:238)
Caused by: hudson.remoting.RequestAbortedException: java.io.WriteAbortedException: writing aborted; java.io.InterruptedIOException
	at hudson.remoting.Request.abort(Request.java:273)
	at hudson.remoting.Channel.terminate(Channel.java:732)
	at hudson.remoting.Channel$ReaderThread.run(Channel.java:1139)
Caused by: java.io.WriteAbortedException: writing aborted; java.io.InterruptedIOException
	at java.io.ObjectInputStream.readObject0(ObjectInputStream.java:1332)
	at java.io.ObjectInputStream.skipCustomData(ObjectInputStream.java:1911)
	at java.io.ObjectInputStream.readNonProxyDesc(ObjectInputStream.java:1580)
	at java.io.ObjectInputStream.readClassDesc(ObjectInputStream.java:1495)
	at java.io.ObjectInputStream.readOrdinaryObject(ObjectInputStream.java:1731)
	at java.io.ObjectInputStream.readObject0(ObjectInputStream.java:1328)
	at java.io.ObjectInputStream.readObject(ObjectInputStream.java:350)
	at hudson.remoting.Channel$ReaderThread.run(Channel.java:1109)
Caused by: java.io.InterruptedIOException
	at java.io.FileOutputStream.writeBytes(Native Method)
	at java.io.FileOutputStream.write(FileOutputStream.java:260)
	at hudson.remoting.StandardOutputStream.write(StandardOutputStream.java:84)
	at java.io.ObjectOutputStream$BlockDataOutputStream.drain(ObjectOutputStream.java:1685)
	at java.io.ObjectOutputStream$BlockDataOutputStream.setBlockDataMode(ObjectOutputStream.java:1594)
	at java.io.ObjectOutputStream.writeNonProxyDesc(ObjectOutputStream.java:1173)
	at java.io.ObjectOutputStream.writeClassDesc(ObjectOutputStream.java:1127)
	at java.io.ObjectOutputStream.writeOrdinaryObject(ObjectOutputStream.java:1284)
	at java.io.ObjectOutputStream.writeObject0(ObjectOutputStream.java:1079)
	at java.io.ObjectOutputStream.writeObject(ObjectOutputStream.java:302)
	at hudson.remoting.Channel.send(Channel.java:504)
	at hudson.remoting.Request.call(Request.java:110)
	at hudson.remoting.RemoteInvocationHandler.invoke(RemoteInvocationHandler.java:160)
	at hudson.remoting.$Proxy5.fetch2(Unknown Source)
	at hudson.remoting.RemoteClassLoader.findClass(RemoteClassLoader.java:122)
	at java.lang.ClassLoader.loadClass(ClassLoader.java:307)
	at java.lang.ClassLoader.loadClass(ClassLoader.java:252)
	at java.lang.ClassLoader.loadClassInternal(ClassLoader.java:320)
	at hudson.model.Computer.<clinit>(Computer.java:1170)
	at hudson.Launcher$LocalLauncher.<init>(Launcher.java:689)
	at hudson.Launcher$RemoteLaunchCallable.call(Launcher.java:925)
	at hudson.Launcher$RemoteLaunchCallable.call(Launcher.java:899)
	at hudson.remoting.UserRequest.perform(UserRequest.java:118)
	at hudson.remoting.UserRequest.perform(UserRequest.java:48)
	at hudson.remoting.Request$2.run(Request.java:287)
	at java.util.concurrent.Executors$RunnableAdapter.call(Executors.java:417)
	at java.util.concurrent.FutureTask$Sync.innerRun(FutureTask.java:269)
	at java.util.concurrent.FutureTask.run(FutureTask.java:123)
	at java.util.concurrent.ThreadPoolExecutor$Worker.runTask(ThreadPoolExecutor.java:651)
	at java.util.concurrent.ThreadPoolExecutor$Worker.run(ThreadPoolExecutor.java:676)
	at java.lang.Thread.run(Thread.java:595)



###################################################################################
############################## FAILED TESTS (if any) ##############################
No tests ran.

ZooKeeper_branch33_solaris - Build # 68 - Still Failing

Posted by Apache Jenkins Server <je...@builds.apache.org>.
See https://builds.apache.org/job/ZooKeeper_branch33_solaris/68/

###################################################################################
########################## LAST 60 LINES OF THE CONSOLE ###########################
[...truncated 80511 lines...]
    [junit] 2012-01-08 06:52:20,277 - INFO  [main:ZooKeeperServer@151] - Created server with tickTime 3000 minSessionTimeout 6000 maxSessionTimeout 60000 datadir /zonestorage/hudson_solaris/home/hudson/hudson-slave/workspace/ZooKeeper_branch33_solaris/trunk/build/test/tmp/test3547782576738315115.junit.dir/version-2 snapdir /zonestorage/hudson_solaris/home/hudson/hudson-slave/workspace/ZooKeeper_branch33_solaris/trunk/build/test/tmp/test3547782576738315115.junit.dir/version-2
    [junit] 2012-01-08 06:52:20,278 - INFO  [main:NIOServerCnxn$Factory@143] - binding to port 0.0.0.0/0.0.0.0:11221
    [junit] 2012-01-08 06:52:20,279 - INFO  [main:FileSnap@82] - Reading snapshot /zonestorage/hudson_solaris/home/hudson/hudson-slave/workspace/ZooKeeper_branch33_solaris/trunk/build/test/tmp/test3547782576738315115.junit.dir/version-2/snapshot.0
    [junit] 2012-01-08 06:52:20,282 - INFO  [main:FileTxnSnapLog@254] - Snapshotting: b
    [junit] 2012-01-08 06:52:20,283 - INFO  [main:FourLetterWordMain@43] - connecting to 127.0.0.1 11221
    [junit] 2012-01-08 06:52:20,284 - INFO  [NIOServerCxn.Factory:0.0.0.0/0.0.0.0:11221:NIOServerCnxn$Factory@251] - Accepted socket connection from /127.0.0.1:37264
    [junit] 2012-01-08 06:52:20,284 - INFO  [NIOServerCxn.Factory:0.0.0.0/0.0.0.0:11221:NIOServerCnxn@1237] - Processing stat command from /127.0.0.1:37264
    [junit] 2012-01-08 06:52:20,285 - INFO  [Thread-4:NIOServerCnxn$StatCommand@1153] - Stat command output
    [junit] 2012-01-08 06:52:20,285 - INFO  [Thread-4:NIOServerCnxn@1435] - Closed socket connection for client /127.0.0.1:37264 (no session established for client)
    [junit] ensureOnly:[InMemoryDataTree, StandaloneServer_port]
    [junit] expect:InMemoryDataTree
    [junit] found:InMemoryDataTree org.apache.ZooKeeperService:name0=StandaloneServer_port-1,name1=InMemoryDataTree
    [junit] expect:StandaloneServer_port
    [junit] found:StandaloneServer_port org.apache.ZooKeeperService:name0=StandaloneServer_port-1
    [junit] 2012-01-08 06:52:20,286 - INFO  [main:ClientBase@385] - STOPPING server
    [junit] 2012-01-08 06:52:20,287 - INFO  [ProcessThread:-1:PrepRequestProcessor@120] - PrepRequestProcessor exited loop!
    [junit] 2012-01-08 06:52:20,287 - INFO  [SyncThread:0:SyncRequestProcessor@151] - SyncRequestProcessor exited!
    [junit] 2012-01-08 06:52:20,288 - INFO  [main:FinalRequestProcessor@378] - shutdown of request processor complete
    [junit] 2012-01-08 06:52:20,289 - INFO  [main:FourLetterWordMain@43] - connecting to 127.0.0.1 11221
    [junit] ensureOnly:[]
    [junit] 2012-01-08 06:52:20,290 - INFO  [main:ClientBase@378] - STARTING server
    [junit] 2012-01-08 06:52:20,290 - INFO  [main:ZooKeeperServer@151] - Created server with tickTime 3000 minSessionTimeout 6000 maxSessionTimeout 60000 datadir /zonestorage/hudson_solaris/home/hudson/hudson-slave/workspace/ZooKeeper_branch33_solaris/trunk/build/test/tmp/test3547782576738315115.junit.dir/version-2 snapdir /zonestorage/hudson_solaris/home/hudson/hudson-slave/workspace/ZooKeeper_branch33_solaris/trunk/build/test/tmp/test3547782576738315115.junit.dir/version-2
    [junit] ensureOnly:[InMemoryDataTree, StandaloneServer_port]
    [junit] 2012-01-08 06:52:20,291 - INFO  [main:NIOServerCnxn$Factory@143] - binding to port 0.0.0.0/0.0.0.0:11221
    [junit] 2012-01-08 06:52:20,292 - INFO  [main:FileSnap@82] - Reading snapshot /zonestorage/hudson_solaris/home/hudson/hudson-slave/workspace/ZooKeeper_branch33_solaris/trunk/build/test/tmp/test3547782576738315115.junit.dir/version-2/snapshot.b
    [junit] 2012-01-08 06:52:20,294 - INFO  [main:FileTxnSnapLog@254] - Snapshotting: b
    [junit] 2012-01-08 06:52:20,296 - INFO  [main:FourLetterWordMain@43] - connecting to 127.0.0.1 11221
    [junit] 2012-01-08 06:52:20,296 - INFO  [NIOServerCxn.Factory:0.0.0.0/0.0.0.0:11221:NIOServerCnxn$Factory@251] - Accepted socket connection from /127.0.0.1:37266
    [junit] expect:InMemoryDataTree
    [junit] found:InMemoryDataTree org.apache.ZooKeeperService:name0=StandaloneServer_port-1,name1=InMemoryDataTree
    [junit] 2012-01-08 06:52:20,297 - INFO  [NIOServerCxn.Factory:0.0.0.0/0.0.0.0:11221:NIOServerCnxn@1237] - Processing stat command from /127.0.0.1:37266
    [junit] 2012-01-08 06:52:20,298 - INFO  [Thread-5:NIOServerCnxn$StatCommand@1153] - Stat command output
    [junit] 2012-01-08 06:52:20,298 - INFO  [Thread-5:NIOServerCnxn@1435] - Closed socket connection for client /127.0.0.1:37266 (no session established for client)
    [junit] 2012-01-08 06:52:20,300 - INFO  [main:ClientBase@408] - tearDown starting
    [junit] 2012-01-08 06:52:20,300 - INFO  [main:ClientBase@420] - fdcount after test is: 41
    [junit] 2012-01-08 06:52:20,380 - INFO  [main:ZooKeeper@544] - Session: 0x134bc16d53d0000 closed
    [junit] 2012-01-08 06:52:20,380 - INFO  [main-EventThread:ClientCnxn$EventThread@521] - EventThread shut down
    [junit] 2012-01-08 06:52:20,381 - INFO  [main:ClientBase@385] - STOPPING server
    [junit] 2012-01-08 06:52:20,382 - INFO  [ProcessThread:-1:PrepRequestProcessor@120] - PrepRequestProcessor exited loop!
    [junit] 2012-01-08 06:52:20,382 - INFO  [SyncThread:0:SyncRequestProcessor@151] - SyncRequestProcessor exited!
    [junit] 2012-01-08 06:52:20,383 - INFO  [main:FinalRequestProcessor@378] - shutdown of request processor complete
    [junit] 2012-01-08 06:52:20,384 - INFO  [main:FourLetterWordMain@43] - connecting to 127.0.0.1 11221
    [junit] 2012-01-08 06:52:20,387 - INFO  [main:ClientBase@437] - FINISHED testQuota
    [junit] 2012-01-08 06:52:20,388 - INFO  [main:ZooKeeperQuotaTest@52] - STOPPING org.apache.zookeeper.test.ZooKeeperQuotaTest
    [junit] expect:StandaloneServer_port
    [junit] found:StandaloneServer_port org.apache.ZooKeeperService:name0=StandaloneServer_port-1
    [junit] ensureOnly:[]
    [junit] Tests run: 1, Failures: 0, Errors: 0, Time elapsed: 0.671 sec

BUILD FAILED
/zonestorage/hudson_solaris/home/hudson/hudson-slave/workspace/ZooKeeper_branch33_solaris/trunk/build.xml:845: Tests failed!

Total time: 19 minutes 26 seconds
Build step 'Invoke Ant' marked build as failure
[locks-and-latches] Releasing all the locks
[locks-and-latches] All the locks released
Recording test results
Email was triggered for: Failure
Sending email for trigger: Failure



###################################################################################
############################## FAILED TESTS (if any) ##############################
1 tests failed.
FAILED:  org.apache.zookeeper.test.LETest.testLE

Error Message:
Threads didn't join

Stack Trace:
junit.framework.AssertionFailedError: Threads didn't join
	at org.apache.zookeeper.test.LETest.testLE(LETest.java:118)