You are viewing a plain text version of this content. The canonical link for it is here.
Posted to dev@lucene.apache.org by Apache Jenkins Server <je...@builds.apache.org> on 2015/09/21 23:52:19 UTC
[JENKINS] Lucene-Solr-Tests-5.3-Java7 - Build # 54 - Failure
Build: https://builds.apache.org/job/Lucene-Solr-Tests-5.3-Java7/54/
3 tests failed.
FAILED: junit.framework.TestSuite.org.apache.solr.core.TestLazyCores
Error Message:
ERROR: SolrIndexSearcher opens=51 closes=50
Stack Trace:
java.lang.AssertionError: ERROR: SolrIndexSearcher opens=51 closes=50
at __randomizedtesting.SeedInfo.seed([65FC1865C21E821E]:0)
at org.junit.Assert.fail(Assert.java:93)
at org.apache.solr.SolrTestCaseJ4.endTrackingSearchers(SolrTestCaseJ4.java:467)
at org.apache.solr.SolrTestCaseJ4.afterClass(SolrTestCaseJ4.java:233)
at sun.reflect.GeneratedMethodAccessor39.invoke(Unknown Source)
at sun.reflect.DelegatingMethodAccessorImpl.invoke(DelegatingMethodAccessorImpl.java:43)
at java.lang.reflect.Method.invoke(Method.java:606)
at com.carrotsearch.randomizedtesting.RandomizedRunner.invoke(RandomizedRunner.java:1627)
at com.carrotsearch.randomizedtesting.RandomizedRunner$5.evaluate(RandomizedRunner.java:799)
at com.carrotsearch.randomizedtesting.rules.StatementAdapter.evaluate(StatementAdapter.java:36)
at com.carrotsearch.randomizedtesting.rules.SystemPropertiesRestoreRule$1.evaluate(SystemPropertiesRestoreRule.java:57)
at org.apache.lucene.util.AbstractBeforeAfterRule$1.evaluate(AbstractBeforeAfterRule.java:46)
at com.carrotsearch.randomizedtesting.rules.StatementAdapter.evaluate(StatementAdapter.java:36)
at org.apache.lucene.util.TestRuleStoreClassName$1.evaluate(TestRuleStoreClassName.java:42)
at com.carrotsearch.randomizedtesting.rules.NoShadowingOrOverridesOnMethodsRule$1.evaluate(NoShadowingOrOverridesOnMethodsRule.java:39)
at com.carrotsearch.randomizedtesting.rules.NoShadowingOrOverridesOnMethodsRule$1.evaluate(NoShadowingOrOverridesOnMethodsRule.java:39)
at com.carrotsearch.randomizedtesting.rules.StatementAdapter.evaluate(StatementAdapter.java:36)
at com.carrotsearch.randomizedtesting.rules.StatementAdapter.evaluate(StatementAdapter.java:36)
at com.carrotsearch.randomizedtesting.rules.StatementAdapter.evaluate(StatementAdapter.java:36)
at org.apache.lucene.util.TestRuleAssertionsRequired$1.evaluate(TestRuleAssertionsRequired.java:54)
at org.apache.lucene.util.TestRuleMarkFailure$1.evaluate(TestRuleMarkFailure.java:48)
at org.apache.lucene.util.TestRuleIgnoreAfterMaxFailures$1.evaluate(TestRuleIgnoreAfterMaxFailures.java:65)
at org.apache.lucene.util.TestRuleIgnoreTestSuites$1.evaluate(TestRuleIgnoreTestSuites.java:55)
at com.carrotsearch.randomizedtesting.rules.StatementAdapter.evaluate(StatementAdapter.java:36)
at com.carrotsearch.randomizedtesting.ThreadLeakControl$StatementRunner.run(ThreadLeakControl.java:365)
at java.lang.Thread.run(Thread.java:745)
FAILED: junit.framework.TestSuite.org.apache.solr.core.TestLazyCores
Error Message:
1 thread leaked from SUITE scope at org.apache.solr.core.TestLazyCores: 1) Thread[id=7677, name=searcherExecutor-3802-thread-1, state=WAITING, group=TGRP-TestLazyCores] at sun.misc.Unsafe.park(Native Method) at java.util.concurrent.locks.LockSupport.park(LockSupport.java:186) at java.util.concurrent.locks.AbstractQueuedSynchronizer$ConditionObject.await(AbstractQueuedSynchronizer.java:2043) at java.util.concurrent.LinkedBlockingQueue.take(LinkedBlockingQueue.java:442) at java.util.concurrent.ThreadPoolExecutor.getTask(ThreadPoolExecutor.java:1068) at java.util.concurrent.ThreadPoolExecutor.runWorker(ThreadPoolExecutor.java:1130) at java.util.concurrent.ThreadPoolExecutor$Worker.run(ThreadPoolExecutor.java:615) at java.lang.Thread.run(Thread.java:745)
Stack Trace:
com.carrotsearch.randomizedtesting.ThreadLeakError: 1 thread leaked from SUITE scope at org.apache.solr.core.TestLazyCores:
1) Thread[id=7677, name=searcherExecutor-3802-thread-1, state=WAITING, group=TGRP-TestLazyCores]
at sun.misc.Unsafe.park(Native Method)
at java.util.concurrent.locks.LockSupport.park(LockSupport.java:186)
at java.util.concurrent.locks.AbstractQueuedSynchronizer$ConditionObject.await(AbstractQueuedSynchronizer.java:2043)
at java.util.concurrent.LinkedBlockingQueue.take(LinkedBlockingQueue.java:442)
at java.util.concurrent.ThreadPoolExecutor.getTask(ThreadPoolExecutor.java:1068)
at java.util.concurrent.ThreadPoolExecutor.runWorker(ThreadPoolExecutor.java:1130)
at java.util.concurrent.ThreadPoolExecutor$Worker.run(ThreadPoolExecutor.java:615)
at java.lang.Thread.run(Thread.java:745)
at __randomizedtesting.SeedInfo.seed([65FC1865C21E821E]:0)
FAILED: junit.framework.TestSuite.org.apache.solr.core.TestLazyCores
Error Message:
There are still zombie threads that couldn't be terminated: 1) Thread[id=7677, name=searcherExecutor-3802-thread-1, state=WAITING, group=TGRP-TestLazyCores] at sun.misc.Unsafe.park(Native Method) at java.util.concurrent.locks.LockSupport.park(LockSupport.java:186) at java.util.concurrent.locks.AbstractQueuedSynchronizer$ConditionObject.await(AbstractQueuedSynchronizer.java:2043) at java.util.concurrent.LinkedBlockingQueue.take(LinkedBlockingQueue.java:442) at java.util.concurrent.ThreadPoolExecutor.getTask(ThreadPoolExecutor.java:1068) at java.util.concurrent.ThreadPoolExecutor.runWorker(ThreadPoolExecutor.java:1130) at java.util.concurrent.ThreadPoolExecutor$Worker.run(ThreadPoolExecutor.java:615) at java.lang.Thread.run(Thread.java:745)
Stack Trace:
com.carrotsearch.randomizedtesting.ThreadLeakError: There are still zombie threads that couldn't be terminated:
1) Thread[id=7677, name=searcherExecutor-3802-thread-1, state=WAITING, group=TGRP-TestLazyCores]
at sun.misc.Unsafe.park(Native Method)
at java.util.concurrent.locks.LockSupport.park(LockSupport.java:186)
at java.util.concurrent.locks.AbstractQueuedSynchronizer$ConditionObject.await(AbstractQueuedSynchronizer.java:2043)
at java.util.concurrent.LinkedBlockingQueue.take(LinkedBlockingQueue.java:442)
at java.util.concurrent.ThreadPoolExecutor.getTask(ThreadPoolExecutor.java:1068)
at java.util.concurrent.ThreadPoolExecutor.runWorker(ThreadPoolExecutor.java:1130)
at java.util.concurrent.ThreadPoolExecutor$Worker.run(ThreadPoolExecutor.java:615)
at java.lang.Thread.run(Thread.java:745)
at __randomizedtesting.SeedInfo.seed([65FC1865C21E821E]:0)
Build Log:
[...truncated 11067 lines...]
[junit4] Suite: org.apache.solr.core.TestLazyCores
[junit4] 2> Creating dataDir: /x1/jenkins/jenkins-slave/workspace/Lucene-Solr-Tests-5.3-Java7/solr/build/solr-core/test/J0/temp/solr.core.TestLazyCores_65FC1865C21E821E-001/init-core-data-001
[junit4] 2> 1333931 INFO (SUITE-TestLazyCores-seed#[65FC1865C21E821E]-worker) [ ] o.a.s.SolrTestCaseJ4 Randomized ssl (false) and clientAuth (false)
[junit4] 2> 1333940 INFO (TEST-TestLazyCores.testRace-seed#[65FC1865C21E821E]) [ ] o.a.s.SolrTestCaseJ4 ###Starting testRace
[junit4] 2> 1333955 INFO (TEST-TestLazyCores.testRace-seed#[65FC1865C21E821E]) [ ] o.a.s.c.SolrResourceLoader new SolrResourceLoader for directory: '/x1/jenkins/jenkins-slave/workspace/Lucene-Solr-Tests-5.3-Java7/solr/build/solr-core/test/J0/temp/solr.core.TestLazyCores_65FC1865C21E821E-001/tempDir-001/'
[junit4] 2> 1333973 INFO (TEST-TestLazyCores.testRace-seed#[65FC1865C21E821E]) [ ] o.a.s.c.CoreContainer New CoreContainer 2065365066
[junit4] 2> 1333973 INFO (TEST-TestLazyCores.testRace-seed#[65FC1865C21E821E]) [ ] o.a.s.c.CoreContainer Loading cores into CoreContainer [instanceDir=/x1/jenkins/jenkins-slave/workspace/Lucene-Solr-Tests-5.3-Java7/solr/build/solr-core/test/J0/temp/solr.core.TestLazyCores_65FC1865C21E821E-001/tempDir-001/]
[junit4] 2> 1333973 INFO (TEST-TestLazyCores.testRace-seed#[65FC1865C21E821E]) [ ] o.a.s.c.CoreContainer loading shared library: /x1/jenkins/jenkins-slave/workspace/Lucene-Solr-Tests-5.3-Java7/solr/build/solr-core/test/J0/temp/solr.core.TestLazyCores_65FC1865C21E821E-001/tempDir-001/lib
[junit4] 2> 1333973 WARN (TEST-TestLazyCores.testRace-seed#[65FC1865C21E821E]) [ ] o.a.s.c.SolrResourceLoader Can't find (or read) directory to add to classloader: lib (resolved as: /x1/jenkins/jenkins-slave/workspace/Lucene-Solr-Tests-5.3-Java7/solr/build/solr-core/test/J0/temp/solr.core.TestLazyCores_65FC1865C21E821E-001/tempDir-001/lib).
[junit4] 2> 1333981 INFO (TEST-TestLazyCores.testRace-seed#[65FC1865C21E821E]) [ ] o.a.s.h.c.HttpShardHandlerFactory created with socketTimeout : 600000,connTimeout : 60000,maxConnectionsPerHost : 20,maxConnections : 10000,corePoolSize : 0,maximumPoolSize : 2147483647,maxThreadIdleTime : 5,sizeOfQueue : -1,fairnessPolicy : false,useRetries : false,
[junit4] 2> 1333982 INFO (TEST-TestLazyCores.testRace-seed#[65FC1865C21E821E]) [ ] o.a.s.u.UpdateShardHandler Creating UpdateShardHandler HTTP client with params: socketTimeout=600000&connTimeout=60000&retry=true
[junit4] 2> 1333983 INFO (TEST-TestLazyCores.testRace-seed#[65FC1865C21E821E]) [ ] o.a.s.c.CoreContainer Allocating transient cache for 4 transient cores
[junit4] 2> 1333985 INFO (TEST-TestLazyCores.testRace-seed#[65FC1865C21E821E]) [ ] o.a.s.l.LogWatcher SLF4J impl is org.slf4j.impl.Log4jLoggerFactory
[junit4] 2> 1333985 INFO (TEST-TestLazyCores.testRace-seed#[65FC1865C21E821E]) [ ] o.a.s.l.LogWatcher Registering Log Listener [Log4j (org.slf4j.impl.Log4jLoggerFactory)]
[junit4] 2> 1333985 INFO (TEST-TestLazyCores.testRace-seed#[65FC1865C21E821E]) [ ] o.a.s.c.CoreContainer Security conf doesn't exist. Skipping setup for authorization module.
[junit4] 2> 1333985 INFO (TEST-TestLazyCores.testRace-seed#[65FC1865C21E821E]) [ ] o.a.s.c.CoreContainer No authentication plugin used.
[junit4] 2> 1333986 INFO (TEST-TestLazyCores.testRace-seed#[65FC1865C21E821E]) [ ] o.a.s.c.SolrCore Created CoreDescriptor: {configSetProperties=configsetprops.json, name=collection1, dataDir=data/, absoluteInstDir=/x1/jenkins/jenkins-slave/workspace/Lucene-Solr-Tests-5.3-Java7/solr/build/solr-core/test/J0/temp/solr.core.TestLazyCores_65FC1865C21E821E-001/tempDir-001/collection1/, instanceDir=collection1, loadOnStartup=true, schema=schema.xml, transient=false, config=solrconfig.xml}
[junit4] 2> 1333986 INFO (TEST-TestLazyCores.testRace-seed#[65FC1865C21E821E]) [ ] o.a.s.c.SolrCore Created CoreDescriptor: {name=collectionLazy2, configSetProperties=configsetprops.json, loadOnStartup=true, absoluteInstDir=/x1/jenkins/jenkins-slave/workspace/Lucene-Solr-Tests-5.3-Java7/solr/build/solr-core/test/J0/temp/solr.core.TestLazyCores_65FC1865C21E821E-001/tempDir-001/collection2/, schema=schema.xml, transient=true, dataDir=data/, config=solrconfig.xml, instanceDir=collection2}
[junit4] 2> 1333987 INFO (TEST-TestLazyCores.testRace-seed#[65FC1865C21E821E]) [ ] o.a.s.c.SolrCore Created CoreDescriptor: {schema=schema.xml, configSetProperties=configsetprops.json, instanceDir=collection3, absoluteInstDir=/x1/jenkins/jenkins-slave/workspace/Lucene-Solr-Tests-5.3-Java7/solr/build/solr-core/test/J0/temp/solr.core.TestLazyCores_65FC1865C21E821E-001/tempDir-001/collection3/, config=solrconfig.xml, dataDir=data/, name=collectionLazy3, loadOnStartup=false, transient=on}
[junit4] 2> 1333987 INFO (TEST-TestLazyCores.testRace-seed#[65FC1865C21E821E]) [ ] o.a.s.c.SolrCore Created CoreDescriptor: {config=solrconfig.xml, loadOnStartup=false, instanceDir=collection4, absoluteInstDir=/x1/jenkins/jenkins-slave/workspace/Lucene-Solr-Tests-5.3-Java7/solr/build/solr-core/test/J0/temp/solr.core.TestLazyCores_65FC1865C21E821E-001/tempDir-001/collection4/, name=collectionLazy4, schema=schema.xml, transient=false, dataDir=data/, configSetProperties=configsetprops.json}
[junit4] 2> 1333987 INFO (TEST-TestLazyCores.testRace-seed#[65FC1865C21E821E]) [ ] o.a.s.c.SolrCore Created CoreDescriptor: {configSetProperties=configsetprops.json, instanceDir=collection5, schema=schema.xml, loadOnStartup=true, absoluteInstDir=/x1/jenkins/jenkins-slave/workspace/Lucene-Solr-Tests-5.3-Java7/solr/build/solr-core/test/J0/temp/solr.core.TestLazyCores_65FC1865C21E821E-001/tempDir-001/collection5/, config=solrconfig.xml, name=collectionLazy5, dataDir=data/, transient=false}
[junit4] 2> 1333988 INFO (TEST-TestLazyCores.testRace-seed#[65FC1865C21E821E]) [ ] o.a.s.c.SolrCore Created CoreDescriptor: {schema=schema.xml, dataDir=data/, name=collectionLazy6, config=solrconfig.xml, instanceDir=collection6, absoluteInstDir=/x1/jenkins/jenkins-slave/workspace/Lucene-Solr-Tests-5.3-Java7/solr/build/solr-core/test/J0/temp/solr.core.TestLazyCores_65FC1865C21E821E-001/tempDir-001/collection6/, transient=true, configSetProperties=configsetprops.json, loadOnStartup=false}
[junit4] 2> 1333988 INFO (TEST-TestLazyCores.testRace-seed#[65FC1865C21E821E]) [ ] o.a.s.c.SolrCore Created CoreDescriptor: {absoluteInstDir=/x1/jenkins/jenkins-slave/workspace/Lucene-Solr-Tests-5.3-Java7/solr/build/solr-core/test/J0/temp/solr.core.TestLazyCores_65FC1865C21E821E-001/tempDir-001/collection7/, config=solrconfig.xml, transient=true, dataDir=data/, configSetProperties=configsetprops.json, schema=schema.xml, loadOnStartup=false, name=collectionLazy7, instanceDir=collection7}
[junit4] 2> 1333988 INFO (TEST-TestLazyCores.testRace-seed#[65FC1865C21E821E]) [ ] o.a.s.c.SolrCore Created CoreDescriptor: {instanceDir=collection8, name=collectionLazy8, schema=schema.xml, configSetProperties=configsetprops.json, loadOnStartup=false, config=solrconfig.xml, absoluteInstDir=/x1/jenkins/jenkins-slave/workspace/Lucene-Solr-Tests-5.3-Java7/solr/build/solr-core/test/J0/temp/solr.core.TestLazyCores_65FC1865C21E821E-001/tempDir-001/collection8/, dataDir=data/, transient=true}
[junit4] 2> 1333989 INFO (TEST-TestLazyCores.testRace-seed#[65FC1865C21E821E]) [ ] o.a.s.c.SolrCore Created CoreDescriptor: {name=collectionLazy9, schema=schema.xml, transient=true, dataDir=data/, configSetProperties=configsetprops.json, absoluteInstDir=/x1/jenkins/jenkins-slave/workspace/Lucene-Solr-Tests-5.3-Java7/solr/build/solr-core/test/J0/temp/solr.core.TestLazyCores_65FC1865C21E821E-001/tempDir-001/collection9/, instanceDir=collection9, loadOnStartup=false, config=solrconfig.xml}
[junit4] 2> 1333989 INFO (coreLoadExecutor-3642-thread-1) [ ] o.a.s.c.SolrResourceLoader new SolrResourceLoader for directory: '/x1/jenkins/jenkins-slave/workspace/Lucene-Solr-Tests-5.3-Java7/solr/build/solr-core/test/J0/temp/solr.core.TestLazyCores_65FC1865C21E821E-001/tempDir-001/collection1/'
[junit4] 2> 1333990 INFO (coreLoadExecutor-3642-thread-2) [ ] o.a.s.c.SolrResourceLoader new SolrResourceLoader for directory: '/x1/jenkins/jenkins-slave/workspace/Lucene-Solr-Tests-5.3-Java7/solr/build/solr-core/test/J0/temp/solr.core.TestLazyCores_65FC1865C21E821E-001/tempDir-001/collection2/'
[junit4] 2> 1333990 INFO (coreLoadExecutor-3642-thread-3) [ ] o.a.s.c.SolrResourceLoader new SolrResourceLoader for directory: '/x1/jenkins/jenkins-slave/workspace/Lucene-Solr-Tests-5.3-Java7/solr/build/solr-core/test/J0/temp/solr.core.TestLazyCores_65FC1865C21E821E-001/tempDir-001/collection5/'
[junit4] 2> 1334013 INFO (coreLoadExecutor-3642-thread-2) [ ] o.a.s.c.SolrConfig current version of requestparams : -1
[junit4] 2> 1334027 INFO (coreLoadExecutor-3642-thread-2) [ ] o.a.s.c.SolrConfig Using Lucene MatchVersion: 5.3.1
[junit4] 2> 1334028 INFO (coreLoadExecutor-3642-thread-3) [ ] o.a.s.c.SolrConfig current version of requestparams : -1
[junit4] 2> 1334051 INFO (coreLoadExecutor-3642-thread-1) [ ] o.a.s.c.SolrConfig current version of requestparams : -1
[junit4] 2> 1334063 INFO (coreLoadExecutor-3642-thread-3) [ ] o.a.s.c.SolrConfig Using Lucene MatchVersion: 5.3.1
[junit4] 2> 1334076 INFO (coreLoadExecutor-3642-thread-1) [ ] o.a.s.c.SolrConfig Using Lucene MatchVersion: 5.3.1
[junit4] 2> 1334078 INFO (coreLoadExecutor-3642-thread-2) [ ] o.a.s.c.Config Loaded SolrConfig: solrconfig.xml
[junit4] 2> 1334079 INFO (coreLoadExecutor-3642-thread-2) [ ] o.a.s.s.IndexSchema Reading Solr Schema from /x1/jenkins/jenkins-slave/workspace/Lucene-Solr-Tests-5.3-Java7/solr/build/solr-core/test/J0/temp/solr.core.TestLazyCores_65FC1865C21E821E-001/tempDir-001/collection2/conf/schema.xml
[junit4] 2> 1334084 INFO (coreLoadExecutor-3642-thread-2) [ ] o.a.s.s.IndexSchema [collectionLazy2] Schema name=tiny
[junit4] 2> 1334099 INFO (coreLoadExecutor-3642-thread-2) [ ] o.a.s.s.IndexSchema unique key field: id
[junit4] 2> 1334100 INFO (coreLoadExecutor-3642-thread-2) [ ] o.a.s.c.ConfigSetProperties Did not find ConfigSet properties, assuming default properties: Can't find resource 'configsetprops.json' in classpath or '/x1/jenkins/jenkins-slave/workspace/Lucene-Solr-Tests-5.3-Java7/solr/build/solr-core/test/J0/temp/solr.core.TestLazyCores_65FC1865C21E821E-001/tempDir-001/collection2/conf'
[junit4] 2> 1334101 INFO (coreLoadExecutor-3642-thread-2) [ ] o.a.s.c.CoreContainer Creating SolrCore 'collectionLazy2' using configuration from instancedir /x1/jenkins/jenkins-slave/workspace/Lucene-Solr-Tests-5.3-Java7/solr/build/solr-core/test/J0/temp/solr.core.TestLazyCores_65FC1865C21E821E-001/tempDir-001/collection2/
[junit4] 2> 1334101 INFO (coreLoadExecutor-3642-thread-2) [ x:collectionLazy2] o.a.s.c.SolrCore org.apache.solr.core.MockDirectoryFactory
[junit4] 2> 1334101 INFO (coreLoadExecutor-3642-thread-2) [ x:collectionLazy2] o.a.s.c.SolrCore [[collectionLazy2] ] Opening new SolrCore at [/x1/jenkins/jenkins-slave/workspace/Lucene-Solr-Tests-5.3-Java7/solr/build/solr-core/test/J0/temp/solr.core.TestLazyCores_65FC1865C21E821E-001/tempDir-001/collection2/], dataDir=[null]
[junit4] 2> 1334101 INFO (coreLoadExecutor-3642-thread-2) [ x:collectionLazy2] o.a.s.c.SolrCore JMX monitoring not detected for core: collectionLazy2
[junit4] 2> 1334103 INFO (coreLoadExecutor-3642-thread-2) [ x:collectionLazy2] o.a.s.c.CachingDirectoryFactory return new directory for /x1/jenkins/jenkins-slave/workspace/Lucene-Solr-Tests-5.3-Java7/solr/build/solr-core/test/J0/temp/solr.core.TestLazyCores_65FC1865C21E821E-001/tempDir-001/collection2/data
[junit4] 2> 1334103 INFO (coreLoadExecutor-3642-thread-2) [ x:collectionLazy2] o.a.s.c.SolrCore New index directory detected: old=null new=/x1/jenkins/jenkins-slave/workspace/Lucene-Solr-Tests-5.3-Java7/solr/build/solr-core/test/J0/temp/solr.core.TestLazyCores_65FC1865C21E821E-001/tempDir-001/collection2/data/index/
[junit4] 2> 1334103 WARN (coreLoadExecutor-3642-thread-2) [ x:collectionLazy2] o.a.s.c.SolrCore [collectionLazy2] Solr index directory '/x1/jenkins/jenkins-slave/workspace/Lucene-Solr-Tests-5.3-Java7/solr/build/solr-core/test/J0/temp/solr.core.TestLazyCores_65FC1865C21E821E-001/tempDir-001/collection2/data/index' doesn't exist. Creating new index...
[junit4] 2> 1334104 INFO (coreLoadExecutor-3642-thread-2) [ x:collectionLazy2] o.a.s.c.CachingDirectoryFactory return new directory for /x1/jenkins/jenkins-slave/workspace/Lucene-Solr-Tests-5.3-Java7/solr/build/solr-core/test/J0/temp/solr.core.TestLazyCores_65FC1865C21E821E-001/tempDir-001/collection2/data/index
[junit4] 2> 1334104 INFO (coreLoadExecutor-3642-thread-2) [ x:collectionLazy2] o.a.s.u.RandomMergePolicy RandomMergePolicy wrapping class org.apache.lucene.index.LogByteSizeMergePolicy: [LogByteSizeMergePolicy: minMergeSize=1677721, mergeFactor=16, maxMergeSize=2147483648, maxMergeSizeForForcedMerge=9223372036854775807, calibrateSizeByDeletes=true, maxMergeDocs=2147483647, maxCFSSegmentSizeMB=8.796093022207999E12, noCFSRatio=1.0]
[junit4] 2> 1334105 INFO (coreLoadExecutor-3642-thread-2) [ x:collectionLazy2] o.a.s.c.SolrCore SolrDeletionPolicy.onCommit: commits: num=1
[junit4] 2> commit{dir=MockDirectoryWrapper(RAMDirectory@1223c6ae lockFactory=org.apache.lucene.store.SingleInstanceLockFactory@6ac8d2cf),segFN=segments_1,generation=1}
[junit4] 2> 1334106 INFO (coreLoadExecutor-3642-thread-2) [ x:collectionLazy2] o.a.s.c.SolrCore newest commit generation = 1
[junit4] 2> 1334106 INFO (coreLoadExecutor-3642-thread-3) [ ] o.a.s.c.Config Loaded SolrConfig: solrconfig.xml
[junit4] 2> 1334106 INFO (coreLoadExecutor-3642-thread-3) [ ] o.a.s.s.IndexSchema Reading Solr Schema from /x1/jenkins/jenkins-slave/workspace/Lucene-Solr-Tests-5.3-Java7/solr/build/solr-core/test/J0/temp/solr.core.TestLazyCores_65FC1865C21E821E-001/tempDir-001/collection5/conf/schema.xml
[junit4] 2> 1334107 INFO (OldIndexDirectoryCleanupThreadForCore-collectionLazy2) [ x:collectionLazy2] o.a.s.c.SolrCore Looking for old index directories to cleanup for core collectionLazy2 in /x1/jenkins/jenkins-slave/workspace/Lucene-Solr-Tests-5.3-Java7/solr/build/solr-core/test/J0/temp/solr.core.TestLazyCores_65FC1865C21E821E-001/tempDir-001/collection2/data/
[junit4] 2> 1334108 WARN (OldIndexDirectoryCleanupThreadForCore-collectionLazy2) [ x:collectionLazy2] o.a.s.c.DirectoryFactory /x1/jenkins/jenkins-slave/workspace/Lucene-Solr-Tests-5.3-Java7/solr/build/solr-core/test/J0/temp/solr.core.TestLazyCores_65FC1865C21E821E-001/tempDir-001/collection2/data/ does not point to a valid data directory; skipping clean-up of old index directories.
[junit4] 2> 1334108 INFO (coreLoadExecutor-3642-thread-1) [ ] o.a.s.c.Config Loaded SolrConfig: solrconfig.xml
[junit4] 2> 1334108 INFO (coreLoadExecutor-3642-thread-1) [ ] o.a.s.s.IndexSchema Reading Solr Schema from /x1/jenkins/jenkins-slave/workspace/Lucene-Solr-Tests-5.3-Java7/solr/build/solr-core/test/J0/temp/solr.core.TestLazyCores_65FC1865C21E821E-001/tempDir-001/collection1/conf/schema.xml
[junit4] 2> 1334111 INFO (coreLoadExecutor-3642-thread-2) [ x:collectionLazy2] o.a.s.c.SolrCore no updateRequestProcessorChain defined as default, creating implicit default
[junit4] 2> 1334112 INFO (coreLoadExecutor-3642-thread-3) [ ] o.a.s.s.IndexSchema [collectionLazy5] Schema name=tiny
[junit4] 2> 1334114 INFO (coreLoadExecutor-3642-thread-2) [ x:collectionLazy2] o.a.s.h.l.XMLLoader xsltCacheLifetimeSeconds=60
[junit4] 2> 1334114 INFO (coreLoadExecutor-3642-thread-1) [ ] o.a.s.s.IndexSchema [collection1] Schema name=tiny
[junit4] 2> 1334116 INFO (coreLoadExecutor-3642-thread-2) [ x:collectionLazy2] o.a.s.h.l.XMLLoader xsltCacheLifetimeSeconds=60
[junit4] 2> 1334120 INFO (coreLoadExecutor-3642-thread-2) [ x:collectionLazy2] o.a.s.h.l.XMLLoader xsltCacheLifetimeSeconds=60
[junit4] 2> 1334122 INFO (coreLoadExecutor-3642-thread-2) [ x:collectionLazy2] o.a.s.h.l.XMLLoader xsltCacheLifetimeSeconds=60
[junit4] 2> 1334125 INFO (coreLoadExecutor-3642-thread-3) [ ] o.a.s.s.IndexSchema unique key field: id
[junit4] 2> 1334125 INFO (coreLoadExecutor-3642-thread-2) [ x:collectionLazy2] o.a.s.c.RequestHandlers Registered paths: /admin/system,/admin/file,/admin/logging,/admin/mbeans,/replication,/update,/select,/admin/properties,/update/json,/admin/luke,/admin/segments,/config,/get,/admin/ping,/admin/threads,/schema,/update/csv,/admin/plugins,/update/json/docs
[junit4] 2> 1334126 INFO (coreLoadExecutor-3642-thread-3) [ ] o.a.s.c.ConfigSetProperties Did not find ConfigSet properties, assuming default properties: Can't find resource 'configsetprops.json' in classpath or '/x1/jenkins/jenkins-slave/workspace/Lucene-Solr-Tests-5.3-Java7/solr/build/solr-core/test/J0/temp/solr.core.TestLazyCores_65FC1865C21E821E-001/tempDir-001/collection5/conf'
[junit4] 2> 1334126 INFO (coreLoadExecutor-3642-thread-3) [ ] o.a.s.c.CoreContainer Creating SolrCore 'collectionLazy5' using configuration from instancedir /x1/jenkins/jenkins-slave/workspace/Lucene-Solr-Tests-5.3-Java7/solr/build/solr-core/test/J0/temp/solr.core.TestLazyCores_65FC1865C21E821E-001/tempDir-001/collection5/
[junit4] 2> 1334126 INFO (coreLoadExecutor-3642-thread-3) [ x:collectionLazy5] o.a.s.c.SolrCore org.apache.solr.core.MockDirectoryFactory
[junit4] 2> 1334126 INFO (coreLoadExecutor-3642-thread-3) [ x:collectionLazy5] o.a.s.c.SolrCore [[collectionLazy5] ] Opening new SolrCore at [/x1/jenkins/jenkins-slave/workspace/Lucene-Solr-Tests-5.3-Java7/solr/build/solr-core/test/J0/temp/solr.core.TestLazyCores_65FC1865C21E821E-001/tempDir-001/collection5/], dataDir=[null]
[junit4] 2> 1334127 INFO (coreLoadExecutor-3642-thread-3) [ x:collectionLazy5] o.a.s.c.SolrCore JMX monitoring not detected for core: collectionLazy5
[junit4] 2> 1334127 INFO (coreLoadExecutor-3642-thread-3) [ x:collectionLazy5] o.a.s.c.CachingDirectoryFactory return new directory for /x1/jenkins/jenkins-slave/workspace/Lucene-Solr-Tests-5.3-Java7/solr/build/solr-core/test/J0/temp/solr.core.TestLazyCores_65FC1865C21E821E-001/tempDir-001/collection5/data
[junit4] 2> 1334127 INFO (coreLoadExecutor-3642-thread-3) [ x:collectionLazy5] o.a.s.c.SolrCore New index directory detected: old=null new=/x1/jenkins/jenkins-slave/workspace/Lucene-Solr-Tests-5.3-Java7/solr/build/solr-core/test/J0/temp/solr.core.TestLazyCores_65FC1865C21E821E-001/tempDir-001/collection5/data/index/
[junit4] 2> 1334127 WARN (coreLoadExecutor-3642-thread-3) [ x:collectionLazy5] o.a.s.c.SolrCore [collectionLazy5] Solr index directory '/x1/jenkins/jenkins-slave/workspace/Lucene-Solr-Tests-5.3-Java7/solr/build/solr-core/test/J0/temp/solr.core.TestLazyCores_65FC1865C21E821E-001/tempDir-001/collection5/data/index' doesn't exist. Creating new index...
[junit4] 2> 1334128 INFO (coreLoadExecutor-3642-thread-3) [ x:collectionLazy5] o.a.s.c.CachingDirectoryFactory return new directory for /x1/jenkins/jenkins-slave/workspace/Lucene-Solr-Tests-5.3-Java7/solr/build/solr-core/test/J0/temp/solr.core.TestLazyCores_65FC1865C21E821E-001/tempDir-001/collection5/data/index
[junit4] 2> 1334128 INFO (coreLoadExecutor-3642-thread-3) [ x:collectionLazy5] o.a.s.u.RandomMergePolicy RandomMergePolicy wrapping class org.apache.lucene.index.LogByteSizeMergePolicy: [LogByteSizeMergePolicy: minMergeSize=1677721, mergeFactor=16, maxMergeSize=2147483648, maxMergeSizeForForcedMerge=9223372036854775807, calibrateSizeByDeletes=true, maxMergeDocs=2147483647, maxCFSSegmentSizeMB=8.796093022207999E12, noCFSRatio=1.0]
[junit4] 2> 1334129 INFO (coreLoadExecutor-3642-thread-3) [ x:collectionLazy5] o.a.s.c.SolrCore SolrDeletionPolicy.onCommit: commits: num=1
[junit4] 2> commit{dir=MockDirectoryWrapper(RAMDirectory@acf3f4 lockFactory=org.apache.lucene.store.SingleInstanceLockFactory@5ac41884),segFN=segments_1,generation=1}
[junit4] 2> 1334129 INFO (coreLoadExecutor-3642-thread-3) [ x:collectionLazy5] o.a.s.c.SolrCore newest commit generation = 1
[junit4] 2> 1334131 INFO (coreLoadExecutor-3642-thread-3) [ x:collectionLazy5] o.a.s.c.SolrCore no updateRequestProcessorChain defined as default, creating implicit default
[junit4] 2> 1334133 INFO (coreLoadExecutor-3642-thread-3) [ x:collectionLazy5] o.a.s.h.l.XMLLoader xsltCacheLifetimeSeconds=60
[junit4] 2> 1334134 INFO (coreLoadExecutor-3642-thread-1) [ ] o.a.s.s.IndexSchema unique key field: id
[junit4] 2> 1334134 INFO (coreLoadExecutor-3642-thread-3) [ x:collectionLazy5] o.a.s.h.l.XMLLoader xsltCacheLifetimeSeconds=60
[junit4] 2> 1334135 INFO (coreLoadExecutor-3642-thread-1) [ ] o.a.s.c.ConfigSetProperties Did not find ConfigSet properties, assuming default properties: Can't find resource 'configsetprops.json' in classpath or '/x1/jenkins/jenkins-slave/workspace/Lucene-Solr-Tests-5.3-Java7/solr/build/solr-core/test/J0/temp/solr.core.TestLazyCores_65FC1865C21E821E-001/tempDir-001/collection1/conf'
[junit4] 2> 1334136 INFO (coreLoadExecutor-3642-thread-1) [ ] o.a.s.c.CoreContainer Creating SolrCore 'collection1' using configuration from instancedir /x1/jenkins/jenkins-slave/workspace/Lucene-Solr-Tests-5.3-Java7/solr/build/solr-core/test/J0/temp/solr.core.TestLazyCores_65FC1865C21E821E-001/tempDir-001/collection1/
[junit4] 2> 1334136 INFO (coreLoadExecutor-3642-thread-1) [ x:collection1] o.a.s.c.SolrCore org.apache.solr.core.MockDirectoryFactory
[junit4] 2> 1334136 INFO (coreLoadExecutor-3642-thread-3) [ x:collectionLazy5] o.a.s.h.l.XMLLoader xsltCacheLifetimeSeconds=60
[junit4] 2> 1334136 INFO (coreLoadExecutor-3642-thread-1) [ x:collection1] o.a.s.c.SolrCore [[collection1] ] Opening new SolrCore at [/x1/jenkins/jenkins-slave/workspace/Lucene-Solr-Tests-5.3-Java7/solr/build/solr-core/test/J0/temp/solr.core.TestLazyCores_65FC1865C21E821E-001/tempDir-001/collection1/], dataDir=[null]
[junit4] 2> 1334136 INFO (coreLoadExecutor-3642-thread-1) [ x:collection1] o.a.s.c.SolrCore JMX monitoring not detected for core: collection1
[junit4] 2> 1334137 INFO (coreLoadExecutor-3642-thread-2) [ x:collectionLazy2] o.a.s.c.SolrCore Using default statsCache cache: org.apache.solr.search.stats.LocalStatsCache
[junit4] 2> 1334137 INFO (coreLoadExecutor-3642-thread-1) [ x:collection1] o.a.s.c.CachingDirectoryFactory return new directory for /x1/jenkins/jenkins-slave/workspace/Lucene-Solr-Tests-5.3-Java7/solr/build/solr-core/test/J0/temp/solr.core.TestLazyCores_65FC1865C21E821E-001/tempDir-001/collection1/data
[junit4] 2> 1334137 INFO (OldIndexDirectoryCleanupThreadForCore-collectionLazy5) [ x:collectionLazy5] o.a.s.c.SolrCore Looking for old index directories to cleanup for core collectionLazy5 in /x1/jenkins/jenkins-slave/workspace/Lucene-Solr-Tests-5.3-Java7/solr/build/solr-core/test/J0/temp/solr.core.TestLazyCores_65FC1865C21E821E-001/tempDir-001/collection5/data/
[junit4] 2> 1334137 INFO (coreLoadExecutor-3642-thread-3) [ x:collectionLazy5] o.a.s.h.l.XMLLoader xsltCacheLifetimeSeconds=60
[junit4] 2> 1334138 WARN (OldIndexDirectoryCleanupThreadForCore-collectionLazy5) [ x:collectionLazy5] o.a.s.c.DirectoryFactory /x1/jenkins/jenkins-slave/workspace/Lucene-Solr-Tests-5.3-Java7/solr/build/solr-core/test/J0/temp/solr.core.TestLazyCores_65FC1865C21E821E-001/tempDir-001/collection5/data/ does not point to a valid data directory; skipping clean-up of old index directories.
[junit4] 2> 1334137 INFO (coreLoadExecutor-3642-thread-1) [ x:collection1] o.a.s.c.SolrCore New index directory detected: old=null new=/x1/jenkins/jenkins-slave/workspace/Lucene-Solr-Tests-5.3-Java7/solr/build/solr-core/test/J0/temp/solr.core.TestLazyCores_65FC1865C21E821E-001/tempDir-001/collection1/data/index/
[junit4] 2> 1334139 INFO (coreLoadExecutor-3642-thread-2) [ x:collectionLazy2] o.a.s.c.SolrCore Hard AutoCommit: disabled
[junit4] 2> 1334140 INFO (coreLoadExecutor-3642-thread-3) [ x:collectionLazy5] o.a.s.c.RequestHandlers Registered paths: /admin/system,/admin/file,/admin/logging,/admin/mbeans,/replication,/update,/select,/admin/properties,/update/json,/admin/luke,/admin/segments,/config,/get,/admin/ping,/admin/threads,/schema,/update/csv,/admin/plugins,/update/json/docs
[junit4] 2> 1334139 WARN (coreLoadExecutor-3642-thread-1) [ x:collection1] o.a.s.c.SolrCore [collection1] Solr index directory '/x1/jenkins/jenkins-slave/workspace/Lucene-Solr-Tests-5.3-Java7/solr/build/solr-core/test/J0/temp/solr.core.TestLazyCores_65FC1865C21E821E-001/tempDir-001/collection1/data/index' doesn't exist. Creating new index...
[junit4] 2> 1334141 INFO (coreLoadExecutor-3642-thread-1) [ x:collection1] o.a.s.c.CachingDirectoryFactory return new directory for /x1/jenkins/jenkins-slave/workspace/Lucene-Solr-Tests-5.3-Java7/solr/build/solr-core/test/J0/temp/solr.core.TestLazyCores_65FC1865C21E821E-001/tempDir-001/collection1/data/index
[junit4] 2> 1334141 INFO (coreLoadExecutor-3642-thread-1) [ x:collection1] o.a.s.u.RandomMergePolicy RandomMergePolicy wrapping class org.apache.lucene.index.LogByteSizeMergePolicy: [LogByteSizeMergePolicy: minMergeSize=1677721, mergeFactor=16, maxMergeSize=2147483648, maxMergeSizeForForcedMerge=9223372036854775807, calibrateSizeByDeletes=true, maxMergeDocs=2147483647, maxCFSSegmentSizeMB=8.796093022207999E12, noCFSRatio=1.0]
[junit4] 2> 1334140 INFO (coreLoadExecutor-3642-thread-2) [ x:collectionLazy2] o.a.s.c.SolrCore Soft AutoCommit: disabled
[junit4] 2> 1334142 INFO (coreLoadExecutor-3642-thread-2) [ x:collectionLazy2] o.a.s.u.RandomMergePolicy RandomMergePolicy wrapping class org.apache.lucene.index.TieredMergePolicy: [TieredMergePolicy: maxMergeAtOnce=35, maxMergeAtOnceExplicit=32, maxMergedSegmentMB=73.021484375, floorSegmentMB=1.052734375, forceMergeDeletesPctAllowed=1.5147040873171624, segmentsPerTier=50.0, maxCFSSegmentSizeMB=8.796093022207999E12, noCFSRatio=0.6911216941300772
[junit4] 2> 1334142 INFO (coreLoadExecutor-3642-thread-2) [ x:collectionLazy2] o.a.s.c.SolrCore SolrDeletionPolicy.onInit: commits: num=1
[junit4] 2> commit{dir=MockDirectoryWrapper(RAMDirectory@1223c6ae lockFactory=org.apache.lucene.store.SingleInstanceLockFactory@6ac8d2cf),segFN=segments_1,generation=1}
[junit4] 2> 1334143 INFO (coreLoadExecutor-3642-thread-2) [ x:collectionLazy2] o.a.s.c.SolrCore newest commit generation = 1
[junit4] 2> 1334143 INFO (coreLoadExecutor-3642-thread-2) [ x:collectionLazy2] o.a.s.s.SolrIndexSearcher Opening Searcher@523daada[collectionLazy2] main
[junit4] 2> 1334143 INFO (coreLoadExecutor-3642-thread-2) [ x:collectionLazy2] o.a.s.r.ManagedResourceStorage File-based storage initialized to use dir: /x1/jenkins/jenkins-slave/workspace/Lucene-Solr-Tests-5.3-Java7/solr/build/solr-core/test/J0/temp/solr.core.TestLazyCores_65FC1865C21E821E-001/tempDir-001/collection2/conf
[junit4] 2> 1334144 INFO (coreLoadExecutor-3642-thread-2) [ x:collectionLazy2] o.a.s.r.RestManager Initializing RestManager with initArgs: {storageDir=/x1/jenkins/jenkins-slave/workspace/Lucene-Solr-Tests-5.3-Java7/solr/build/solr-core/test/J0/temp/solr.core.TestLazyCores_65FC1865C21E821E-001/tempDir-001/collection2/conf}
[junit4] 2> 1334144 INFO (coreLoadExecutor-3642-thread-2) [ x:collectionLazy2] o.a.s.r.ManagedResourceStorage Reading _rest_managed.json using file:dir=/x1/jenkins/jenkins-slave/workspace/Lucene-Solr-Tests-5.3-Java7/solr/build/solr-core/test/J0/temp/solr.core.TestLazyCores_65FC1865C21E821E-001/tempDir-001/collection2/conf
[junit4] 2> 1334144 INFO (coreLoadExecutor-3642-thread-2) [ x:collectionLazy2] o.a.s.r.RestManager Initializing 0 registered ManagedResources
[junit4] 2> 1334144 INFO (coreLoadExecutor-3642-thread-3) [ x:collectionLazy5] o.a.s.c.SolrCore Using default statsCache cache: org.apache.solr.search.stats.LocalStatsCache
[junit4] 2> 1334145 INFO (coreLoadExecutor-3642-thread-3) [ x:collectionLazy5] o.a.s.c.SolrCore Hard AutoCommit: disabled
[junit4] 2> 1334145 INFO (coreLoadExecutor-3642-thread-3) [ x:collectionLazy5] o.a.s.c.SolrCore Soft AutoCommit: disabled
[junit4] 2> 1334145 INFO (coreLoadExecutor-3642-thread-3) [ x:collectionLazy5] o.a.s.u.RandomMergePolicy RandomMergePolicy wrapping class org.apache.lucene.index.TieredMergePolicy: [TieredMergePolicy: maxMergeAtOnce=35, maxMergeAtOnceExplicit=32, maxMergedSegmentMB=73.021484375, floorSegmentMB=1.052734375, forceMergeDeletesPctAllowed=1.5147040873171624, segmentsPerTier=50.0, maxCFSSegmentSizeMB=8.796093022207999E12, noCFSRatio=0.6911216941300772
[junit4] 2> 1334144 INFO (coreLoadExecutor-3642-thread-2) [ x:collectionLazy2] o.a.s.h.ReplicationHandler Commits will be reserved for 10000
[junit4] 2> 1334146 INFO (coreLoadExecutor-3642-thread-3) [ x:collectionLazy5] o.a.s.c.SolrCore SolrDeletionPolicy.onInit: commits: num=1
[junit4] 2> commit{dir=MockDirectoryWrapper(RAMDirectory@acf3f4 lockFactory=org.apache.lucene.store.SingleInstanceLockFactory@5ac41884),segFN=segments_1,generation=1}
[junit4] 2> 1334146 INFO (coreLoadExecutor-3642-thread-2) [ x:collectionLazy2] o.a.s.c.CoreContainer Opening transient core collectionLazy2
[junit4] 2> 1334146 INFO (coreLoadExecutor-3642-thread-3) [ x:collectionLazy5] o.a.s.c.SolrCore newest commit generation = 1
[junit4] 2> 1334146 INFO (coreLoadExecutor-3642-thread-1) [ x:collection1] o.a.s.c.SolrCore SolrDeletionPolicy.onCommit: commits: num=1
[junit4] 2> commit{dir=MockDirectoryWrapper(RAMDirectory@4e9bf864 lockFactory=org.apache.lucene.store.SingleInstanceLockFactory@61d0958d),segFN=segments_1,generation=1}
[junit4] 2> 1334146 INFO (coreLoadExecutor-3642-thread-3) [ x:collectionLazy5] o.a.s.s.SolrIndexSearcher Opening Searcher@794d6b48[collectionLazy5] main
[junit4] 2> 1334146 INFO (coreLoadExecutor-3642-thread-1) [ x:collection1] o.a.s.c.SolrCore newest commit generation = 1
[junit4] 2> 1334147 INFO (coreLoadExecutor-3642-thread-3) [ x:collectionLazy5] o.a.s.r.ManagedResourceStorage File-based storage initialized to use dir: /x1/jenkins/jenkins-slave/workspace/Lucene-Solr-Tests-5.3-Java7/solr/build/solr-core/test/J0/temp/solr.core.TestLazyCores_65FC1865C21E821E-001/tempDir-001/collection5/conf
[junit4] 2> 1334147 INFO (coreLoadExecutor-3642-thread-3) [ x:collectionLazy5] o.a.s.r.RestManager Initializing RestManager with initArgs: {storageDir=/x1/jenkins/jenkins-slave/workspace/Lucene-Solr-Tests-5.3-Java7/solr/build/solr-core/test/J0/temp/solr.core.TestLazyCores_65FC1865C21E821E-001/tempDir-001/collection5/conf}
[junit4] 2> 1334146 INFO (coreLoadExecutor-3642-thread-2) [ x:collectionLazy2] o.a.s.c.CoreContainer registering core: collectionLazy2
[junit4] 2> 1334147 INFO (coreLoadExecutor-3642-thread-3) [ x:collectionLazy5] o.a.s.r.ManagedResourceStorage Reading _rest_managed.json using file:dir=/x1/jenkins/jenkins-slave/workspace/Lucene-Solr-Tests-5.3-Java7/solr/build/solr-core/test/J0/temp/solr.core.TestLazyCores_65FC1865C21E821E-001/tempDir-001/collection5/conf
[junit4] 2> 1334147 INFO (coreLoadExecutor-3642-thread-3) [ x:collectionLazy5] o.a.s.r.RestManager Initializing 0 registered ManagedResources
[junit4] 2> 1334147 INFO (coreLoadExecutor-3642-thread-3) [ x:collectionLazy5] o.a.s.h.ReplicationHandler Commits will be reserved for 10000
[junit4] 2> 1334148 INFO (searcherExecutor-3643-thread-1-processing-x:collectionLazy2) [ x:collectionLazy2] o.a.s.c.SolrCore [collectionLazy2] Registered new searcher Searcher@523daada[collectionLazy2] main{ExitableDirectoryReader(UninvertingDirectoryReader())}
[junit4] 2> 1334148 INFO (coreLoadExecutor-3642-thread-3) [ x:collectionLazy5] o.a.s.c.CoreContainer registering core: collectionLazy5
[junit4] 2> 1334149 INFO (searcherExecutor-3645-thread-1-processing-x:collectionLazy5) [ x:collectionLazy5] o.a.s.c.SolrCore [collectionLazy5] Registered new searcher Searcher@794d6b48[collectionLazy5] main{ExitableDirectoryReader(UninvertingDirectoryReader())}
[junit4] 2> 1334151 INFO (coreLoadExecutor-3642-thread-1) [ x:collection1] o.a.s.c.SolrCore no updateRequestProcessorChain defined as default, creating implicit default
[junit4] 2> 1334153 INFO (coreLoadExecutor-3642-thread-1) [ x:collection1] o.a.s.h.l.XMLLoader xsltCacheLifetimeSeconds=60
[junit4] 2> 1334155 INFO (coreLoadExecutor-3642-thread-1) [ x:collection1] o.a.s.h.l.XMLLoader xsltCacheLifetimeSeconds=60
[junit4] 2> 1334157 INFO (coreLoadExecutor-3642-thread-1) [ x:collection1] o.a.s.h.l.XMLLoader xsltCacheLifetimeSeconds=60
[junit4] 2> 1334159 INFO (coreLoadExecutor-3642-thread-1) [ x:collection1] o.a.s.h.l.XMLLoader xsltCacheLifetimeSeconds=60
[junit4] 2> 1334161 INFO (coreLoadExecutor-3642-thread-1) [ x:collection1] o.a.s.c.RequestHandlers Registered paths: /admin/system,/admin/file,/admin/logging,/admin/mbeans,/replication,/update,/select,/admin/properties,/update/json,/admin/luke,/admin/segments,/config,/get,/admin/ping,/admin/threads,/schema,/update/csv,/admin/plugins,/update/json/docs
[junit4] 2> 1334162 INFO (coreLoadExecutor-3642-thread-1) [ x:collection1] o.a.s.c.SolrCore Using default statsCache cache: org.apache.solr.search.stats.LocalStatsCache
[junit4] 2> 1334163 INFO (coreLoadExecutor-3642-thread-1) [ x:collection1] o.a.s.c.SolrCore Hard AutoCommit: disabled
[junit4] 2> 1334163 INFO (coreLoadExecutor-3642-thread-1) [ x:collection1] o.a.s.c.SolrCore Soft AutoCommit: disabled
[junit4] 2> 1334163 INFO (coreLoadExecutor-3642-thread-1) [ x:collection1] o.a.s.u.RandomMergePolicy RandomMergePolicy wrapping class org.apache.lucene.index.TieredMergePolicy: [TieredMergePolicy: maxMergeAtOnce=35, maxMergeAtOnceExplicit=32, maxMergedSegmentMB=73.021484375, floorSegmentMB=1.052734375, forceMergeDeletesPctAllowed=1.5147040873171624, segmentsPerTier=50.0, maxCFSSegmentSizeMB=8.796093022207999E12, noCFSRatio=0.6911216941300772
[junit4] 2> 1334163 INFO (coreLoadExecutor-3642-thread-1) [ x:collection1] o.a.s.c.SolrCore SolrDeletionPolicy.onInit: commits: num=1
[junit4] 2> commit{dir=MockDirectoryWrapper(RAMDirectory@4e9bf864 lockFactory=org.apache.lucene.store.SingleInstanceLockFactory@61d0958d),segFN=segments_1,generation=1}
[junit4] 2> 1334163 INFO (coreLoadExecutor-3642-thread-1) [ x:collection1] o.a.s.c.SolrCore newest commit generation = 1
[junit4] 2> 1334164 INFO (coreLoadExecutor-3642-thread-1) [ x:collection1] o.a.s.s.SolrIndexSearcher Opening Searcher@6b89e8ab[collection1] main
[junit4] 2> 1334164 INFO (coreLoadExecutor-3642-thread-1) [ x:collection1] o.a.s.r.ManagedResourceStorage File-based storage initialized to use dir: /x1/jenkins/jenkins-slave/workspace/Lucene-Solr-Tests-5.3-Java7/solr/build/solr-core/test/J0/temp/solr.core.TestLazyCores_65FC1865C21E821E-001/tempDir-001/collection1/conf
[junit4] 2> 1334164 INFO (coreLoadExecutor-3642-thread-1) [ x:collection1] o.a.s.r.RestManager Initializing RestManager with initArgs: {storageDir=/x1/jenkins/jenkins-slave/workspace/Lucene-Solr-Tests-5.3-Java7/solr/build/solr-core/test/J0/temp/solr.core.TestLazyCores_65FC1865C21E821E-001/tempDir-001/collection1/conf}
[junit4] 2> 1334164 INFO (coreLoadExecutor-3642-thread-1) [ x:collection1] o.a.s.r.ManagedResourceStorage Reading _rest_managed.json using file:dir=/x1/jenkins/jenkins-slave/workspace/Lucene-Solr-Tests-5.3-Java7/solr/build/solr-core/test/J0/temp/solr.core.TestLazyCores_65FC1865C21E821E-001/tempDir-001/collection1/conf
[junit4] 2> 1334165 INFO (coreLoadExecutor-3642-thread-1) [ x:collection1] o.a.s.r.RestManager Initializing 0 registered ManagedResources
[junit4] 2> 1334165 INFO (coreLoadExecutor-3642-thread-1) [ x:collection1] o.a.s.h.ReplicationHandler Commits will be reserved for 10000
[junit4] 2> 1334148 INFO (OldIndexDirectoryCleanupThreadForCore-collection1) [ x:collection1] o.a.s.c.SolrCore Looking for old index directories to cleanup for core collection1 in /x1/jenkins/jenkins-slave/workspace/Lucene-Solr-Tests-5.3-Java7/solr/build/solr-core/test/J0/temp/solr.core.TestLazyCores_65FC1865C21E821E-001/tempDir-001/collection1/data/
[junit4] 2> 1334165 INFO (coreLoadExecutor-3642-thread-1) [ x:collection1] o.a.s.c.CoreContainer registering core: collection1
[junit4] 2> 1334165 WARN (OldIndexDirectoryCleanupThreadForCore-collection1) [ x:collection1] o.a.s.c.DirectoryFactory /x1/jenkins/jenkins-slave/workspace/Lucene-Solr-Tests-5.3-Java7/solr/build/solr-core/test/J0/temp/solr.core.TestLazyCores_65FC1865C21E821E-001/tempDir-001/collection1/data/ does not point to a valid data directory; skipping clean-up of old index directories.
[junit4] 2> 1334166 INFO (searcherExecutor-3646-thread-1-processing-x:collection1) [ x:collection1] o.a.s.c.SolrCore [collection1] Registered new searcher Searcher@6b89e8ab[collection1] main{ExitableDirectoryReader(UninvertingDirectoryReader())}
[junit4] 2> 1334168 INFO (Thread-3259) [ ] o.a.s.c.SolrResourceLoader new SolrResourceLoader for directory: '/x1/jenkins/jenkins-slave/workspace/Lucene-Solr-Tests-5.3-Java7/solr/build/solr-core/test/J0/temp/solr.core.TestLazyCores_65FC1865C21E821E-001/tempDir-001/collection3/'
[junit4] 2> 1334197 INFO (Thread-3259) [ ] o.a.s.c.SolrConfig current version of requestparams : -1
[junit4] 2> 1334211 INFO (Thread-3259) [ ] o.a.s.c.SolrConfig Using Lucene MatchVersion: 5.3.1
[junit4] 2> 1334253 INFO (Thread-3259) [ ] o.a.s.c.Config Loaded SolrConfig: solrconfig.xml
[junit4] 2> 1334254 INFO (Thread-3259) [ ] o.a.s.s.IndexSchema Reading Solr Schema from /x1/jenkins/jenkins-slave/workspace/Lucene-Solr-Tests-5.3-Java7/solr/build/solr-core/test/J0/temp/solr.core.TestLazyCores_65FC1865C21E821E-001/tempDir-001/collection3/conf/schema.xml
[junit4] 2> 1334258 INFO (Thread-3259) [ ] o.a.s.s.IndexSchema [collectionLazy3] Schema name=tiny
[junit4] 2> 1334269 INFO (Thread-3259) [ ] o.a.s.s.IndexSchema unique key field: id
[junit4] 2> 1334271 INFO (Thread-3259) [ ] o.a.s.c.ConfigSetProperties Did not find ConfigSet properties, assuming default properties: Can't find resource 'configsetprops.json' in classpath or '/x1/jenkins/jenkins-slave/workspace/Lucene-Solr-Tests-5.3-Java7/solr/build/solr-core/test/J0/temp/solr.core.TestLazyCores_65FC1865C21E821E-001/tempDir-001/collection3/conf'
[junit4] 2> 1334271 INFO (Thread-3259) [ ] o.a.s.c.CoreContainer Creating SolrCore 'collectionLazy3' using configuration from instancedir /x1/jenkins/jenkins-slave/workspace/Lucene-Solr-Tests-5.3-Java7/solr/build/solr-core/test/J0/temp/solr.core.TestLazyCores_65FC1865C21E821E-001/tempDir-001/collection3/
[junit4] 2> 1334271 INFO (Thread-3259) [ x:collectionLazy3] o.a.s.c.SolrCore org.apache.solr.core.MockDirectoryFactory
[junit4] 2> 1334271 INFO (Thread-3259) [ x:collectionLazy3] o.a.s.c.SolrCore [[collectionLazy3] ] Opening new SolrCore at [/x1/jenkins/jenkins-slave/workspace/Lucene-Solr-Tests-5.3-Java7/solr/build/solr-core/test/J0/temp/solr.core.TestLazyCores_65FC1865C21E821E-001/tempDir-001/collection3/], dataDir=[null]
[junit4] 2> 1334271 INFO (Thread-3259) [ x:collectionLazy3] o.a.s.c.SolrCore JMX monitoring not detected for core: collectionLazy3
[junit4] 2> 1334272 INFO (Thread-3259) [ x:collectionLazy3] o.a.s.c.CachingDirectoryFactory return new directory for /x1/jenkins/jenkins-slave/workspace/Lucene-Solr-Tests-5.3-Java7/solr/build/solr-core/test/J0/temp/solr.core.TestLazyCores_65FC1865C21E821E-001/tempDir-001/collection3/data
[junit4] 2> 1334272 INFO (Thread-3259) [ x:collectionLazy3] o.a.s.c.SolrCore New index directory detected: old=null new=/x1/jenkins/jenkins-slave/workspace/Lucene-Solr-Tests-5.3-Java7/solr/build/solr-core/test/J0/temp/solr.core.TestLazyCores_65FC1865C21E821E-001/tempDir-001/collection3/data/index/
[junit4] 2> 1334272 WARN (Thread-3259) [ x:collectionLazy3] o.a.s.c.SolrCore [collectionLazy3] Solr index directory '/x1/jenkins/jenkins-slave/workspace/Lucene-Solr-Tests-5.3-Java7/solr/build/solr-core/test/J0/temp/solr.core.TestLazyCores_65FC1865C21E821E-001/tempDir-001/collection3/data/index' doesn't exist. Creating new index...
[junit4] 2> 1334272 INFO (Thread-3259) [ x:collectionLazy3] o.a.s.c.CachingDirectoryFactory return new directory for /x1/jenkins/jenkins-slave/workspace/Lucene-Solr-Tests-5.3-Java7/solr/build/solr-core/test/J0/temp/solr.core.TestLazyCores_65FC1865C21E821E-001/tempDir-001/collection3/data/index
[junit4] 2> 1334273 INFO (Thread-3259) [ x:collectionLazy3] o.a.s.u.RandomMergePolicy RandomMergePolicy wrapping class org.apache.lucene.index.LogByteSizeMergePolicy: [LogByteSizeMergePolicy: minMergeSize=1677721, mergeFactor=16, maxMergeSize=2147483648, maxMergeSizeForForcedMerge=9223372036854775807, calibrateSizeByDeletes=true, maxMergeDocs=2147483647, maxCFSSegmentSizeMB=8.796093022207999E12, noCFSRatio=1.0]
[junit4] 2> 1334273 INFO (Thread-3259) [ x:collectionLazy3] o.a.s.c.SolrCore SolrDeletionPolicy.onCommit: commits: num=1
[junit4] 2> commit{dir=MockDirectoryWrapper(RAMDirectory@7fa190df lockFactory=org.apache.lucene.store.SingleInstanceLockFactory@482e61ef),segFN=segments_1,generation=1}
[junit4] 2> 1334273 INFO (Thread-3259) [ x:collectionLazy3] o.a.s.c.SolrCore newest commit generation = 1
[junit4] 2> 1334274 INFO (OldIndexDirectoryCleanupThreadForCore-collectionLazy3) [ x:collectionLazy3] o.a.s.c.SolrCore Looking for old index directories to cleanup for core collectionLazy3 in /x1/jenkins/jenkins-slave/workspace/Lucene-Solr-Tests-5.3-Java7/solr/build/solr-core/test/J0/temp/solr.core.TestLazyCores_65FC1865C21E821E-001/tempDir-001/collection3/data/
[junit4] 2> 1334274 WARN (OldIndexDirectoryCleanupThreadForCore-collectionLazy3) [ x:collectionLazy3] o.a.s.c.DirectoryFactory /x1/jenkins/jenkins-slave/workspace/Lucene-Solr-Tests-5.3-Java7/solr/build/solr-core/test/J0/temp/solr.core.TestLazyCores_65FC1865C21E821E-001/tempDir-001/collection3/data/ does not point to a valid data directory; skipping clean-up of old index directories.
[junit4] 2> 1334276 INFO (Thread-3259) [ x:collectionLazy3] o.a.s.c.SolrCore no updateRequestProcessorChain defined as default, creating implicit default
[junit4] 2> 1334280 INFO (Thread-3259) [ x:collectionLazy3] o.a.s.h.l.XMLLoader xsltCacheLifetimeSeconds=60
[junit4] 2> 1334281 INFO (Thread-3259) [ x:collectionLazy3] o.a.s.h.l.XMLLoader xsltCacheLifetimeSeconds=60
[junit4] 2> 1334282 INFO (Thread-3259) [ x:collectionLazy3] o.a.s.h.l.XMLLoader xsltCacheLifetimeSeconds=60
[junit4] 2> 1334284 INFO (Thread-3259) [ x:collectionLazy3] o.a.s.h.l.XMLLoader xsltCacheLifetimeSeconds=60
[junit4] 2> 1334286 INFO (Thread-3259) [ x:collectionLazy3] o.a.s.c.RequestHandlers Registered paths: /admin/system,/admin/file,/admin/logging,/admin/mbeans,/replication,/update,/select,/admin/properties,/update/json,/admin/luke,/admin/segments,/config,/get,/admin/ping,/admin/threads,/schema,/update/csv,/admin/plugins,/update/json/docs
[junit4] 2> 1334287 INFO (Thread-3259) [ x:collectionLazy3] o.a.s.c.SolrCore Using default statsCache cache: org.apache.solr.search.stats.LocalStatsCache
[junit4] 2> 1334288 INFO (Thread-3259) [ x:collectionLazy3] o.a.s.c.SolrCore Hard AutoCommit: disabled
[junit4] 2> 1334288 INFO (Thread-3259) [ x:collectionLazy3] o.a.s.c.SolrCore Soft AutoCommit: disabled
[junit4] 2> 1334288 INFO (Thread-3259) [ x:collectionLazy3] o.a.s.u.RandomMergePolicy RandomMergePolicy wrapping class org.apache.lucene.index.TieredMergePolicy: [TieredMergePolicy: maxMergeAtOnce=35, maxMergeAtOnceExplicit=32, maxMergedSegmentMB=73.021484375, floorSegmentMB=1.052734375, forceMergeDeletesPctAllowed=1.5147040873171624, segmentsPerTier=50.0, maxCFSSegmentSizeMB=8.796093022207999E12, noCFSRatio=0.6911216941300772
[junit4] 2> 1334289 INFO (Thread-3259) [ x:collectionLazy3] o.a.s.c.SolrCore SolrDeletionPolicy.onInit: commits: num=1
[junit4] 2> commit{dir=MockDirectoryWrapper(RAMDirectory@7fa190df lockFactory=org.apache.lucene.store.SingleInstanceLockFactory@482e61ef),segFN=segments_1,generation=1}
[junit4] 2> 1334289 INFO (Thread-3259) [ x:collectionLazy3] o.a.s.c.SolrCore newest commit generation = 1
[junit4] 2> 1334289 INFO (Thread-3259) [ x:collectionLazy3] o.a.s.s.SolrIndexSearcher Opening Searcher@388a6c59[collectionLazy3] main
[junit4] 2> 1334289 INFO (Thread-3259) [ x:collectionLazy3] o.a.s.r.ManagedResourceStorage File-based storage initialized to use dir: /x1/jenkins/jenkins-slave/workspace/Lucene-Solr-Tests-5.3-Java7/solr/build/solr-core/test/J0/temp/solr.core.TestLazyCores_65FC1865C21E821E-001/tempDir-001/collection3/conf
[junit4] 2> 1334290 INFO (Thread-3259) [ x:collectionLazy3] o.a.s.r.RestManager Initializing RestManager with initArgs: {storageDir=/x1/jenkins/jenkins-slave/workspace/Lucene-Solr-Tests-5.3-Java7/solr/build/solr-core/test/J0/temp/solr.core.TestLazyCores_65FC1865C21E821E-001/tempDir-001/collection3/conf}
[junit4] 2> 1334290 INFO (Thread-3259) [ x:collectionLazy3] o.a.s.r.ManagedResourceStorage Reading _rest_managed.json using file:dir=/x1/jenkins/jenkins-slave/workspace/Lucene-Solr-Tests-5.3-Java7/solr/build/solr-core/test/J0/temp/solr.core.TestLazyCores_65FC1865C21E821E-001/tempDir-001/collection3/conf
[junit4] 2> 1334290 INFO (Thread-3259) [ x:collectionLazy3] o.a.s.r.RestManager Initializing 0 registered ManagedResources
[junit4] 2> 1334290 INFO (Thread-3259) [ x:collectionLazy3] o.a.s.h.ReplicationHandler Commits will be reserved for 10000
[junit4] 2> 1334290 INFO (Thread-3259) [ x:collectionLazy3] o.a.s.c.CoreContainer Opening transient core collectionLazy3
[junit4] 2> 1334290 INFO (searcherExecutor-3655-thread-1-processing-x:collectionLazy3) [ x:collectionLazy3] o.a.s.c.SolrCore [collectionLazy3] Registered new searcher Searcher@388a6c59[collectionLazy3] main{ExitableDirectoryReader(UninvertingDirectoryReader())}
[junit4] 2> 1334290 INFO (Thread-3259) [ x:collectionLazy3] o.a.s.c.CoreContainer registering core: collectionLazy3
[junit4] 2> 1334294 INFO (TEST-TestLazyCores.testRace-seed#[65FC1865C21E821E]) [ ] o.a.s.c.CoreContainer Shutting down CoreContainer instance=2065365066
[junit4] 2> 1334295 INFO (TEST-TestLazyCores.testRace-seed#[65FC1865C21E821E]) [ x:collectionLazy5] o.a.s.c.SolrCore [collectionLazy5] CLOSING SolrCore org.apache.solr.core.SolrCore@22a5a4cf
[junit4] 2> 1334295 INFO (TEST-TestLazyCores.testRace-seed#[65FC1865C21E821E]) [ x:collectionLazy5] o.a.s.u.UpdateHandler closing DirectUpdateHandler2{commits=0,autocommits=0,soft autocommits=0,optimizes=0,rollbacks=0,expungeDeletes=0,docsPending=0,adds=0,deletesById=0,deletesByQuery=0,errors=0,cumulative_adds=0,cumulative_deletesById=0,cumulative_deletesByQuery=0,cumulative_errors=0}
[junit4] 2> 1334295 INFO (TEST-TestLazyCores.testRace-seed#[65FC1865C21E821E]) [ x:collectionLazy5] o.a.s.u.SolrCoreState Closing SolrCoreState
[junit4] 2> 1334295 INFO (TEST-TestLazyCores.testRace-seed#[65FC1865C21E821E]) [ x:collectionLazy5] o.a.s.u.DefaultSolrCoreState SolrCoreState ref count has reached 0 - closing IndexWriter
[junit4] 2> 1334295 INFO (TEST-TestLazyCores.testRace-seed#[65FC1865C21E821E]) [ x:collectionLazy5] o.a.s.u.DefaultSolrCoreState closing IndexWriter with IndexWriterCloser
[junit4] 2> 1334296 INFO (TEST-TestLazyCores.testRace-seed#[65FC1865C21E821E]) [ x:collectionLazy5] o.a.s.c.SolrCore [collectionLazy5] Closing main searcher on request.
[junit4] 2> 1334296 INFO (TEST-TestLazyCores.testRace-seed#[65FC1865C21E821E]) [ x:collectionLazy5] o.a.s.c.CachingDirectoryFactory Closing MockDirectoryFactory - 2 directories currently being tracked
[junit4] 2> 1334296 INFO (TEST-TestLazyCores.testRace-seed#[65FC1865C21E821E]) [ x:collectionLazy5] o.a.s.c.CachingDirectoryFactory looking to close /x1/jenkins/jenkins-slave/workspace/Lucene-Solr-Tests-5.3-Java7/solr/build/solr-core/test/J0/temp/solr.core.TestLazyCores_65FC1865C21E821E-001/tempDir-001/collection5/data/index [CachedDir<<refCount=0;path=/x1/jenkins/jenkins-slave/workspace/Lucene-Solr-Tests-5.3-Java7/solr/build/solr-core/test/J0/temp/solr.core.TestLazyCores_65FC1865C21E821E-001/tempDir-001/collection5/data/index;done=false>>]
[junit4] 2> 1334296 INFO (TEST-TestLazyCores.testRace-seed#[65FC1865C21E821E]) [ x:collectionLazy5] o.a.s.c.CachingDirectoryFactory Closing directory: /x1/jenkins/jenkins-slave/workspace/Lucene-Solr-Tests-5.3-Java7/solr/build/solr-core/test/J0/temp/solr.core.TestLazyCores_65FC1865C21E821E-001/tempDir-001/collection5/data/index
[junit4] 2> 1334297 INFO (TEST-TestLazyCores.testRace-seed#[65FC1865C21E821E]) [ x:collectionLazy5] o.a.s.c.CachingDirectoryFactory looking to close /x1/jenkins/jenkins-slave/workspace/Lucene-Solr-Tests-5.3-Java7/solr/build/solr-core/test/J0/temp/solr.core.TestLazyCores_65FC1865C21E821E-001/tempDir-001/collection5/data [CachedDir<<refCount=0;path=/x1/jenkins/jenkins-slave/workspace/Lucene-Solr-Tests-5.3-Java7/solr/build/solr-core/test/J0/temp/solr.core.TestLazyCores_65FC1865C21E821E-001/tempDir-001/collection5/data;done=false>>]
[junit4] 2> 1334297 INFO (TEST-TestLazyCores.testRace-seed#[65FC1865C21E821E]) [ x:collectionLazy5] o.a.s.c.CachingDirectoryFactory Closing directory: /x1/jenkins/jenkins-slave/workspace/Lucene-Solr-Tests-5.3-Java7/solr/build/solr-core/test/J0/temp/solr.core.TestLazyCores_65FC1865C21E821E-001/tempDir-001/collection5/data
[junit4] 2> 1334297 INFO (TEST-TestLazyCores.testRace-seed#[65FC1865C21E821E]) [ x:collection1] o.a.s.c.SolrCore [collection1] CLOSING SolrCore org.apache.solr.core.SolrCore@5edfbe5c
[junit4] 2> 1334297 INFO (TEST-TestLazyCores.testRace-seed#[65FC1865C21E821E]) [ x:collection1] o.a.s.u.UpdateHandler closing DirectUpdateHandler2{commits=0,autocommits=0,soft autocommits=0,optimizes=0,rollbacks=0,expungeDeletes=0,docsPending=0,adds=0,deletesById=0,deletesByQuery=0,errors=0,cumulative_adds=0,cumulative_deletesById=0,cumulative_deletesByQuery=0,cumulative_errors=0}
[junit4] 2> 1334297 INFO (TEST-TestLazyCores.testRace-seed#[65FC1865C21E821E]) [ x:collection1] o.a.s.u.SolrCoreState Closing SolrCoreState
[junit4] 2> 1334297 INFO (TEST-TestLazyCores.testRace-seed#[65FC1865C21E821E]) [ x:collection1] o.a.s.u.DefaultSolrCoreState SolrCoreState ref count has reached 0 - closing IndexWriter
[junit4] 2> 1334297 INFO (TEST-TestLazyCores.testRace-seed#[65FC1865C21E821E]) [ x:collection1] o.a.s.u.DefaultSolrCoreState closing IndexWriter with IndexWriterCloser
[junit4] 2> 1334298 INFO (TEST-TestLazyCores.testRace-seed#[65FC1865C21E821E]) [ x:collection1] o.a.s.c.SolrCore [collection1] Closing main searcher on request.
[junit4] 2> 1334298 INFO (TEST-TestLazyCores.testRace-seed#[65FC1865C21E821E]) [ x:collection1] o.a.s.c.CachingDirectoryFactory Closing MockDirectoryFactory - 2 directories currently being tracked
[junit4] 2> 1334298 INFO (TEST-TestLazyCores.testRace-seed#[65FC1865C21E821E]) [ x:collection1] o.a.s.c.CachingDirectoryFactory looking to close /x1/jenkins/jenkins-slave/workspace/Lucene-Solr-Tests-5.3-Java7/solr/build/solr-core/test/J0/temp/solr.core.TestLazyCores_65FC1865C21E821E-001/tempDir-001/collection1/data [CachedDir<<refCount=0;path=/x1/jenkins/jenkins-slave/workspace/Lucene-Solr-Tests-5.3-Java7/solr/build/solr-core/test/J0/temp/solr.core.TestLazyCores_65FC1865C21E821E-001/tempDir-001/collection1/data;done=false>>]
[junit4] 2> 1334299 INFO (TEST-TestLazyCores.testRace-seed#[65FC1865C21E821E]) [ x:collection1] o.a.s.c.CachingDirectoryFactory Closing directory: /x1/jenkins/jenkins-slave/workspace/Lucene-Solr-Tests-5.3-Java7/solr/build/solr-core/test/J0/temp/solr.core.TestLazyCores_65FC1865C21E821E-001/tempDir-001/collection1/data
[junit4] 2> 1334299 INFO (TEST-TestLazyCores.testRace-seed#[65FC1865C21E821E]) [ x:collection1] o.a.s.c.CachingDirectoryFactory looking to close /x1/jenkins/jenkins-slave/workspace/Lucene-Solr-Tests-5.3-Java7/solr/build/solr-core/test/J0/temp/solr.core.TestLazyCores_65FC1865C21E821E-001/tempDir-001/collection1/data/index [CachedDir<<refCount=0;path=/x1/jenkins/jenkins-slave/workspace/Lucene-Solr-Tests-5.3-Java7/solr/build/solr-core/test/J0/temp/solr.core.TestLazyCores_65FC1865C21E821E-001/tempDir-001/collection1/data/index;done=false>>]
[junit4] 2> 1334299 INFO (TEST-TestLazyCores.testRace-seed#[65FC1865C21E821E]) [ x:collection1] o.a.s.c.CachingDirectoryFactory Closing directory: /x1/jenkins/jenkins-slave/workspace/Lucene-Solr-Tests-5.3-Java7/solr/build/solr-core/test/J0/temp/solr.core.TestLazyCores_65FC1865C21E821E-001/tempDir-001/collection1/data/index
[junit4] 2> 1334299 INFO (TEST-TestLazyCores.testRace-seed#[65FC1865C21E821E]) [ x:collectionLazy2] o.a.s.c.SolrCore [collectionLazy2] CLOSING SolrCore org.apache.solr.core.SolrCore@6f25ce29
[junit4] 2> 1334299 INFO (TEST-TestLazyCores.testRace-seed#[65FC1865C21E821E]) [ x:collectionLazy2] o.a.s.u.UpdateHandler closing DirectUpdateHandler2{commits=0,autocommits=0,soft autocommits=0,optimizes=0,rollbacks=0,expungeDeletes=0,docsPending=0,adds=0,deletesById=0,deletesByQuery=0,errors=0,cumulative_adds=0,cumulative_deletesById=0,cumulative_deletesByQuery=0,cumulative_errors=0}
[junit4] 2> 1334299 INFO (TEST-TestLazyCores.testRace-seed#[65FC1865C21E821E]) [ x:collectionLazy2] o.a.s.u.SolrCoreState Closing SolrCoreState
[junit4] 2> 1334300 INFO (TEST-TestLazyCores.testRace-seed#[65FC1865C21E821E]) [ x:collectionLazy2] o.a.s.u.DefaultSolrCoreState SolrCoreState ref count has reached 0 - closing IndexWriter
[junit4] 2> 1334300 INFO (TEST-TestLazyCores.testRace-seed#[65FC1865C21E821E]) [ x:collectionLazy2] o.a.s.u.DefaultSolrCoreState closing IndexWriter with IndexWriterCloser
[junit4] 2> 1334300 INFO (TEST-TestLazyCores.testRace-seed#[65FC1865C21E821E]) [ x:collectionLazy2] o.a.s.c.SolrCore [collectionLazy2] Closing main searcher on request.
[junit4] 2> 1334300 INFO (TEST-TestLazyCores.testRace-seed#[65FC1865C21E821E]) [ x:collectionLazy2] o.a.s.c.CachingDirectoryFactory Closing MockDirectoryFactory - 2 directories currently being tracked
[junit4] 2> 1334301 INFO (TEST-TestLazyCores.testRace-seed#[65FC1865C21E821E]) [ x:collectionLazy2] o.a.s.c.CachingDirectoryFactory looking to close /x1/jenkins/jenkins-slave/workspace/Lucene-Solr-Tests-5.3-Java7/solr/build/solr-core/test/J0/temp/solr.core.TestLazyCores_65FC1865C21E821E-001/tempDir-001/collection2/data/index [CachedDir<<refCount=0;path=/x1/jenkins/jenkins-slave/workspace/Lucene-Solr-Tests-5.3-Java7/solr/build/solr-core/test/J0/temp/solr.core.TestLazyCores_65FC1865C21E821E-001/tempDir-001/collection2/data/index;done=false>>]
[junit4] 2> 1334301 INFO (TEST-TestLazyCores.testRace-seed#[65FC1865C21E821E]) [ x:collectionLazy2] o.a.s.c.CachingDirectoryFactory Closing directory: /x1/jenkins/jenkins-slave/workspace/Lucene-Solr-Tests-5.3-Java7/solr/build/solr-core/test/J0/temp/solr.core.TestLazyCores_65FC1865C21E821E-001/tempDir-001/collection2/data/index
[junit4] 2> 1334301 INFO (TEST-TestLazyCores.testRace-seed#[65FC1865C21E821E]) [ x:collectionLazy2] o.a.s.c.CachingDirectoryFactory looking to close /x1/jenkins/jenkins-slave/workspace/Lucene-Solr-Tests-5.3-Java7/solr/build/solr-core/test/J0/temp/solr.core.TestLazyCores_65FC1865C21E821E-001/tempDir-001/collection2/data [CachedDir<<refCount=0;path=/x1/jenkins/jenkins-slave/workspace/Lucene-Solr-Tests-5.3-Java7/solr/build/solr-core/test/J0/temp/solr.core.TestLazyCores_65FC1865C21E821E-001/tempDir-001/collection2/data;done=false>>]
[junit4] 2> 1334301 INFO (TEST-TestLazyCores.testRace-seed#[65FC1865C21E821E]) [ x:collectionLazy2] o.a.s.c.CachingDirectoryFactory Closing directory: /x1/jenkins/jenkins-slave/workspace/Lucene-Solr-Tests-5.3-Java7/solr/build/solr-core/test/J0/temp/solr.core.TestLazyCores_65FC1865C21E821E-001/tempDir-001/collection2/data
[junit4] 2> 1334301 INFO (TEST-TestLazyCores.testRace-seed#[65FC1865C21E821E]) [ x:collectionLazy3] o.a.s.c.SolrCore [collectionLazy3] CLOSING SolrCore org.apache.solr.core.SolrCore@28311ec1
[junit4] 2> 1334301 INFO (TEST-TestLazyCores.testRace-seed#[65FC1865C21E821E]) [ x:collectionLazy3] o.a.s.u.UpdateHandler closing DirectUpdateHandler2{commits=0,autocommits=0,soft autocommits=0,optimizes=0,rollbacks=0,expungeDeletes=0,docsPending=0,adds=0,deletesById=0,deletesByQuery=0,errors=0,cumulative_adds=0,cumulative_deletesById=0,cumulative_deletesByQuery=0,cumulative_errors=0}
[junit4] 2> 1334302 INFO (TEST-TestLazyCores.testRace-seed#[65FC1865C21E821E]) [ x:collectionLazy3] o.a.s.u.SolrCoreState Closing SolrCoreState
[junit4] 2> 1334302 INFO (TEST-TestLazyCores.testRace-seed#[65FC1865C21E821E]) [ x:collectionLazy3] o.a.s.u.DefaultSolrCoreState SolrCoreState ref count has reached 0 - closing IndexWriter
[junit4] 2> 1334302 INFO (TEST-TestLazyCores.testRace-seed#[65FC1865C21E821E]) [ x:collectionLazy3] o.a.s.u.DefaultSolrCoreState closing IndexWriter with IndexWriterCloser
[junit4] 2> 1334302 INFO (TEST-TestLazyCores.testRace-seed#[65FC1865C21E821E]) [ x:collectionLazy3] o.a.s.c.SolrCore [collectionLazy3] Closing main searcher on request.
[junit4] 2> 1334302 INFO (TEST-TestLazyCores.testRace-seed#[65FC1865C21E821E]) [ x:collectionLazy3] o.a.s.c.CachingDirectoryFactory Closing MockDirectoryFactory - 2 directories currently being tracked
[junit4] 2> 1334303 INFO (TEST-TestLazyCores.testRace-seed#[65FC1865C21E821E]) [ x:collectionLazy3] o.a.s.c.CachingDirectoryFactory looking to close /x1/jenkins/jenkins-slave/workspace/Lucene-Solr-Tests-5.3-Java7/solr/build/solr-core/test/J0/temp/solr.core.TestLazyCores_65FC1865C21E821E-001/tempDir-001/collection3/data [CachedDir<<refCount=0;path=/x1/jenkins/jenkins-slave/workspace/Lucene-Solr-Tests-5.3-Java7/solr/build/solr-core/test/J0/temp/solr.core.TestLazyCores_65FC1865C21E821E-001/tempDir-001/collection3/data;done=false>>]
[junit4] 2> 1334303 INFO (TEST-TestLazyCores.testRace-seed#[65FC1865C21E821E]) [ x:collectionLazy3] o.a.s.c.CachingDirectoryFactory Closing directory: /x1/jenkins/jenkins-slave/workspace/Lucene-Solr-Tests-5.3-Java7/solr/build/solr-core/test/J0/temp/solr.core.TestLazyCores_65FC1865C21E821E-001/tempDir-001/collection3/data
[junit4] 2> 1334303 INFO (TEST-TestLazyCores.testRace-seed#[65FC1865C21E821E]) [ x:collectionLazy3] o.a.s.c.CachingDirectoryFactory looking to close /x1/jenkins/jenkins-slave/workspace/Lucene-Solr-Tests-5.3-Java7/solr/build/solr-core/test/J0/temp/solr.core.TestLazyCores_65FC1865C21E821E-001/tempDir-001/collection3/data/index [CachedDir<<refCount=0;path=/x1/jenkins/jenkins-slave/workspace/Lucene-Solr-Tests-5.3-Java7/solr/build/solr-core/test/J0/temp/solr.core.TestLazyCores_65FC1865C21E821E-001/tempDir-001/collection3/data/index;done=false>>]
[junit4] 2> 1334303 INFO (TEST-TestLazyCores.testRace-seed#[65FC1865C21E821E]) [ x:collectionLazy3] o.a.s.c.CachingDirectoryFactory Closing directory: /x1/jenkins/jenkins-slave/workspace/Lucene-Solr-Tests-5.3-Java7/solr/build/solr-core/test/J0/temp/solr.core.TestLazyCores_65FC1865C21E821E-001/tempDir-001/collection3/data/index
[junit4] 2> 1334303 INFO (TEST-TestLazyCores.testRace-seed#[65FC1865C21E821E]) [ x:collectionLazy3] o.a.s.SolrTestCaseJ4 ###Ending testRace
[junit4] 2> 1334308 INFO (TEST-TestLazyCores.testCreateSame-seed#[65FC1865C21E821E]) [ x:collectionLazy3] o.a.s.SolrTestCaseJ4 ###Starting testCreateSame
[junit4] 2> 1334321 INFO (TEST-TestLazyCores.testCreateSame-seed#[65FC1865C21E821E]) [ x:collectionLazy3] o.a.s.c.SolrResourceLoader new SolrResourceLoader for directory: '/x1/jenkins/jenkins-slave/workspace/Lucene-Solr-Tests-5.3-Java7/solr/build/solr-core/test/J0/temp/solr.core.TestLazyCores_65FC1865C21E821E-001/tempDir-002/'
[junit4] 2> 1334339 INFO (TEST-TestLazyCores.testCreateSame-seed#[65FC1865C21E821E]) [ x:collectionLazy3] o.a.s.c.CoreContainer New CoreContainer 1752939318
[junit4] 2> 1334339 INFO (TEST-TestLazyCores.testCreateSame-seed#[65FC1865C21E821E]) [ x:collectionLazy3] o.a.s.c.CoreContainer Loading cores into CoreContainer [instanceDir=/x1/jenkins/jenkins-slave/workspace/Lucene-Solr-Tests-5.3-Java7/solr/build/solr-core/test/J0/temp/solr.core.TestLazyCores_65FC1865C21E821E-001/tempDir-002/]
[junit4] 2> 1334339 INFO (TEST-TestLazyCores.testCreateSame-seed#[65FC1865C21E821E]) [ x:collectionLazy3] o.a.s.c.CoreContainer loading shared library: /x1/jenkins/jenkins-slave/workspace/Lucene-Solr-Tests-5.3-Java7/solr/build/solr-core/test/J0/temp/solr.core.TestLazyCores_65FC1865C21E821E-001/tempDir-002/lib
[junit4] 2> 1334339 WARN (TEST-TestLazyCores.testCreateSame-seed#[65FC1865C21E821E]) [ x:collectionLazy3] o.a.s.c.SolrResourceLoader Can't find (or read) directory to add to classloader: lib (resolved as: /x1/jenkins/jenkins-slave/workspace/Lucene-Solr-Tests-5.3-Java7/solr/build/solr-core/test/J0/temp/solr.core.TestLazyCores_65FC1865C21E821E-001/tempDir-002/lib).
[junit4] 2> 1334347 INFO (TEST-TestLazyCores.testCreateSame-seed#[65FC1865C21E821E]) [ x:collectionLazy3] o.a.s.h.c.HttpShardHandlerFactory created with socketTimeout : 600000,connTimeout : 60000,maxConnectionsPerHost : 20,maxConnections : 10000,corePoolSize : 0,maximumPoolSize : 2147483647,maxThreadIdleTime : 5,sizeOfQueue : -1,fairnessPolicy : false,useRetries : false,
[junit4] 2> 1334348 INFO (TEST-TestLazyCores.testCreateSame-seed#[65FC1865C21E821E]) [ x:collectionLazy3] o.a.s.u.UpdateShardHandler Creating UpdateShardHandler HTTP client with params: socketTimeout=600000&connTimeout=60000&retry=true
[junit4] 2> 1334349 INFO (TEST-TestLazyCores.testCreateSame-seed#[65FC1865C21E821E]) [ x:collectionLazy3] o.a.s.c.CoreContainer Allocating transient cache for 4 transient cores
[junit4] 2> 1334349 INFO (TEST-TestLazyCores.testCreateSame-seed#[65FC1865C21E821E]) [ x:collectionLazy3] o.a.s.l.LogWatcher SLF4J impl is org.slf4j.impl.Log4jLoggerFactory
[junit4] 2> 1334349 INFO (TEST-TestLazyCores.testCreateSame-seed#[65FC1865C21E821E]) [ x:collectionLazy3] o.a.s.l.LogWatcher Registering Log Listener [Log4j (org.slf4j.impl.Log4jLoggerFactory)]
[junit4] 2> 1334349 INFO (TEST-TestLazyCores.testCreateSame-seed#[65FC1865C21E821E]) [ x:collectionLazy3] o.a.s.c.CoreContainer Security conf doesn't exist. Skipping setup for authorization module.
[junit4] 2> 1334349 INFO (TEST-TestLazyCores.testCreateSame-seed#[65FC1865C21E821E]) [ x:collectionLazy3] o.a.s.c.CoreContainer No authentication plugin used.
[junit4] 2> 1334350 INFO (TEST-TestLazyCores.testCreateSame-seed#[65FC1865C21E821E]) [ x:collectionLazy3] o.a.s.c.SolrCore Created CoreDescriptor: {configSetProperties=configsetprops.json, instanceDir=collection1, transient=false, loadOnStartup=true, name=collection1, absoluteInstDir=/x1/jenkins/jenkins-slave/workspace/Lucene-Solr-Tests-5.3-Java7/solr/build/solr-core/test/J0/temp/solr.core.TestLazyCores_65FC1865C21E821E-001/tempDir-002/collection1/, dataDir=data/, config=solrconfig.xml, schema=schema.xml}
[junit4] 2> 1334351 INFO (TEST-TestLazyCores.testCreateSame-seed#[65FC1865C21E821E]) [ x:collectionLazy3] o.a.s.c.SolrCore Created CoreDescriptor: {dataDir=data/, configSetProperties=configsetprops.json, transient=true, loadOnStartup=true, schema=schema.xml, instanceDir=collection2, name=collectionLazy2, config=solrconfig.xml, absoluteInstDir=/x1/jenkins/jenkins-slave/workspace/Lucene-Solr-Tests-5.3-Java7/solr/build/solr-core/test/J0/temp/solr.core.TestLazyCores_65FC1865C21E821E-001/tempDir-002/collection2/}
[junit4] 2> 1334351 INFO (TEST-TestLazyCores.testCreateSame-seed#[65FC1865C21E821E]) [ x:collectionLazy3] o.a.s.c.SolrCore Created CoreDescriptor: {loadOnStartup=false, transient=on, config=solrconfig.xml, dataDir=data/, configSetProperties=configsetprops.json, instanceDir=collection3, name=collectionLazy3, absoluteInstDir=/x1/jenkins/jenkins-slave/workspace/Lucene-Solr-Tests-5.3-Java7/solr/build/solr-core/test/J0/temp/solr.core.TestLazyCores_65FC1865C21E821E-001/tempDir-002/collection3/, schema=schema.xml}
[junit4] 2> 1334351 INFO (TEST-TestLazyCores.testCreateSame-seed#[65FC1865C21E821E]) [ x:collectionLazy3] o.a.s.c.SolrCore Created CoreDescriptor: {name=collectionLazy4, config=solrconfig.xml, transient=false, instanceDir=collection4, configSetProperties=configsetprops.json, dataDir=data/, absoluteInstDir=/x1/jenkins/jenkins-slave/workspace/Lucene-Solr-Tests-5.3-Java7/solr/build/solr-core/test/J0/temp/solr.core.TestLazyCores_65FC1865C21E821E-001/tempDir-002/collection4/, loadOnStartup=false, schema=schema.xml}
[junit4] 2> 1334352 INFO (TEST-TestLazyCores.testCreateSame-seed#[65FC1865C21E821E]) [ x:collectionLazy3] o.a.s.c.SolrCore Created CoreDescriptor: {config=solrconfig.xml, name=collectionLazy5, schema=schema.xml, configSetProperties=configsetprops.json, instanceDir=collection5, loadOnStartup=true, dataDir=data/, transient=false, absoluteInstDir=/x1/jenkins/jenkins-slave/workspace/Lucene-Solr-Tests-5.3-Java7/solr/build/solr-core/test/J0/temp/solr.core.TestLazyCores_65FC1865C21E821E-001/tempDir-002/collection5/}
[junit4] 2> 1334352 INFO (TEST-TestLazyCores.testCreateSame-seed#[65FC1865C21E821E]) [ x:collectionLazy3] o.a.s.c.SolrCore Created CoreDescriptor: {absoluteInstDir=/x1/jenkins/jenkins-slave/workspace/Lucene-Solr-Tests-5.3-Java7/solr/build/solr-core/test/J0/temp/solr.core.TestLazyCores_65FC1865C21E821E-001/tempDir-002/collection6/, loadOnStartup=false, configSetProperties=configsetprops.json, dataDir=data/, transient=true, config=solrconfig.xml, name=collectionLazy6, instanceDir=collection6, schema=schema.xml}
[junit4] 2> 1334352 INFO (TEST-TestLazyCores.testCreateSame-seed#[65FC1865C21E821E]) [ x:collectionLazy3] o.a.s.c.SolrCore Created CoreDescriptor: {dataDir=data/, transient=true, instanceDir=collection7, schema=schema.xml, config=solrconfig.xml, configSetProperties=configsetprops.json, absoluteInstDir=/x1/jenkins/jenkins-slave/workspace/Lucene-Solr-Tests-5.3-Java7/solr/build/solr-core/test/J0/temp/solr.core.TestLazyCores_65FC1865C21E821E-001/tempDir-002/collection7/, name=collectionLazy7, loadOnStartup=false}
[junit4] 2> 1334353 INFO (TEST-TestLazyCores.testCreateSame-seed#[65FC1865C21E821E]) [ x:collectionLazy3] o.a.s.c.SolrCore Created CoreDescriptor: {configSetProperties=configsetprops.json, config=solrconfig.xml, schema=schema.xml, instanceDir=collection8, absoluteInstDir=/x1/jenkins/jenkins-slave/workspace/Lucene-Solr-Tests-5.3-Java7/solr/build/solr-core/test/J0/temp/solr.core.TestLazyCores_65FC1865C21E821E-001/tempDir-002/collection8/, name=collectionLazy8, dataDir=data/, loadOnStartup=false, transient=true}
[junit4] 2> 1334353 INFO (TEST-TestLazyCores.testCreateSame-seed#[65FC1865C21E821E]) [ x:collectionLazy3] o.a.s.c.SolrCore Created CoreDescriptor: {absoluteInstDir=/x1/jenkins/jenkins-slave/workspace/Lucene-Solr-Tests-5.3-Java7/solr/build/solr-core/test/J0/temp/solr.core.TestLazyCores_65FC1865C21E821E-001/tempDir-002/collection9/, transient=true, configSetProperties=configsetprops.json, instanceDir=collection9, schema=schema.xml, config=solrconfig.xml, loadOnStartup=false, name=collectionLazy9, dataDir=data/}
[junit4] 2> 1334355 INFO (coreLoadExecutor-3664-thread-1-processing-x:collectionLazy3) [ x:collectionLazy3] o.a.s.c.SolrResourceLoader new SolrResourceLoader for directory: '/x1/jenkins/jenkins-slave/workspace/Lucene-Solr-Tests-5.3-Java7/solr/build/solr-core/test/J0/temp/solr.core.TestLazyCores_65FC1865C21E821E-001/tempDir-002/collection1/'
[junit4] 2> 1334355 INFO (coreLoadExecutor-3664-thread-2-processing-x:collectionLazy3) [ x:collectionLazy3] o.a.s.c.SolrResourceLoader new SolrResourceLoader for directory: '/x1/jenkins/jenkins-slave/workspace/Lucene-Solr-Tests-5.3-Java7/solr/build/solr-core/test/J0/temp/solr.core.TestLazyCores_65FC1865C21E821E-001/tempDir-002/collection2/'
[junit4] 2> 1334356 INFO (coreLoadExecutor-3664-thread-3-processing-x:collectionLazy3) [ x:collectionLazy3] o.a.s.c.SolrResourceLoader new SolrResourceLoader for directory: '/x1/jenkins/jenkins-slave/workspace/Lucene-Solr-Tests-5.3-Java7/solr/build/solr-core/test/J0/temp/solr.core.TestLazyCores_65FC1865C21E821E-001/tempDir-002/collection5/'
[junit4] 2> 1334401 INFO (coreLoadExecutor-3664-thread-3-processing-x:collectionLazy3) [ x:collectionLazy3] o.a.s.c.SolrConfig current version of requestparams : -1
[junit4] 2> 1334430 INFO (coreLoadExecutor-3664-thread-2-processing-x:collectionLazy3) [ x:collectionLazy3] o.a.s.c.SolrConfig current version of requestparams : -1
[junit4] 2> 1334437 INFO (coreLoadExecutor-3664-thread-3-processing-x:collectionLazy3) [ x:collectionLazy3] o.a.s.c.SolrConfig Using Lucene MatchVersion: 5.3.1
[junit4] 2> 1334440 INFO (coreLoadExecutor-3664-thread-1-processing-x:collectionLazy3) [ x:collectionLazy3] o.a.s.c.SolrConfig current version of requestparams : -1
[junit4] 2> 1334454 INFO (coreLoadExecutor-3664-thread-2-processing-x:collectionLazy3) [ x:collectionLazy3] o.a.s.c.SolrConfig Using Lucene MatchVersion: 5.3.1
[junit4] 2> 1334460 INFO (coreLoadExecutor-3664-thread-1-processing-x:collectionLazy3) [ x:collectionLazy3] o.a.s.c.SolrConfig Using Lucene MatchVersion: 5.3.1
[junit4] 2> 1334489 INFO (coreLoadExecutor-3664-thread-3-processing-x:collectionLazy3) [ x:collectionLazy3] o.a.s.c.Config Loaded SolrConfig: solrconfig.xml
[junit4] 2> 1334490 INFO (coreLoadExecutor-3664-thread-3-processing-x:collectionLazy3) [ x:collectionLazy3] o.a.s.s.IndexSchema Reading Solr Schema from /x1/jenkins/jenkins-slave/workspace/Lucene-Solr-Tests-5.3-Java7/solr/build/solr-core/test/J0/temp/solr.core.TestLazyCores_65FC1865C21E821E-001/tempDir-002/collection5/conf/schema.xml
[junit4] 2> 1334493 INFO (coreLoadExecutor-3664-thread-1-processing-x:collectionLazy3) [ x:collectionLazy3] o.a.s.c.Config Loaded SolrConfig: solrconfig.xml
[junit4] 2> 1334494 INFO (coreLoadExecutor-3664-thread-1-processing-x:collectionLazy3) [ x:collectionLazy3] o.a.s.s.IndexSchema Reading Solr Schema from /x1/jenkins/jenkins-slave/workspace/Lucene-Solr-Tests-5.3-Java7/solr/build/solr-core/test/J0/temp/solr.core.TestLazyCores_65FC1865C21E821E-001/tempDir-002/collection1/conf/schema.xml
[junit4] 2> 1334494 INFO (coreLoadExecutor-3664-thread-3-processing-x:collectionLazy3) [ x:collectionLazy3] o.a.s.s.IndexSchema [collectionLazy5] Schema name=tiny
[junit4] 2> 1334498 INFO (coreLoadExecutor-3664-thread-1-processing-x:collectionLazy3) [ x:collectionLazy3] o.a.s.s.IndexSchema [collection1] Schema name=tiny
[junit4] 2> 1334522 INFO (coreLoadExecutor-3664-thread-3-processing-x:collectionLazy3) [ x:collectionLazy3] o.a.s.s.IndexSchema unique key field: id
[junit4] 2> 1334524 INFO (coreLoadExecutor-3664-thread-3-processing-x:collectionLazy3) [ x:collectionLazy3] o.a.s.c.ConfigSetProperties Did not find ConfigSet properties, assuming default properties: Can't find resource 'configsetprops.json' in classpath or '/x1/jenkins/jenkins-slave/workspace/Lucene-Solr-Tests-5.3-Java7/solr/build/solr-core/test/J0/temp/solr.core.TestLazyCores_65FC1865C21E821E-001/tempDir-002/collection5/conf'
[junit4] 2> 1334524 INFO (coreLoadExecutor-3664-thread-3-processing-x:collectionLazy3) [ x:collectionLazy3] o.a.s.c.CoreContainer Creating SolrCore 'collectionLazy5' using configuration from instancedir /x1/jenkins/jenkins-slave/workspace/Lucene-Solr-Tests-5.3-Java7/solr/build/solr-core/test/J0/temp/solr.core.TestLazyCores_65FC1865C21E821E-001/tempDir-002/collection5/
[junit4] 2> 1334524 INFO (coreLoadExecutor-3664-thread-3-processing-x:collectionLazy3) [ x:collectionLazy5] o.a.s.c.SolrCore org.apache.solr.core.MockDirectoryFactory
[junit4] 2> 1334524 INFO (coreLoadExecutor-3664-thread-3-processing-x:collectionLazy3) [ x:collectionLazy5] o.a.s.c.SolrCore [[collectionLazy5] ] Opening new SolrCore at [/x1/jenkins/jenkins-slave/workspace/Lucene-Solr-Tests-5.3-Java7/solr/build/solr-core/test/J0/temp/solr.core.TestLazyCores_65FC1865C21E821E-001/tempDir-002/collection5/], dataDir=[null]
[junit4] 2> 1334524 INFO (coreLoadExecutor-3664-thread-3-processing-x:collectionLazy3) [ x:collectionLazy5] o.a.s.c.SolrCore JMX monitoring not detected for core: collectionLazy5
[junit4] 2> 1334525 INFO (coreLoadExecutor-3664-thread-3-processing-x:collectionLazy3) [ x:collectionLazy5] o.a.s.c.CachingDirectoryFactory return new directory for /x1/jenkins/jenkins-slave/workspace/Lucene-Solr-Tests-5.3-Java7/solr/build/solr-core/test/J0/temp/solr.core.TestLazyCores_65FC1865C21E821E-001/tempDir-002/collection5/data
[junit4] 2> 1334526 INFO (coreLoadExecutor-3664-thread-3-processing-x:collectionLazy3) [ x:collectionLazy5] o.a.s.c.SolrCore New index directory detected: old=null new=/x1/jenkins/jenkins-slave/workspace/Lucene-Solr-Tests-5.3-Java7/solr/build/solr-core/test/J0/temp/solr.core.TestLazyCores_65FC1865C21E821E-001/tempDir-002/collection5/data/index/
[junit4] 2> 1334526 WARN (coreLoadExecutor-3664-thread-3-processing-x:collectionLazy3) [ x:collectionLazy5] o.a.s.c.SolrCore [collectionLazy5] Solr index directory '/x1/jenkins/jenkins-slave/workspace/Lucene-Solr-Tests-5.3-Java7/solr/build/solr-core/test/J0/temp/solr.core.TestLazyCores_65FC1865C21E821E-001/tempDir-002/collection5/data/index' doesn't exist. Creating new index...
[junit4] 2> 1334526 INFO (coreLoadExecutor-3664-thread-3-processing-x:collectionLazy3) [ x:collectionLazy5] o.a.s.c.CachingDirectoryFactory return new directory for /x1/jenkins/jenkins-slave/workspace/Lucene-Solr-Tests-5.3-Java7/solr/build/solr-core/test/J0/temp/solr.core.TestLazyCores_65FC1865C21E821E-001/tempDir-002/collection5/data/index
[junit4] 2> 1334526 INFO (coreLoadExecutor-3664-thread-3-processing-x:collectionLazy3) [ x:collectionLazy5] o.a.s.u.RandomMergePolicy RandomMergePolicy wrapping class org.apache.lucene.index.LogByteSizeMergePolicy: [LogByteSizeMergePolicy: minMergeSize=1677721, mergeFactor=16, maxMergeSize=2147483648, maxMergeSizeForForcedMerge=9223372036854775807, calibrateSizeByDeletes=true, maxMergeDocs=2147483647, maxCFSSegmentSizeMB=8.796093022207999E12, noCFSRatio=1.0]
[junit4] 2> 1334527 INFO (coreLoadExecutor-3664-thread-3-processing-x:collectionLazy3) [ x:collectionLazy5] o.a.s.c.SolrCore SolrDeletionPolicy.onCommit: commits: num=1
[junit4] 2> commit{dir=MockDirectoryWrapper(RAMDirectory@70ea91b1 lockFactory=org.apache.lucene.store.SingleInstanceLockFactory@38033561),segFN=segments_1,generation=1}
[junit4] 2> 1334527 INFO (coreLoadExecutor-3664-thread-3-processing-x:collectionLazy3) [ x:collectionLazy5] o.a.s.c.SolrCore newest commit generation = 1
[junit4] 2> 1334530 INFO (coreLoadExecutor-3664-thread-3-processing-x:collectionLazy3) [ x:collectionLazy5] o.a.s.c.SolrCore no updateRequestProcessorChain defined as default, creating implicit default
[junit4] 2> 1334533 INFO (coreLoadExecutor-3664-thread-3-processing-x:collectionLazy3) [ x:collectionLazy5] o.a.s.h.l.XMLLoader xsltCacheLifetimeSeconds=60
[junit4] 2> 1334534 INFO (coreLoadExecutor-3664-thread-3-processing-x:collectionLazy3) [ x:collectionLazy5] o.a.s.h.l.XMLLoader xsltCacheLifetimeSeconds=60
[junit4] 2> 1334535 INFO (coreLoadExecutor-3664-thread-3-processing-x:collectionLazy3) [ x:collectionLazy5] o.a.s.h.l.XMLLoader xsltCacheLifetimeSeconds=60
[junit4] 2> 1334537 INFO (coreLoadExecutor-3664-thread-3-processing-x:collectionLazy3) [ x:collectionLazy5] o.a.s.h.l.XMLLoader xsltCacheLifetimeSeconds=60
[junit4] 2> 1334538 INFO (coreLoadExecutor-3664-thread-2-processing-x:collectionLazy3) [ x:collectionLazy3] o.a.s.c.Config Loaded SolrConfig: solrconfig.xml
[junit4] 2> 1334537 INFO (OldIndexDirectoryCleanupThreadForCore-collectionLazy5) [ x:collectionLazy5] o.a.s.c.SolrCore Looking for old index directories to cleanup for core collectionLazy5 in /x1/jenkins/jenkins-slave/workspace/Lucene-Solr-Tests-5.3-Java7/solr/build/solr-core/test/J0/temp/solr.core.TestLazyCores_65FC1865C21E821E-001/tempDir-002/collection5/data/
[junit4] 2> 1334540 INFO (coreLoadExecutor-3664-thread-2-processing-x:collectionLazy3) [ x:collectionLazy3] o.a.s.s.IndexSchema Reading Solr Schema from /x1/jenkins/jenkins-slave/workspace/Lucene-Solr-Tests-5.3-Java7/solr/build/solr-core/test/J0/temp/solr.core.TestLazyCores_65FC1865C21E821E-001/tempDir-002/collection2/conf/schema.xml
[junit4] 2> 1334540 INFO (coreLoadExecutor-3664-thread-1-processing-x:collectionLazy3) [ x:collectionLazy3] o.a.s.s.IndexSchema unique key field: id
[junit4] 2> 1334547 INFO (coreLoadExecutor-3664-thread-1-processing-x:collectionLazy3) [ x:collectionLazy3] o.a.s.c.ConfigSetProperties Did not find ConfigSet properties, assuming default properties: Can't find resource 'configsetprops.json' in classpath or '/x1/jenkins/jenkins-slave/workspace/Lucene-Solr-Tests-5.3-Java7/solr/build/solr-core/test/J0/temp/solr.core.TestLazyCores_65FC1865C21E821E-001/tempDir-002/collection1/conf'
[junit4] 2> 1334547 INFO (coreLoadExecutor-3664-thread-1-processing-x:collectionLazy3) [ x:collectionLazy3] o.a.s.c.CoreContainer Creating SolrCore 'collection1' using configuration from instancedir /x1/jenkins/jenkins-slave/workspace/Lucene-Solr-Tests-5.3-Java7/solr/build/solr-core/test/J0/temp/solr.core.TestLazyCores_65FC1865C21E821E-001/tempDir-002/collection1/
[junit4] 2> 1334547 INFO (coreLoadExecutor-3664-thread-1-processing-x:collectionLazy3) [ x:collection1] o.a.s.c.SolrCore org.apache.solr.core.MockDirectoryFactory
[junit4] 2> 1334548 INFO (coreLoadExecutor-3664-thread-1-processing-x:collectionLazy3) [ x:collection1] o.a.s.c.SolrCore [[collection1] ] Opening new SolrCore at [/x1/jenkins/jenkins-slave/workspace/Lucene-Solr-Tests-5.3-Java7/solr/build/solr-core/test/J0/temp/solr.core.TestLazyCores_65FC1865C21E821E-001/tempDir-002/collection1/], dataDir=[null]
[junit4] 2> 1334548 INFO (coreLoadExecutor-3664-thread-1-processing-x:collectionLazy3) [ x:collection1] o.a.s.c.SolrCore JMX monitoring not detected for core: collection1
[junit4] 2> 1334548 INFO (coreLoadExecutor-3664-thread-1-processing-x:collectionLazy3) [ x:collection1] o.a.s.c.CachingDirectoryFactory return new directory for /x1/jenkins/jenkins-slave/workspace/Lucene-Solr-Tests-5.3-Java7/solr/build/solr-core/test/J0/temp/solr.core.TestLazyCores_65FC1865C21E821E-001/tempDir-002/collection1/data
[junit4] 2> 1334548 INFO (coreLoadExecutor-3664-thread-1-processing-x:collectionLazy3) [ x:collection1] o.a.s.c.SolrCore New index directory detected: old=null new=/x1/jenkins/jenkins-slave/workspace/Lucene-Solr-Tests-5.3-Java7/solr/build/solr-core/test/J0/temp/solr.core.TestLazyCores_65FC1865C21E821E-001/tempDir-002/collection1/data/index/
[junit4] 2> 1334548 WARN (coreLoadExecutor-3664-thread-1-processing-x:collectionLazy3) [ x:collection1] o.a.s.c.SolrCore [collection1] Solr index directory '/x1/jenkins/jenkins-slave/workspace/Lucene-Solr-Tests-5.3-Java7/solr/build/solr-core/test/J0/temp/solr.core.TestLazyCores_65FC1865C21E821E-001/tempDir-002/collection1/data/index' doesn't exist. Creating new index...
[junit4] 2> 1334539 INFO (coreLoadExecutor-3664-thread-3-processing-x:collectionLazy3) [ x:collectionLazy5] o.a.s.c.RequestHandlers Registered paths: /admin/system,/admin/file,/admin/logging,/admin/mbeans,/replication,/update,/select,/admin/properties,/update/json,/admin/luke,/admin/segments,/config,/get,/admin/ping,/admin/threads,/schema,/update/csv,/admin/plugins,/update/json/docs
[junit4] 2> 1334549 INFO (coreLoadExecutor-3664-thread-2-processing-x:collectionLazy3) [ x:collectionLazy3] o.a.s.s.IndexSchema [collectionLazy2] Schema name=tiny
[junit4] 2> 1334550 INFO (coreLoadExecutor-3664-thread-3-processing-x:collectionLazy3) [ x:collectionLazy5] o.a.s.c.SolrCore Using default statsCache cache: org.apache.solr.search.stats.LocalStatsCache
[junit4] 2> 1334549 INFO (coreLoadExecutor-3664-thread-1-processing-x:collectionLazy3) [ x:collection1] o.a.s.c.CachingDirectoryFactory return new directory for /x1/jenkins/jenkins-slave/workspace/Lucene-Solr-Tests-5.3-Java7/solr/build/solr-core/test/J0/temp/solr.core.TestLazyCores_65FC1865C21E821E-001/tempDir-002/collection1/data/index
[junit4] 2> 1334550 INFO (coreLoadExecutor-3664-thread-3-processing-x:collectionLazy3) [ x:collectionLazy5] o.a.s.c.SolrCore Hard AutoCommit: disabled
[junit4] 2> 1334550 INFO (coreLoadExecutor-3664-thread-3-processing-x:collectionLazy3) [ x:collectionLazy5] o.a.s.c.SolrCore Soft AutoCommit: disabled
[junit4] 2> 1334540 WARN (OldIndexDirectoryCleanupThreadForCore-collectionLazy5) [ x:collectionLazy5] o.a.s.c.DirectoryFactory /x1/jenkins/jenkins-slave/workspace/Lucene-Solr-Tests-5.3-Java7/solr/build/solr-core/test/J0/temp/solr.core.TestLazyCores_65FC1865C21E821E-001/tempDir-002/collection5/data/ does not point to a valid data directory; skipping clean-up of old index directories.
[junit4] 2> 1334551 INFO (coreLoadExecutor-3664-thread-3-processing-x:collectionLazy3) [ x:collectionLazy5] o.a.s.u.RandomMergePolicy RandomMergePolicy wrapping class org.apache.lucene.index.TieredMergePolicy: [TieredMergePolicy: maxMergeAtOnce=35, maxMergeAtOnceExplicit=32, maxMergedSegmentMB=73.021484375, floorSegmentMB=1.052734375, forceMergeDeletesPctAllowed=1.5147040873171624, segmentsPerTier=50.0, maxCFSSegmentSizeMB=8.796093022207999E12, noCFSRatio=0.6911216941300772
[junit4] 2> 1334552 INFO (coreLoadExecutor-3664-thread-3-processing-x:collectionLazy3) [ x:collectionLazy5] o.a.s.c.SolrCore SolrDeletionPolicy.onInit: commits: num=1
[junit4] 2> commit{dir=MockDirectoryWrapper(RAMDirectory@70ea91b1 lockFactory=org.apache.lucene.store.SingleInstanceLockFactory@38033561),segFN=segments_1,generation=1}
[junit4] 2> 1334552 INFO (coreLoadExecutor-3664-thread-3-processing-x:collectionLazy3) [ x:collectionLazy5] o.a.s.c.SolrCore newest commit generation = 1
[junit4] 2> 1334552 INFO (coreLoadExecutor-3664-thread-3-processing-x:collectionLazy3) [ x:collectionLazy5] o.a.s.s.SolrIndexSearcher Opening Searcher@4b08e4b3[collectionLazy5] main
[junit4] 2> 1334552 INFO (coreLoadExecutor-3664-thread-3-processing-x:collectionLazy3) [ x:collectionLazy5] o.a.s.r.ManagedResourceSt
[...truncated too long message...]
estLazyCores-seed#[65FC1865C21E821E]-worker) [ x:collectionLazy2] o.a.s.c.CoreContainer Shutting down CoreContainer instance=694698013
[junit4] 2> 1460428 ERROR (SUITE-TestLazyCores-seed#[65FC1865C21E821E]-worker) [ x:collectionLazy2] o.a.s.SolrTestCaseJ4 ERROR: SolrIndexSearcher opens=51 closes=50
[junit4] 2> Sep 21, 2015 5:48:11 PM com.carrotsearch.randomizedtesting.ThreadLeakControl checkThreadLeaks
[junit4] 2> WARNING: Will linger awaiting termination of 1 leaked thread(s).
[junit4] 2> Sep 21, 2015 5:48:31 PM com.carrotsearch.randomizedtesting.ThreadLeakControl checkThreadLeaks
[junit4] 2> SEVERE: 1 thread leaked from SUITE scope at org.apache.solr.core.TestLazyCores:
[junit4] 2> 1) Thread[id=7677, name=searcherExecutor-3802-thread-1, state=WAITING, group=TGRP-TestLazyCores]
[junit4] 2> at sun.misc.Unsafe.park(Native Method)
[junit4] 2> at java.util.concurrent.locks.LockSupport.park(LockSupport.java:186)
[junit4] 2> at java.util.concurrent.locks.AbstractQueuedSynchronizer$ConditionObject.await(AbstractQueuedSynchronizer.java:2043)
[junit4] 2> at java.util.concurrent.LinkedBlockingQueue.take(LinkedBlockingQueue.java:442)
[junit4] 2> at java.util.concurrent.ThreadPoolExecutor.getTask(ThreadPoolExecutor.java:1068)
[junit4] 2> at java.util.concurrent.ThreadPoolExecutor.runWorker(ThreadPoolExecutor.java:1130)
[junit4] 2> at java.util.concurrent.ThreadPoolExecutor$Worker.run(ThreadPoolExecutor.java:615)
[junit4] 2> at java.lang.Thread.run(Thread.java:745)
[junit4] 2> Sep 21, 2015 5:48:31 PM com.carrotsearch.randomizedtesting.ThreadLeakControl tryToInterruptAll
[junit4] 2> INFO: Starting to interrupt leaked threads:
[junit4] 2> 1) Thread[id=7677, name=searcherExecutor-3802-thread-1, state=WAITING, group=TGRP-TestLazyCores]
[junit4] 2> Sep 21, 2015 5:48:34 PM com.carrotsearch.randomizedtesting.ThreadLeakControl tryToInterruptAll
[junit4] 2> SEVERE: There are still zombie threads that couldn't be terminated:
[junit4] 2> 1) Thread[id=7677, name=searcherExecutor-3802-thread-1, state=WAITING, group=TGRP-TestLazyCores]
[junit4] 2> at sun.misc.Unsafe.park(Native Method)
[junit4] 2> at java.util.concurrent.locks.LockSupport.park(LockSupport.java:186)
[junit4] 2> at java.util.concurrent.locks.AbstractQueuedSynchronizer$ConditionObject.await(AbstractQueuedSynchronizer.java:2043)
[junit4] 2> at java.util.concurrent.LinkedBlockingQueue.take(LinkedBlockingQueue.java:442)
[junit4] 2> at java.util.concurrent.ThreadPoolExecutor.getTask(ThreadPoolExecutor.java:1068)
[junit4] 2> at java.util.concurrent.ThreadPoolExecutor.runWorker(ThreadPoolExecutor.java:1130)
[junit4] 2> at java.util.concurrent.ThreadPoolExecutor$Worker.run(ThreadPoolExecutor.java:615)
[junit4] 2> at java.lang.Thread.run(Thread.java:745)
[junit4] 2> NOTE: test params are: codec=Lucene53, sim=RandomSimilarityProvider(queryNorm=false,coord=crazy): {}, locale=de_AT, timezone=Asia/Manila
[junit4] 2> NOTE: Linux 3.13.0-52-generic amd64/Oracle Corporation 1.7.0_72 (64-bit)/cpus=4,threads=2,free=159577800,total=533200896
[junit4] 2> NOTE: All tests run in this JVM: [TestCodecSupport, CurrencyFieldXmlFileTest, AsyncCallRequestStatusResponseTest, SmileWriterTest, TermVectorComponentTest, TimeZoneUtilsTest, TestClusterStateMutator, MultiTermTest, HdfsNNFailoverTest, HdfsThreadLeakTest, TestIndexingPerformance, TestInitParams, RequestHandlersTest, SuggesterWFSTTest, StandardRequestHandlerTest, TestArbitraryIndexDir, FastVectorHighlighterTest, TestManagedSchema, TestRequestStatusCollectionAPI, SimplePostToolTest, TestJmxIntegration, URLClassifyProcessorTest, TestSolrIndexConfig, TestJettySolrRunner, TestBlobHandler, LeaderInitiatedRecoveryOnCommitTest, ChaosMonkeyNothingIsSafeTest, TestRandomRequestDistribution, DateMathParserTest, VersionInfoTest, TestSolr4Spatial2, SecurityConfHandlerTest, TestRandomFaceting, TestCloudSchemaless, SimpleCollectionCreateDeleteTest, TestNRTOpen, SuggestComponentTest, TestConfig, UUIDFieldTest, MBeansHandlerTest, TestSimpleQParserPlugin, PeerSyncTest, TestSolrCloudWithKerberosAlt, ActionThrottleTest, CachingDirectoryFactoryTest, MigrateRouteKeyTest, DistributedSuggestComponentTest, TestDFRSimilarityFactory, PreAnalyzedUpdateProcessorTest, SignatureUpdateProcessorFactoryTest, ShardSplitTest, ParsingFieldUpdateProcessorsTest, TestFunctionQuery, SpatialRPTFieldTypeTest, TestSolrDynamicMBean, SolrCoreTest, TestStressLucene, OverseerStatusTest, TestSweetSpotSimilarityFactory, TestHashQParserPlugin, TestBadConfig, TestRestoreCore, TestDynamicFieldResource, TestReqParamsAPI, TestSolrDeletionPolicy1, TestCloudManagedSchema, BasicZkTest, TestAnalyzeInfixSuggestions, LeaderElectionIntegrationTest, IndexBasedSpellCheckerTest, TestQuerySenderListener, SolrIndexConfigTest, TestDocumentBuilder, TestJoin, TestDynamicLoading, TestCollectionAPI, OverseerRolesTest, TestRestManager, TestManagedSchemaFieldTypeResource, AliasIntegrationTest, RequestLoggingTest, TestIBSimilarityFactory, TestReRankQParserPlugin, ClusterStateTest, TestReplicationHandler, ZkNodePropsTest, TestRandomMergePolicy, DistributedSpellCheckComponentTest, TestStressReorder, TestSolr4Spatial, SolrCmdDistributorTest, BadIndexSchemaTest, ConvertedLegacyTest, TestLazyCores]
[junit4] 2> NOTE: reproduce with: ant test -Dtestcase=TestLazyCores -Dtests.seed=65FC1865C21E821E -Dtests.multiplier=2 -Dtests.slow=true -Dtests.locale=de_AT -Dtests.timezone=Asia/Manila -Dtests.asserts=true -Dtests.file.encoding=US-ASCII
[junit4] ERROR 0.00s J0 | TestLazyCores (suite) <<<
[junit4] > Throwable #1: java.lang.AssertionError: ERROR: SolrIndexSearcher opens=51 closes=50
[junit4] > at __randomizedtesting.SeedInfo.seed([65FC1865C21E821E]:0)
[junit4] > at org.apache.solr.SolrTestCaseJ4.endTrackingSearchers(SolrTestCaseJ4.java:467)
[junit4] > at org.apache.solr.SolrTestCaseJ4.afterClass(SolrTestCaseJ4.java:233)
[junit4] > at java.lang.Thread.run(Thread.java:745)Throwable #2: com.carrotsearch.randomizedtesting.ThreadLeakError: 1 thread leaked from SUITE scope at org.apache.solr.core.TestLazyCores:
[junit4] > 1) Thread[id=7677, name=searcherExecutor-3802-thread-1, state=WAITING, group=TGRP-TestLazyCores]
[junit4] > at sun.misc.Unsafe.park(Native Method)
[junit4] > at java.util.concurrent.locks.LockSupport.park(LockSupport.java:186)
[junit4] > at java.util.concurrent.locks.AbstractQueuedSynchronizer$ConditionObject.await(AbstractQueuedSynchronizer.java:2043)
[junit4] > at java.util.concurrent.LinkedBlockingQueue.take(LinkedBlockingQueue.java:442)
[junit4] > at java.util.concurrent.ThreadPoolExecutor.getTask(ThreadPoolExecutor.java:1068)
[junit4] > at java.util.concurrent.ThreadPoolExecutor.runWorker(ThreadPoolExecutor.java:1130)
[junit4] > at java.util.concurrent.ThreadPoolExecutor$Worker.run(ThreadPoolExecutor.java:615)
[junit4] > at java.lang.Thread.run(Thread.java:745)
[junit4] > at __randomizedtesting.SeedInfo.seed([65FC1865C21E821E]:0)Throwable #3: com.carrotsearch.randomizedtesting.ThreadLeakError: There are still zombie threads that couldn't be terminated:
[junit4] > 1) Thread[id=7677, name=searcherExecutor-3802-thread-1, state=WAITING, group=TGRP-TestLazyCores]
[junit4] > at sun.misc.Unsafe.park(Native Method)
[junit4] > at java.util.concurrent.locks.LockSupport.park(LockSupport.java:186)
[junit4] > at java.util.concurrent.locks.AbstractQueuedSynchronizer$ConditionObject.await(AbstractQueuedSynchronizer.java:2043)
[junit4] > at java.util.concurrent.LinkedBlockingQueue.take(LinkedBlockingQueue.java:442)
[junit4] > at java.util.concurrent.ThreadPoolExecutor.getTask(ThreadPoolExecutor.java:1068)
[junit4] > at java.util.concurrent.ThreadPoolExecutor.runWorker(ThreadPoolExecutor.java:1130)
[junit4] > at java.util.concurrent.ThreadPoolExecutor$Worker.run(ThreadPoolExecutor.java:615)
[junit4] > at java.lang.Thread.run(Thread.java:745)
[junit4] > at __randomizedtesting.SeedInfo.seed([65FC1865C21E821E]:0)
[junit4] Completed [399/533] on J0 in 149.78s, 7 tests, 1 failure, 2 errors <<< FAILURES!
[...truncated 425 lines...]
BUILD FAILED
/x1/jenkins/jenkins-slave/workspace/Lucene-Solr-Tests-5.3-Java7/build.xml:726: The following error occurred while executing this line:
/x1/jenkins/jenkins-slave/workspace/Lucene-Solr-Tests-5.3-Java7/build.xml:670: The following error occurred while executing this line:
/x1/jenkins/jenkins-slave/workspace/Lucene-Solr-Tests-5.3-Java7/build.xml:59: The following error occurred while executing this line:
/x1/jenkins/jenkins-slave/workspace/Lucene-Solr-Tests-5.3-Java7/solr/build.xml:230: The following error occurred while executing this line:
/x1/jenkins/jenkins-slave/workspace/Lucene-Solr-Tests-5.3-Java7/solr/common-build.xml:524: The following error occurred while executing this line:
/x1/jenkins/jenkins-slave/workspace/Lucene-Solr-Tests-5.3-Java7/lucene/common-build.xml:1449: The following error occurred while executing this line:
/x1/jenkins/jenkins-slave/workspace/Lucene-Solr-Tests-5.3-Java7/lucene/common-build.xml:1003: There were test failures: 533 suites, 2102 tests, 3 suite-level errors, 389 ignored (31 assumptions)
Total time: 51 minutes 50 seconds
Build step 'Invoke Ant' marked build as failure
Archiving artifacts
Sending artifact delta relative to Lucene-Solr-Tests-5.3-Java7 #53
Archived 4 artifacts
Archive block size is 32768
Received 0 blocks and 243086693 bytes
Compression is 0.0%
Took 1 min 0 sec
Recording test results
Email was triggered for: Failure
Sending email for trigger: Failure