You are viewing a plain text version of this content. The canonical link for it is here.
Posted to dev@zookeeper.apache.org by Apache Jenkins Server <je...@builds.apache.org> on 2017/02/21 17:56:07 UTC

Failed: ZOOKEEPER- PreCommit Build #364

Build: https://builds.apache.org/job/PreCommit-ZOOKEEPER-github-pr-build/364/

###################################################################################
########################## LAST 60 LINES OF THE CONSOLE ###########################
[...truncated 68.42 MB...]
     [exec] 
     [exec]     +1 javadoc.  The javadoc tool did not generate any warning messages.
     [exec] 
     [exec]     +1 javac.  The applied patch does not increase the total number of javac compiler warnings.
     [exec] 
     [exec]     -1 findbugs.  The patch appears to introduce 1 new Findbugs (version 3.0.1) warnings.
     [exec] 
     [exec]     +1 release audit.  The applied patch does not increase the total number of release audit warnings.
     [exec] 
     [exec]     -1 core tests.  The patch failed core unit tests.
     [exec] 
     [exec]     +1 contrib tests.  The patch passed contrib unit tests.
     [exec] 
     [exec] Test results: https://builds.apache.org/job/PreCommit-ZOOKEEPER-github-pr-build/364//testReport/
     [exec] Findbugs warnings: https://builds.apache.org/job/PreCommit-ZOOKEEPER-github-pr-build/364//artifact/trunk/build/test/findbugs/newPatchFindbugsWarnings.html
     [exec] Console output: https://builds.apache.org/job/PreCommit-ZOOKEEPER-github-pr-build/364//console
     [exec] 
     [exec] This message is automatically generated.
     [exec] 
     [exec] 
     [exec] ======================================================================
     [exec] ======================================================================
     [exec]     Adding comment to Jira.
     [exec] ======================================================================
     [exec] ======================================================================
     [exec] 
     [exec] 
     [exec] Comment added.
     [exec] 8ee079f343ffff1887016af11c5bbaa71cc594e7 logged out
     [exec] 
     [exec] 
     [exec] ======================================================================
     [exec] ======================================================================
     [exec]     Finished build.
     [exec] ======================================================================
     [exec] ======================================================================
     [exec] 
     [exec] 
     [exec] mv: '/home/jenkins/jenkins-slave/workspace/PreCommit-ZOOKEEPER-github-pr-build/patchprocess' and '/home/jenkins/jenkins-slave/workspace/PreCommit-ZOOKEEPER-github-pr-build/patchprocess' are the same file

BUILD FAILED
/home/jenkins/jenkins-slave/workspace/PreCommit-ZOOKEEPER-github-pr-build/build.xml:1635: exec returned: 2

Total time: 13 minutes 15 seconds
Build step 'Execute shell' marked build as failure
Archiving artifacts
Setting JDK_1_7_LATEST__HOME=/home/jenkins/tools/java/latest1.7
Compressed 579.49 KB of artifacts by 49.7% relative to #362
Recording test results
Setting JDK_1_7_LATEST__HOME=/home/jenkins/tools/java/latest1.7
Setting JDK_1_7_LATEST__HOME=/home/jenkins/tools/java/latest1.7
[description-setter] Description set: ZOOKEEPER-2700
Putting comment on the pull request
Setting JDK_1_7_LATEST__HOME=/home/jenkins/tools/java/latest1.7
Email was triggered for: Failure - Any
Sending email for trigger: Failure - Any
Setting JDK_1_7_LATEST__HOME=/home/jenkins/tools/java/latest1.7
Setting JDK_1_7_LATEST__HOME=/home/jenkins/tools/java/latest1.7
Setting JDK_1_7_LATEST__HOME=/home/jenkins/tools/java/latest1.7



###################################################################################
############################## FAILED TESTS (if any) ##############################
4 tests failed.
FAILED:  org.apache.zookeeper.server.quorum.Zab1_0Test.testNormalFollowerRunWithDiff

Error Message:

followerZooKeeperServer.takeSnapshot();
Never wanted here:
-> at org.apache.zookeeper.server.quorum.Zab1_0Test$5.converseWithFollower(Zab1_0Test.java:883)
But invoked here:
-> at org.apache.zookeeper.server.SyncRequestProcessor$1.run(SyncRequestProcessor.java:134)


Stack Trace:
junit.framework.AssertionFailedError: 
followerZooKeeperServer.takeSnapshot();
Never wanted here:
-> at org.apache.zookeeper.server.quorum.Zab1_0Test$5.converseWithFollower(Zab1_0Test.java:883)
But invoked here:
-> at org.apache.zookeeper.server.SyncRequestProcessor$1.run(SyncRequestProcessor.java:134)

	at org.apache.zookeeper.server.quorum.Zab1_0Test$5.converseWithFollower(Zab1_0Test.java:883)
	at org.apache.zookeeper.server.quorum.Zab1_0Test.testFollowerConversation(Zab1_0Test.java:517)
	at org.apache.zookeeper.server.quorum.Zab1_0Test.testNormalFollowerRunWithDiff(Zab1_0Test.java:784)
	at org.apache.zookeeper.JUnit4ZKTestRunner$LoggedInvokeMethod.evaluate(JUnit4ZKTestRunner.java:79)


FAILED:  org.apache.zookeeper.test.FollowerResyncConcurrencyTest.testResyncByTxnlogThenDiffAfterFollowerCrashes

Error Message:
Should have same number of ephemerals in both followers expected:<108> but was:<120>

Stack Trace:
junit.framework.AssertionFailedError: Should have same number of ephemerals in both followers expected:<108> but was:<120>
	at org.apache.zookeeper.test.FollowerResyncConcurrencyTest.verifyState(FollowerResyncConcurrencyTest.java:661)
	at org.apache.zookeeper.test.FollowerResyncConcurrencyTest.followerResyncCrashTest(FollowerResyncConcurrencyTest.java:355)
	at org.apache.zookeeper.test.FollowerResyncConcurrencyTest.testResyncByTxnlogThenDiffAfterFollowerCrashes(FollowerResyncConcurrencyTest.java:191)
	at org.apache.zookeeper.JUnit4ZKTestRunner$LoggedInvokeMethod.evaluate(JUnit4ZKTestRunner.java:79)


FAILED:  org.apache.zookeeper.test.FollowerResyncConcurrencyTest.testResyncByDiffAfterFollowerCrashes

Error Message:
Should have same number of ephemerals in both followers expected:<2301> but was:<2400>

Stack Trace:
junit.framework.AssertionFailedError: Should have same number of ephemerals in both followers expected:<2301> but was:<2400>
	at org.apache.zookeeper.test.FollowerResyncConcurrencyTest.verifyState(FollowerResyncConcurrencyTest.java:661)
	at org.apache.zookeeper.test.FollowerResyncConcurrencyTest.testResyncByDiffAfterFollowerCrashes(FollowerResyncConcurrencyTest.java:531)
	at org.apache.zookeeper.JUnit4ZKTestRunner$LoggedInvokeMethod.evaluate(JUnit4ZKTestRunner.java:79)


FAILED:  org.apache.zookeeper.test.ReadOnlyModeTest.testSessionEstablishment

Error Message:
KeeperErrorCode = ConnectionLoss for /test

Stack Trace:
org.apache.zookeeper.KeeperException$ConnectionLossException: KeeperErrorCode = ConnectionLoss for /test
	at org.apache.zookeeper.KeeperException.create(KeeperException.java:99)
	at org.apache.zookeeper.KeeperException.create(KeeperException.java:51)
	at org.apache.zookeeper.ZooKeeper.create(ZooKeeper.java:1424)
	at org.apache.zookeeper.test.ReadOnlyModeTest.testSessionEstablishment(ReadOnlyModeTest.java:238)
	at org.apache.zookeeper.JUnit4ZKTestRunner$LoggedInvokeMethod.evaluate(JUnit4ZKTestRunner.java:79)
	at java.util.concurrent.FutureTask.run(FutureTask.java:262)
	at java.lang.Thread.run(Thread.java:745)



Success: ZOOKEEPER- PreCommit Build #372

Posted by Apache Jenkins Server <je...@builds.apache.org>.
Build: https://builds.apache.org/job/PreCommit-ZOOKEEPER-github-pr-build/372/

###################################################################################
########################## LAST 60 LINES OF THE CONSOLE ###########################
[...truncated 68.57 MB...]
     [exec] 
     [exec]     +1 @author.  The patch does not contain any @author tags.
     [exec] 
     [exec]     +1 tests included.  The patch appears to include 5 new or modified tests.
     [exec] 
     [exec]     +1 javadoc.  The javadoc tool did not generate any warning messages.
     [exec] 
     [exec]     +1 javac.  The applied patch does not increase the total number of javac compiler warnings.
     [exec] 
     [exec]     +1 findbugs.  The patch does not introduce any new Findbugs (version 3.0.1) warnings.
     [exec] 
     [exec]     +1 release audit.  The applied patch does not increase the total number of release audit warnings.
     [exec] 
     [exec]     +1 core tests.  The patch passed core unit tests.
     [exec] 
     [exec]     +1 contrib tests.  The patch passed contrib unit tests.
     [exec] 
     [exec] Test results: https://builds.apache.org/job/PreCommit-ZOOKEEPER-github-pr-build/372//testReport/
     [exec] Findbugs warnings: https://builds.apache.org/job/PreCommit-ZOOKEEPER-github-pr-build/372//artifact/trunk/build/test/findbugs/newPatchFindbugsWarnings.html
     [exec] Console output: https://builds.apache.org/job/PreCommit-ZOOKEEPER-github-pr-build/372//console
     [exec] 
     [exec] This message is automatically generated.
     [exec] 
     [exec] 
     [exec] ======================================================================
     [exec] ======================================================================
     [exec]     Adding comment to Jira.
     [exec] ======================================================================
     [exec] ======================================================================
     [exec] 
     [exec] 
     [exec] Comment added.
     [exec] c6648f16ced7285ddde9893208ad24a1faf42280 logged out
     [exec] 
     [exec] 
     [exec] ======================================================================
     [exec] ======================================================================
     [exec]     Finished build.
     [exec] ======================================================================
     [exec] ======================================================================
     [exec] 
     [exec] 
     [exec] mv: ‘/home/jenkins/jenkins-slave/workspace/PreCommit-ZOOKEEPER-github-pr-build/patchprocess’ and ‘/home/jenkins/jenkins-slave/workspace/PreCommit-ZOOKEEPER-github-pr-build/patchprocess’ are the same file

BUILD SUCCESSFUL
Total time: 18 minutes 54 seconds
Archiving artifacts
Setting JDK_1_7_LATEST__HOME=/home/jenkins/tools/java/latest1.7
Recording test results
Setting JDK_1_7_LATEST__HOME=/home/jenkins/tools/java/latest1.7
Setting JDK_1_7_LATEST__HOME=/home/jenkins/tools/java/latest1.7
[description-setter] Description set: ZOOKEEPER-2693
Putting comment on the pull request
Setting JDK_1_7_LATEST__HOME=/home/jenkins/tools/java/latest1.7
Email was triggered for: Success
Sending email for trigger: Success
Setting JDK_1_7_LATEST__HOME=/home/jenkins/tools/java/latest1.7
Setting JDK_1_7_LATEST__HOME=/home/jenkins/tools/java/latest1.7
Setting JDK_1_7_LATEST__HOME=/home/jenkins/tools/java/latest1.7



###################################################################################
############################## FAILED TESTS (if any) ##############################
All tests passed

Failed: ZOOKEEPER- PreCommit Build #371

Posted by Apache Jenkins Server <je...@builds.apache.org>.
Build: https://builds.apache.org/job/PreCommit-ZOOKEEPER-github-pr-build/371/

###################################################################################
########################## LAST 60 LINES OF THE CONSOLE ###########################
[...truncated 68.95 MB...]
     [exec] 
     [exec]     +1 javadoc.  The javadoc tool did not generate any warning messages.
     [exec] 
     [exec]     +1 javac.  The applied patch does not increase the total number of javac compiler warnings.
     [exec] 
     [exec]     +1 findbugs.  The patch does not introduce any new Findbugs (version 3.0.1) warnings.
     [exec] 
     [exec]     +1 release audit.  The applied patch does not increase the total number of release audit warnings.
     [exec] 
     [exec]     -1 core tests.  The patch failed core unit tests.
     [exec] 
     [exec]     +1 contrib tests.  The patch passed contrib unit tests.
     [exec] 
     [exec] Test results: https://builds.apache.org/job/PreCommit-ZOOKEEPER-github-pr-build/371//testReport/
     [exec] Findbugs warnings: https://builds.apache.org/job/PreCommit-ZOOKEEPER-github-pr-build/371//artifact/trunk/build/test/findbugs/newPatchFindbugsWarnings.html
     [exec] Console output: https://builds.apache.org/job/PreCommit-ZOOKEEPER-github-pr-build/371//console
     [exec] 
     [exec] This message is automatically generated.
     [exec] 
     [exec] 
     [exec] ======================================================================
     [exec] ======================================================================
     [exec]     Adding comment to Jira.
     [exec] ======================================================================
     [exec] ======================================================================
     [exec] 
     [exec] 
     [exec] Comment added.
     [exec] 306752d6dc34eb8b4b4629cffd49770258c516c1 logged out
     [exec] 
     [exec] 
     [exec] ======================================================================
     [exec] ======================================================================
     [exec]     Finished build.
     [exec] ======================================================================
     [exec] ======================================================================
     [exec] 
     [exec] 
     [exec] mv: ‘/home/jenkins/jenkins-slave/workspace/PreCommit-ZOOKEEPER-github-pr-build/patchprocess’ and ‘/home/jenkins/jenkins-slave/workspace/PreCommit-ZOOKEEPER-github-pr-build/patchprocess’ are the same file

BUILD FAILED
/home/jenkins/jenkins-slave/workspace/PreCommit-ZOOKEEPER-github-pr-build/build.xml:1635: exec returned: 1

Total time: 18 minutes 44 seconds
Build step 'Execute shell' marked build as failure
Archiving artifacts
Setting JDK_1_7_LATEST__HOME=/home/jenkins/tools/java/latest1.7
Compressed 576.06 KB of artifacts by 38.9% relative to #362
Recording test results
Setting JDK_1_7_LATEST__HOME=/home/jenkins/tools/java/latest1.7
Setting JDK_1_7_LATEST__HOME=/home/jenkins/tools/java/latest1.7
[description-setter] Description set: ZOOKEEPER-2693
Putting comment on the pull request
Setting JDK_1_7_LATEST__HOME=/home/jenkins/tools/java/latest1.7
Email was triggered for: Failure - Any
Sending email for trigger: Failure - Any
Setting JDK_1_7_LATEST__HOME=/home/jenkins/tools/java/latest1.7
Setting JDK_1_7_LATEST__HOME=/home/jenkins/tools/java/latest1.7
Setting JDK_1_7_LATEST__HOME=/home/jenkins/tools/java/latest1.7



###################################################################################
############################## FAILED TESTS (if any) ##############################
3 tests failed.
FAILED:  org.apache.zookeeper.server.quorum.StandaloneDisabledTest.startSingleServerTest

Error Message:
Timeout occurred. Please note the time in the report does not reflect the time until the timeout.

Stack Trace:
junit.framework.AssertionFailedError: Timeout occurred. Please note the time in the report does not reflect the time until the timeout.
	at java.lang.Thread.run(Thread.java:745)


FAILED:  org.apache.zookeeper.test.FourLetterWordsWhiteListTest.testFourLetterWordsAllDisabledByDefault

Error Message:
null

Stack Trace:
junit.framework.AssertionFailedError
	at org.apache.zookeeper.test.FourLetterWordsWhiteListTest.verifyExactMatch(FourLetterWordsWhiteListTest.java:160)
	at org.apache.zookeeper.test.FourLetterWordsWhiteListTest.verifyAllCommandsFail(FourLetterWordsWhiteListTest.java:136)
	at org.apache.zookeeper.test.FourLetterWordsWhiteListTest.testFourLetterWordsAllDisabledByDefault(FourLetterWordsWhiteListTest.java:52)
	at org.apache.zookeeper.JUnit4ZKTestRunner$LoggedInvokeMethod.evaluate(JUnit4ZKTestRunner.java:79)
	at java.util.concurrent.FutureTask.run(FutureTask.java:262)
	at java.lang.Thread.run(Thread.java:745)


FAILED:  org.apache.zookeeper.test.FourLetterWordsWhiteListTest.testFourLetterWordsInvalidConfiguration

Error Message:
null

Stack Trace:
junit.framework.AssertionFailedError
	at org.apache.zookeeper.test.FourLetterWordsWhiteListTest.verifyExactMatch(FourLetterWordsWhiteListTest.java:160)
	at org.apache.zookeeper.test.FourLetterWordsWhiteListTest.verifyAllCommandsFail(FourLetterWordsWhiteListTest.java:136)
	at org.apache.zookeeper.test.FourLetterWordsWhiteListTest.testFourLetterWordsInvalidConfiguration(FourLetterWordsWhiteListTest.java:116)
	at org.apache.zookeeper.JUnit4ZKTestRunner$LoggedInvokeMethod.evaluate(JUnit4ZKTestRunner.java:79)
	at java.util.concurrent.FutureTask.run(FutureTask.java:262)
	at java.lang.Thread.run(Thread.java:745)



Failed: ZOOKEEPER- PreCommit Build #370

Posted by Apache Jenkins Server <je...@builds.apache.org>.
Build: https://builds.apache.org/job/PreCommit-ZOOKEEPER-github-pr-build/370/

###################################################################################
########################## LAST 60 LINES OF THE CONSOLE ###########################
[...truncated 72.58 KB...]
warning: Cannot merge binary files: docs/zookeeperAdmin.pdf (HEAD vs. b26eaf3492a43821f648d8a8f87d8ac3488f1cef)
warning: Cannot merge binary files: docs/recipes.pdf (HEAD vs. b26eaf3492a43821f648d8a8f87d8ac3488f1cef)
warning: Cannot merge binary files: docs/linkmap.pdf (HEAD vs. b26eaf3492a43821f648d8a8f87d8ac3488f1cef)
warning: Cannot merge binary files: docs/javaExample.pdf (HEAD vs. b26eaf3492a43821f648d8a8f87d8ac3488f1cef)
warning: Cannot merge binary files: docs/index.pdf (HEAD vs. b26eaf3492a43821f648d8a8f87d8ac3488f1cef)
warning: Cannot merge binary files: docs/bookkeeperStream.pdf (HEAD vs. b26eaf3492a43821f648d8a8f87d8ac3488f1cef)
warning: Cannot merge binary files: docs/bookkeeperStarted.pdf (HEAD vs. b26eaf3492a43821f648d8a8f87d8ac3488f1cef)
warning: Cannot merge binary files: docs/bookkeeperProgrammer.pdf (HEAD vs. b26eaf3492a43821f648d8a8f87d8ac3488f1cef)
warning: Cannot merge binary files: docs/bookkeeperOverview.pdf (HEAD vs. b26eaf3492a43821f648d8a8f87d8ac3488f1cef)
warning: Cannot merge binary files: docs/bookkeeperConfig.pdf (HEAD vs. b26eaf3492a43821f648d8a8f87d8ac3488f1cef)

	at org.jenkinsci.plugins.gitclient.CliGitAPIImpl.launchCommandIn(CliGitAPIImpl.java:1784)
	at org.jenkinsci.plugins.gitclient.CliGitAPIImpl.launchCommandIn(CliGitAPIImpl.java:1757)
	at org.jenkinsci.plugins.gitclient.CliGitAPIImpl.launchCommandIn(CliGitAPIImpl.java:1753)
	at org.jenkinsci.plugins.gitclient.CliGitAPIImpl.launchCommand(CliGitAPIImpl.java:1409)
	at org.jenkinsci.plugins.gitclient.CliGitAPIImpl$3.execute(CliGitAPIImpl.java:588)
	at org.jenkinsci.plugins.gitclient.AbstractGitAPIImpl.merge(AbstractGitAPIImpl.java:86)
	at org.jenkinsci.plugins.gitclient.CliGitAPIImpl.merge(CliGitAPIImpl.java:64)
	at sun.reflect.NativeMethodAccessorImpl.invoke0(Native Method)
	at sun.reflect.NativeMethodAccessorImpl.invoke(NativeMethodAccessorImpl.java:57)
	at sun.reflect.DelegatingMethodAccessorImpl.invoke(DelegatingMethodAccessorImpl.java:43)
	at java.lang.reflect.Method.invoke(Method.java:606)
	at hudson.remoting.RemoteInvocationHandler$RPCRequest.perform(RemoteInvocationHandler.java:894)
	at hudson.remoting.RemoteInvocationHandler$RPCRequest.call(RemoteInvocationHandler.java:869)
	at hudson.remoting.RemoteInvocationHandler$RPCRequest.call(RemoteInvocationHandler.java:828)
	at hudson.remoting.UserRequest.perform(UserRequest.java:153)
	at hudson.remoting.UserRequest.perform(UserRequest.java:50)
	at hudson.remoting.Request$2.run(Request.java:336)
	at hudson.remoting.InterceptingExecutorService$1.call(InterceptingExecutorService.java:68)
	at java.util.concurrent.FutureTask.run(FutureTask.java:262)
	at java.util.concurrent.ThreadPoolExecutor.runWorker(ThreadPoolExecutor.java:1145)
	at java.util.concurrent.ThreadPoolExecutor$Worker.run(ThreadPoolExecutor.java:615)
	at java.lang.Thread.run(Thread.java:745)
	at ......remote call to H0(Native Method)
	at hudson.remoting.Channel.attachCallSiteStackTrace(Channel.java:1537)
	at hudson.remoting.UserResponse.retrieve(UserRequest.java:253)
	at hudson.remoting.Channel.call(Channel.java:822)
	at hudson.remoting.RemoteInvocationHandler.invoke(RemoteInvocationHandler.java:256)
	at com.sun.proxy.$Proxy95.merge(Unknown Source)
	at org.jenkinsci.plugins.gitclient.RemoteGitImpl.merge(RemoteGitImpl.java:434)
	at com.cloudbees.jenkins.plugins.git.vmerge.BuildChooserImpl.getCandidateRevisions(BuildChooserImpl.java:107)
	at hudson.plugins.git.GitSCM.determineRevisionToBuild(GitSCM.java:995)
	at hudson.plugins.git.GitSCM.checkout(GitSCM.java:1098)
	at hudson.scm.SCM.checkout(SCM.java:495)
	at hudson.model.AbstractProject.checkout(AbstractProject.java:1278)
	at hudson.model.AbstractBuild$AbstractBuildExecution.defaultCheckout(AbstractBuild.java:604)
	at jenkins.scm.SCMCheckoutStrategy.checkout(SCMCheckoutStrategy.java:86)
	at hudson.model.AbstractBuild$AbstractBuildExecution.run(AbstractBuild.java:529)
	at hudson.model.Run.execute(Run.java:1728)
	at hudson.model.FreeStyleBuild.run(FreeStyleBuild.java:43)
	at hudson.model.ResourceController.execute(ResourceController.java:98)
	at hudson.model.Executor.run(Executor.java:404)
Archiving artifacts
Recording test results
ERROR: Step ?Publish JUnit test result report? failed: No test report files were found. Configuration error?
[description-setter] Could not determine description.
Putting comment on the pull request
Email was triggered for: Failure - Any
Sending email for trigger: Failure - Any



###################################################################################
############################## FAILED TESTS (if any) ##############################
No tests ran.

Failed: ZOOKEEPER- PreCommit Build #369

Posted by Apache Jenkins Server <je...@builds.apache.org>.
Build: https://builds.apache.org/job/PreCommit-ZOOKEEPER-github-pr-build/369/

###################################################################################
########################## LAST 60 LINES OF THE CONSOLE ###########################
[...truncated 2.04 KB...]
	at hudson.remoting.RemoteInvocationHandler$RPCRequest.call(RemoteInvocationHandler.java:828)
	at hudson.remoting.UserRequest.perform(UserRequest.java:153)
	at hudson.remoting.UserRequest.perform(UserRequest.java:50)
	at hudson.remoting.Request$2.run(Request.java:336)
	at hudson.remoting.InterceptingExecutorService$1.call(InterceptingExecutorService.java:68)
	at java.util.concurrent.FutureTask.run(FutureTask.java:262)
	at java.util.concurrent.ThreadPoolExecutor.runWorker(ThreadPoolExecutor.java:1145)
	at java.util.concurrent.ThreadPoolExecutor$Worker.run(ThreadPoolExecutor.java:615)
	at java.lang.Thread.run(Thread.java:745)
	at ......remote call to H7(Native Method)
	at hudson.remoting.Channel.attachCallSiteStackTrace(Channel.java:1537)
	at hudson.remoting.UserResponse.retrieve(UserRequest.java:253)
	at hudson.remoting.Channel.call(Channel.java:822)
	at hudson.remoting.RemoteInvocationHandler.invoke(RemoteInvocationHandler.java:256)
	at com.sun.proxy.$Proxy95.checkoutBranch(Unknown Source)
	at org.jenkinsci.plugins.gitclient.RemoteGitImpl.checkoutBranch(RemoteGitImpl.java:323)
	at com.cloudbees.jenkins.plugins.git.vmerge.BuildChooserImpl.getCandidateRevisions(BuildChooserImpl.java:78)
	at hudson.plugins.git.GitSCM.determineRevisionToBuild(GitSCM.java:995)
	at hudson.plugins.git.GitSCM.checkout(GitSCM.java:1098)
	at hudson.scm.SCM.checkout(SCM.java:495)
	at hudson.model.AbstractProject.checkout(AbstractProject.java:1278)
	at hudson.model.AbstractBuild$AbstractBuildExecution.defaultCheckout(AbstractBuild.java:604)
	at jenkins.scm.SCMCheckoutStrategy.checkout(SCMCheckoutStrategy.java:86)
	at hudson.model.AbstractBuild$AbstractBuildExecution.run(AbstractBuild.java:529)
	at hudson.model.Run.execute(Run.java:1728)
	at hudson.model.FreeStyleBuild.run(FreeStyleBuild.java:43)
	at hudson.model.ResourceController.execute(ResourceController.java:98)
	at hudson.model.Executor.run(Executor.java:404)
Caused by: hudson.plugins.git.GitException: Command "git checkout -f origin/trunk" returned status code 1:
stdout: 
stderr: error: pathspec 'origin/trunk' did not match any file(s) known to git.

	at org.jenkinsci.plugins.gitclient.CliGitAPIImpl.launchCommandIn(CliGitAPIImpl.java:1784)
	at org.jenkinsci.plugins.gitclient.CliGitAPIImpl.access$800(CliGitAPIImpl.java:64)
	at org.jenkinsci.plugins.gitclient.CliGitAPIImpl$9.execute(CliGitAPIImpl.java:2037)
	at org.jenkinsci.plugins.gitclient.AbstractGitAPIImpl.checkoutBranch(AbstractGitAPIImpl.java:81)
	at org.jenkinsci.plugins.gitclient.CliGitAPIImpl.checkoutBranch(CliGitAPIImpl.java:64)
	at sun.reflect.NativeMethodAccessorImpl.invoke0(Native Method)
	at sun.reflect.NativeMethodAccessorImpl.invoke(NativeMethodAccessorImpl.java:57)
	at sun.reflect.DelegatingMethodAccessorImpl.invoke(DelegatingMethodAccessorImpl.java:43)
	at java.lang.reflect.Method.invoke(Method.java:606)
	at hudson.remoting.RemoteInvocationHandler$RPCRequest.perform(RemoteInvocationHandler.java:894)
	at hudson.remoting.RemoteInvocationHandler$RPCRequest.call(RemoteInvocationHandler.java:869)
	at hudson.remoting.RemoteInvocationHandler$RPCRequest.call(RemoteInvocationHandler.java:828)
	at hudson.remoting.UserRequest.perform(UserRequest.java:153)
	at hudson.remoting.UserRequest.perform(UserRequest.java:50)
	at hudson.remoting.Request$2.run(Request.java:336)
	at hudson.remoting.InterceptingExecutorService$1.call(InterceptingExecutorService.java:68)
	at java.util.concurrent.FutureTask.run(FutureTask.java:262)
	at java.util.concurrent.ThreadPoolExecutor.runWorker(ThreadPoolExecutor.java:1145)
	at java.util.concurrent.ThreadPoolExecutor$Worker.run(ThreadPoolExecutor.java:615)
	at java.lang.Thread.run(Thread.java:745)
Archiving artifacts
Recording test results
ERROR: Step ?Publish JUnit test result report? failed: No test report files were found. Configuration error?
[description-setter] Could not determine description.
Putting comment on the pull request
Email was triggered for: Failure - Any
Sending email for trigger: Failure - Any



###################################################################################
############################## FAILED TESTS (if any) ##############################
No tests ran.

Failed: ZOOKEEPER- PreCommit Build #368

Posted by Apache Jenkins Server <je...@builds.apache.org>.
Build: https://builds.apache.org/job/PreCommit-ZOOKEEPER-github-pr-build/368/

###################################################################################
########################## LAST 60 LINES OF THE CONSOLE ###########################
[...truncated 69.48 MB...]
     [exec] 
     [exec]     +1 javadoc.  The javadoc tool did not generate any warning messages.
     [exec] 
     [exec]     +1 javac.  The applied patch does not increase the total number of javac compiler warnings.
     [exec] 
     [exec]     +1 findbugs.  The patch does not introduce any new Findbugs (version 3.0.1) warnings.
     [exec] 
     [exec]     +1 release audit.  The applied patch does not increase the total number of release audit warnings.
     [exec] 
     [exec]     -1 core tests.  The patch failed core unit tests.
     [exec] 
     [exec]     +1 contrib tests.  The patch passed contrib unit tests.
     [exec] 
     [exec] Test results: https://builds.apache.org/job/PreCommit-ZOOKEEPER-github-pr-build/368//testReport/
     [exec] Findbugs warnings: https://builds.apache.org/job/PreCommit-ZOOKEEPER-github-pr-build/368//artifact/trunk/build/test/findbugs/newPatchFindbugsWarnings.html
     [exec] Console output: https://builds.apache.org/job/PreCommit-ZOOKEEPER-github-pr-build/368//console
     [exec] 
     [exec] This message is automatically generated.
     [exec] 
     [exec] 
     [exec] ======================================================================
     [exec] ======================================================================
     [exec]     Adding comment to Jira.
     [exec] ======================================================================
     [exec] ======================================================================
     [exec] 
     [exec] 
     [exec] Comment added.
     [exec] 1b754a5c68cd9279ab59f10aa94c83153db3616a logged out
     [exec] 
     [exec] 
     [exec] ======================================================================
     [exec] ======================================================================
     [exec]     Finished build.
     [exec] ======================================================================
     [exec] ======================================================================
     [exec] 
     [exec] 
     [exec] mv: '/home/jenkins/jenkins-slave/workspace/PreCommit-ZOOKEEPER-github-pr-build/patchprocess' and '/home/jenkins/jenkins-slave/workspace/PreCommit-ZOOKEEPER-github-pr-build/patchprocess' are the same file

BUILD FAILED
/home/jenkins/jenkins-slave/workspace/PreCommit-ZOOKEEPER-github-pr-build/build.xml:1635: exec returned: 1

Total time: 20 minutes 6 seconds
Build step 'Execute shell' marked build as failure
Archiving artifacts
Setting JDK_1_7_LATEST__HOME=/home/jenkins/tools/java/latest1.7
Compressed 576.07 KB of artifacts by 38.9% relative to #362
Recording test results
Setting JDK_1_7_LATEST__HOME=/home/jenkins/tools/java/latest1.7
Setting JDK_1_7_LATEST__HOME=/home/jenkins/tools/java/latest1.7
[description-setter] Description set: ZOOKEEPER-2693
Putting comment on the pull request
Setting JDK_1_7_LATEST__HOME=/home/jenkins/tools/java/latest1.7
Email was triggered for: Failure - Any
Sending email for trigger: Failure - Any
Setting JDK_1_7_LATEST__HOME=/home/jenkins/tools/java/latest1.7
Setting JDK_1_7_LATEST__HOME=/home/jenkins/tools/java/latest1.7
Setting JDK_1_7_LATEST__HOME=/home/jenkins/tools/java/latest1.7



###################################################################################
############################## FAILED TESTS (if any) ##############################
1 tests failed.
FAILED:  org.apache.zookeeper.server.quorum.Zab1_0Test.testNormalObserverRun

Error Message:
Timeout occurred. Please note the time in the report does not reflect the time until the timeout.

Stack Trace:
junit.framework.AssertionFailedError: Timeout occurred. Please note the time in the report does not reflect the time until the timeout.
	at java.lang.Thread.run(Thread.java:745)



Failed: ZOOKEEPER- PreCommit Build #367

Posted by Apache Jenkins Server <je...@builds.apache.org>.
Build: https://builds.apache.org/job/PreCommit-ZOOKEEPER-github-pr-build/367/

###################################################################################
########################## LAST 60 LINES OF THE CONSOLE ###########################
[...truncated 1.29 KB...]
  Getting sizes
    Done: 7
  Compressing objects
    Done: 7489
  Writing objects
    Done: 8
  remote: Updating references
Merging refs/tags/changes/367
 > git rev-parse refs/tags/changes/367^{commit} # timeout=10
 > git merge 12966a6b8303b9eb6ef67f95ad7f564dcc8e4d09 # timeout=10
 > git rev-parse branch-3.4^{commit} # timeout=10
Checking out Revision 12966a6b8303b9eb6ef67f95ad7f564dcc8e4d09 (branch-3.4)
 > git config core.sparsecheckout # timeout=10
 > git checkout -f 12966a6b8303b9eb6ef67f95ad7f564dcc8e4d09
 > git rev-parse origin/branch-3.4^{commit} # timeout=10
 > git rev-list 373b82bab843cc84c22b99f6511f8fea974fd2b4 # timeout=10
No emails were triggered.
Setting JDK_1_7_LATEST__HOME=/home/jenkins/tools/java/latest1.7
[PreCommit-ZOOKEEPER-github-pr-build] $ /bin/bash /tmp/hudson5804253824358838553.sh
/home/jenkins/tools/java/latest1.7/bin/java
java version "1.7.0_80"
Java(TM) SE Runtime Environment (build 1.7.0_80-b15)
Java HotSpot(TM) 64-Bit Server VM (build 24.80-b11, mixed mode)
core file size          (blocks, -c) 0
data seg size           (kbytes, -d) unlimited
scheduling priority             (-e) 0
file size               (blocks, -f) unlimited
pending signals                 (-i) 386178
max locked memory       (kbytes, -l) 64
max memory size         (kbytes, -m) unlimited
open files                      (-n) 60000
pipe size            (512 bytes, -p) 8
POSIX message queues     (bytes, -q) 819200
real-time priority              (-r) 0
stack size              (kbytes, -s) 8192
cpu time               (seconds, -t) unlimited
max user processes              (-u) 10240
virtual memory          (kbytes, -v) unlimited
file locks                      (-x) unlimited
Buildfile: /home/jenkins/jenkins-slave/workspace/PreCommit-ZOOKEEPER-github-pr-build/build.xml

BUILD FAILED
Target "qa-test-pullrequest" does not exist in the project "ZooKeeper". 

Total time: 0 seconds
Build step 'Execute shell' marked build as failure
Archiving artifacts
Setting JDK_1_7_LATEST__HOME=/home/jenkins/tools/java/latest1.7
Recording test results
Setting JDK_1_7_LATEST__HOME=/home/jenkins/tools/java/latest1.7
ERROR: Step ?Publish JUnit test result report? failed: No test report files were found. Configuration error?
[description-setter] Could not determine description.
Putting comment on the pull request
Setting JDK_1_7_LATEST__HOME=/home/jenkins/tools/java/latest1.7
Email was triggered for: Failure - Any
Sending email for trigger: Failure - Any
Setting JDK_1_7_LATEST__HOME=/home/jenkins/tools/java/latest1.7
Setting JDK_1_7_LATEST__HOME=/home/jenkins/tools/java/latest1.7
Setting JDK_1_7_LATEST__HOME=/home/jenkins/tools/java/latest1.7



###################################################################################
############################## FAILED TESTS (if any) ##############################
No tests ran.

Failed: ZOOKEEPER- PreCommit Build #366

Posted by Apache Jenkins Server <je...@builds.apache.org>.
Build: https://builds.apache.org/job/PreCommit-ZOOKEEPER-github-pr-build/366/

###################################################################################
########################## LAST 60 LINES OF THE CONSOLE ###########################
[...truncated 68.30 MB...]
     [exec]     +1 tests included.  The patch appears to include 5 new or modified tests.
     [exec] 
     [exec]     +1 javadoc.  The javadoc tool did not generate any warning messages.
     [exec] 
     [exec]     +1 javac.  The applied patch does not increase the total number of javac compiler warnings.
     [exec] 
     [exec]     +1 findbugs.  The patch does not introduce any new Findbugs (version 3.0.1) warnings.
     [exec] 
     [exec]     +1 release audit.  The applied patch does not increase the total number of release audit warnings.
     [exec] 
     [exec]     -1 core tests.  The patch failed core unit tests.
     [exec] 
     [exec]     +1 contrib tests.  The patch passed contrib unit tests.
     [exec] 
     [exec] Test results: https://builds.apache.org/job/PreCommit-ZOOKEEPER-github-pr-build/366//testReport/
     [exec] Findbugs warnings: https://builds.apache.org/job/PreCommit-ZOOKEEPER-github-pr-build/366//artifact/trunk/build/test/findbugs/newPatchFindbugsWarnings.html
     [exec] Console output: https://builds.apache.org/job/PreCommit-ZOOKEEPER-github-pr-build/366//console
     [exec] 
     [exec] This message is automatically generated.
     [exec] 
     [exec] 
     [exec] ======================================================================
     [exec] ======================================================================
     [exec]     Adding comment to Jira.
     [exec] ======================================================================
     [exec] ======================================================================
     [exec] 
     [exec] 
     [exec] Comment added.
     [exec] aa8629874527b4910e2e8877e2ab47d9e3f772ba logged out
     [exec] 
     [exec] 
     [exec] ======================================================================
     [exec] ======================================================================
     [exec]     Finished build.
     [exec] ======================================================================
     [exec] ======================================================================
     [exec] 
     [exec] 
     [exec] mv: '/home/jenkins/jenkins-slave/workspace/PreCommit-ZOOKEEPER-github-pr-build/patchprocess' and '/home/jenkins/jenkins-slave/workspace/PreCommit-ZOOKEEPER-github-pr-build/patchprocess' are the same file

BUILD FAILED
/home/jenkins/jenkins-slave/workspace/PreCommit-ZOOKEEPER-github-pr-build/build.xml:1635: exec returned: 1

Total time: 16 minutes 4 seconds
Build step 'Execute shell' marked build as failure
Archiving artifacts
Setting JDK_1_7_LATEST__HOME=/home/jenkins/tools/java/latest1.7
Recording test results
Setting JDK_1_7_LATEST__HOME=/home/jenkins/tools/java/latest1.7
Setting JDK_1_7_LATEST__HOME=/home/jenkins/tools/java/latest1.7
[description-setter] Description set: ZOOKEEPER-2693
Putting comment on the pull request
Setting JDK_1_7_LATEST__HOME=/home/jenkins/tools/java/latest1.7
Email was triggered for: Failure - Any
Sending email for trigger: Failure - Any
Setting JDK_1_7_LATEST__HOME=/home/jenkins/tools/java/latest1.7
Setting JDK_1_7_LATEST__HOME=/home/jenkins/tools/java/latest1.7
Setting JDK_1_7_LATEST__HOME=/home/jenkins/tools/java/latest1.7



###################################################################################
############################## FAILED TESTS (if any) ##############################
All tests passed

Failed: ZOOKEEPER- PreCommit Build #365

Posted by Apache Jenkins Server <je...@builds.apache.org>.
Build: https://builds.apache.org/job/PreCommit-ZOOKEEPER-github-pr-build/365/

###################################################################################
########################## LAST 60 LINES OF THE CONSOLE ###########################
[...truncated 70.72 MB...]
     [exec] 
     [exec]     +1 javadoc.  The javadoc tool did not generate any warning messages.
     [exec] 
     [exec]     +1 javac.  The applied patch does not increase the total number of javac compiler warnings.
     [exec] 
     [exec]     -1 findbugs.  The patch appears to introduce 1 new Findbugs (version 3.0.1) warnings.
     [exec] 
     [exec]     +1 release audit.  The applied patch does not increase the total number of release audit warnings.
     [exec] 
     [exec]     -1 core tests.  The patch failed core unit tests.
     [exec] 
     [exec]     +1 contrib tests.  The patch passed contrib unit tests.
     [exec] 
     [exec] Test results: https://builds.apache.org/job/PreCommit-ZOOKEEPER-github-pr-build/365//testReport/
     [exec] Findbugs warnings: https://builds.apache.org/job/PreCommit-ZOOKEEPER-github-pr-build/365//artifact/trunk/build/test/findbugs/newPatchFindbugsWarnings.html
     [exec] Console output: https://builds.apache.org/job/PreCommit-ZOOKEEPER-github-pr-build/365//console
     [exec] 
     [exec] This message is automatically generated.
     [exec] 
     [exec] 
     [exec] ======================================================================
     [exec] ======================================================================
     [exec]     Adding comment to Jira.
     [exec] ======================================================================
     [exec] ======================================================================
     [exec] 
     [exec] 
     [exec] Comment added.
     [exec] 7c7f75308ba7402cb131e2bc3b700ad13835bb62 logged out
     [exec] 
     [exec] 
     [exec] ======================================================================
     [exec] ======================================================================
     [exec]     Finished build.
     [exec] ======================================================================
     [exec] ======================================================================
     [exec] 
     [exec] 
     [exec] mv: '/home/jenkins/jenkins-slave/workspace/PreCommit-ZOOKEEPER-github-pr-build/patchprocess' and '/home/jenkins/jenkins-slave/workspace/PreCommit-ZOOKEEPER-github-pr-build/patchprocess' are the same file

BUILD FAILED
/home/jenkins/jenkins-slave/workspace/PreCommit-ZOOKEEPER-github-pr-build/build.xml:1635: exec returned: 2

Total time: 14 minutes 50 seconds
Build step 'Execute shell' marked build as failure
Archiving artifacts
Setting JDK_1_7_LATEST__HOME=/home/jenkins/tools/java/latest1.7
Compressed 579.54 KB of artifacts by 49.7% relative to #362
Recording test results
Setting JDK_1_7_LATEST__HOME=/home/jenkins/tools/java/latest1.7
Setting JDK_1_7_LATEST__HOME=/home/jenkins/tools/java/latest1.7
[description-setter] Description set: ZOOKEEPER-2700
Putting comment on the pull request
Setting JDK_1_7_LATEST__HOME=/home/jenkins/tools/java/latest1.7
Email was triggered for: Failure - Any
Sending email for trigger: Failure - Any
Setting JDK_1_7_LATEST__HOME=/home/jenkins/tools/java/latest1.7
Setting JDK_1_7_LATEST__HOME=/home/jenkins/tools/java/latest1.7
Setting JDK_1_7_LATEST__HOME=/home/jenkins/tools/java/latest1.7



###################################################################################
############################## FAILED TESTS (if any) ##############################
5 tests failed.
FAILED:  org.apache.zookeeper.server.quorum.StandaloneDisabledTest.startSingleServerTest

Error Message:
client could not connect to reestablished quorum: giving up after 30+ seconds.

Stack Trace:
junit.framework.AssertionFailedError: client could not connect to reestablished quorum: giving up after 30+ seconds.
	at org.apache.zookeeper.test.ReconfigTest.reconfig(ReconfigTest.java:93)
	at org.apache.zookeeper.server.quorum.StandaloneDisabledTest.testReconfig(StandaloneDisabledTest.java:233)
	at org.apache.zookeeper.server.quorum.StandaloneDisabledTest.startSingleServerTest(StandaloneDisabledTest.java:109)
	at org.apache.zookeeper.JUnit4ZKTestRunner$LoggedInvokeMethod.evaluate(JUnit4ZKTestRunner.java:79)


FAILED:  org.apache.zookeeper.test.WatchEventWhenAutoResetTest.testNodeDataChanged

Error Message:
expected:<NodeDataChanged> but was:<NodeDeleted>

Stack Trace:
junit.framework.AssertionFailedError: expected:<NodeDataChanged> but was:<NodeDeleted>
	at org.apache.zookeeper.test.WatchEventWhenAutoResetTest$EventsWatcher.assertEvent(WatchEventWhenAutoResetTest.java:67)
	at org.apache.zookeeper.test.WatchEventWhenAutoResetTest.testNodeDataChanged(WatchEventWhenAutoResetTest.java:117)
	at org.apache.zookeeper.JUnit4ZKTestRunner$LoggedInvokeMethod.evaluate(JUnit4ZKTestRunner.java:79)


FAILED:  org.apache.zookeeper.server.quorum.Zab1_0Test.testNormalFollowerRunWithDiff

Error Message:

followerZooKeeperServer.takeSnapshot();
Never wanted here:
-> at org.apache.zookeeper.server.quorum.Zab1_0Test$5.converseWithFollower(Zab1_0Test.java:883)
But invoked here:
-> at org.apache.zookeeper.server.SyncRequestProcessor$1.run(SyncRequestProcessor.java:132)


Stack Trace:
junit.framework.AssertionFailedError: 
followerZooKeeperServer.takeSnapshot();
Never wanted here:
-> at org.apache.zookeeper.server.quorum.Zab1_0Test$5.converseWithFollower(Zab1_0Test.java:883)
But invoked here:
-> at org.apache.zookeeper.server.SyncRequestProcessor$1.run(SyncRequestProcessor.java:132)

	at org.apache.zookeeper.server.quorum.Zab1_0Test$5.converseWithFollower(Zab1_0Test.java:883)
	at org.apache.zookeeper.server.quorum.Zab1_0Test.testFollowerConversation(Zab1_0Test.java:517)
	at org.apache.zookeeper.server.quorum.Zab1_0Test.testNormalFollowerRunWithDiff(Zab1_0Test.java:784)
	at org.apache.zookeeper.JUnit4ZKTestRunner$LoggedInvokeMethod.evaluate(JUnit4ZKTestRunner.java:79)


FAILED:  org.apache.zookeeper.test.FollowerResyncConcurrencyTest.testResyncByTxnlogThenDiffAfterFollowerCrashes

Error Message:
Should have same number of ephemerals in both followers expected:<7988> but was:<16001>

Stack Trace:
junit.framework.AssertionFailedError: Should have same number of ephemerals in both followers expected:<7988> but was:<16001>
	at org.apache.zookeeper.test.FollowerResyncConcurrencyTest.verifyState(FollowerResyncConcurrencyTest.java:661)
	at org.apache.zookeeper.test.FollowerResyncConcurrencyTest.followerResyncCrashTest(FollowerResyncConcurrencyTest.java:355)
	at org.apache.zookeeper.test.FollowerResyncConcurrencyTest.testResyncByTxnlogThenDiffAfterFollowerCrashes(FollowerResyncConcurrencyTest.java:191)
	at org.apache.zookeeper.JUnit4ZKTestRunner$LoggedInvokeMethod.evaluate(JUnit4ZKTestRunner.java:79)


FAILED:  org.apache.zookeeper.test.FollowerResyncConcurrencyTest.testResyncByDiffAfterFollowerCrashes

Error Message:
Should have same number of ephemerals in both followers expected:<2300> but was:<2400>

Stack Trace:
junit.framework.AssertionFailedError: Should have same number of ephemerals in both followers expected:<2300> but was:<2400>
	at org.apache.zookeeper.test.FollowerResyncConcurrencyTest.verifyState(FollowerResyncConcurrencyTest.java:661)
	at org.apache.zookeeper.test.FollowerResyncConcurrencyTest.testResyncByDiffAfterFollowerCrashes(FollowerResyncConcurrencyTest.java:531)
	at org.apache.zookeeper.JUnit4ZKTestRunner$LoggedInvokeMethod.evaluate(JUnit4ZKTestRunner.java:79)