You are viewing a plain text version of this content. The canonical link for it is here.
Posted to yarn-dev@hadoop.apache.org by Apache Jenkins Server <je...@builds.apache.org> on 2015/05/01 04:13:12 UTC
Failed: YARN-3539 PreCommit Build #7563
Jira: https://issues.apache.org/jira/browse/YARN-3539
Build: https://builds.apache.org/job/PreCommit-YARN-Build/7563/
###################################################################################
########################## LAST 60 LINES OF THE CONSOLE ###########################
Started by remote host 127.0.0.1
Building remotely on H6 (Mapreduce Falcon Hadoop Pig Zookeeper Tez Hdfs) in workspace /home/jenkins/jenkins-slave/workspace/PreCommit-YARN-Build
> git rev-parse --is-inside-work-tree # timeout=10
Fetching changes from the remote Git repository
> git config remote.origin.url https://git-wip-us.apache.org/repos/asf/hadoop.git # timeout=10
Fetching upstream changes from https://git-wip-us.apache.org/repos/asf/hadoop.git
> git --version # timeout=10
> git fetch --tags --progress https://git-wip-us.apache.org/repos/asf/hadoop.git +refs/heads/*:refs/remotes/origin/*
> git rev-parse refs/remotes/origin/trunk^{commit} # timeout=10
> git rev-parse refs/remotes/origin/origin/trunk^{commit} # timeout=10
Checking out Revision 87e997823581790cce8d82d20e5e82ef9dd80670 (refs/remotes/origin/trunk)
> git config core.sparsecheckout # timeout=10
> git checkout -f 87e997823581790cce8d82d20e5e82ef9dd80670
> git rev-list 87e997823581790cce8d82d20e5e82ef9dd80670 # timeout=10
Cleaning workspace
> git rev-parse --verify HEAD # timeout=10
Resetting working tree
> git reset --hard # timeout=10
> git clean -fdx # timeout=10
No emails were triggered.
[PreCommit-YARN-Build] $ /bin/bash /tmp/hudson2128897441998691853.sh
============================================================================
============================================================================
Bootstrapping test harness
============================================================================
============================================================================
Running in Jenkins mode
ERROR: http://issues.apache.org/jira/secure/attachment/12729630/timeline_get_api_examples.txt is not a patch file.
============================================================================
============================================================================
Finished build.
============================================================================
============================================================================
Build step 'Execute shell' marked build as failure
Archiving artifacts
[description-setter] Could not determine description.
Recording test results
Email was triggered for: Failure
Sending email for trigger: Failure
###################################################################################
############################## FAILED TESTS (if any) ##############################
No tests ran.
Failed: YARN-3534 PreCommit Build #7564
Posted by Apache Jenkins Server <je...@builds.apache.org>.
Jira: https://issues.apache.org/jira/browse/YARN-3534
Build: https://builds.apache.org/job/PreCommit-YARN-Build/7564/
###################################################################################
########################## LAST 60 LINES OF THE CONSOLE ###########################
[...truncated 467 lines...]
| +1 | findbugs | 4m 4s | The patch does not introduce any
| | | | new Findbugs (version 2.0.3)
| | | | warnings.
| +1 | common tests | 23m 7s | Tests passed in hadoop-common.
| +1 | yarn tests | 0m 29s | Tests passed in hadoop-yarn-api.
| -1 | yarn tests | 5m 47s | Tests failed in
| | | | hadoop-yarn-server-nodemanager.
| | | 90m 58s |
Reason | Tests
Failed unit tests | hadoop.yarn.server.nodemanager.containermanager.localizer.TestResourceLocalizationService
|| Subsystem || Report/Notes ||
============================================================================
| Patch URL | http://issues.apache.org/jira/secure/attachment/12729676/YARN-3534-5.patch |
| Optional Tests | shellcheck javadoc javac unit findbugs checkstyle |
| git revision | trunk / 98a6176 |
| Release Audit | /home/jenkins/jenkins-slave/workspace/PreCommit-YARN-Build/../patchprocess/patchReleaseAuditProblems.txt |
| checkstyle | /home/jenkins/jenkins-slave/workspace/PreCommit-YARN-Build/../patchprocess/checkstyle-result-diff.txt |
| hadoop-common test log | /home/jenkins/jenkins-slave/workspace/PreCommit-YARN-Build/../patchprocess/testrun_hadoop-common.txt |
| hadoop-yarn-api test log | /home/jenkins/jenkins-slave/workspace/PreCommit-YARN-Build/../patchprocess/testrun_hadoop-yarn-api.txt |
| hadoop-yarn-server-nodemanager test log | /home/jenkins/jenkins-slave/workspace/PreCommit-YARN-Build/../patchprocess/testrun_hadoop-yarn-server-nodemanager.txt |
| Test Results | https://builds.apache.org/job/PreCommit-YARN-Build/7564/testReport/ |
| Java | 1.7.0_55 |
| uname | Linux asf907.gq1.ygridcore.net 3.13.0-36-lowlatency #63-Ubuntu SMP PREEMPT Wed Sep 3 21:56:12 UTC 2014 x86_64 x86_64 x86_64 GNU/Linux |
============================================================================
============================================================================
Adding comment to JIRA
============================================================================
============================================================================
Comment added.
9c8578e1035421d7ee2aadefc88b98b53ec91a6e logged out
============================================================================
============================================================================
Finished build.
============================================================================
============================================================================
Build step 'Execute shell' marked build as failure
Archiving artifacts
Sending artifact delta relative to PreCommit-YARN-Build #7562
Archived 32 artifacts
Archive block size is 32768
Received 123 blocks and 141672734 bytes
Compression is 2.8%
Took 28 sec
[description-setter] Could not determine description.
Recording test results
Email was triggered for: Failure
Sending email for trigger: Failure
###################################################################################
############################## FAILED TESTS (if any) ##############################
1 tests failed.
FAILED: org.apache.hadoop.yarn.server.nodemanager.containermanager.localizer.TestResourceLocalizationService.testPublicResourceInitializesLocalDir
Error Message:
Unable to delete directory target/org.apache.hadoop.yarn.server.nodemanager.containermanager.localizer.TestResourceLocalizationService/0/filecache/10_tmp.
Stack Trace:
java.io.IOException: Unable to delete directory target/org.apache.hadoop.yarn.server.nodemanager.containermanager.localizer.TestResourceLocalizationService/0/filecache/10_tmp.
at org.apache.commons.io.FileUtils.deleteDirectory(FileUtils.java:1541)
at org.apache.commons.io.FileUtils.forceDelete(FileUtils.java:2270)
at org.apache.commons.io.FileUtils.cleanDirectory(FileUtils.java:1653)
at org.apache.commons.io.FileUtils.deleteDirectory(FileUtils.java:1535)
at org.apache.commons.io.FileUtils.forceDelete(FileUtils.java:2270)
at org.apache.commons.io.FileUtils.cleanDirectory(FileUtils.java:1653)
at org.apache.commons.io.FileUtils.deleteDirectory(FileUtils.java:1535)
at org.apache.commons.io.FileUtils.forceDelete(FileUtils.java:2270)
at org.apache.commons.io.FileUtils.cleanDirectory(FileUtils.java:1653)
at org.apache.commons.io.FileUtils.deleteDirectory(FileUtils.java:1535)
at org.apache.hadoop.yarn.server.nodemanager.containermanager.localizer.TestResourceLocalizationService.cleanup(TestResourceLocalizationService.java:187)