You are viewing a plain text version of this content. The canonical link for it is here.
Posted to builds@solr.apache.org by Apache Jenkins Server <je...@builds.apache.org> on 2026/07/28 00:13:01 UTC

[JENKINS] Solr » Solr-Test-9.x - Build # 11314 - Still Unstable!

Build: https://ci-builds.apache.org/job/Solr/job/Solr-Test-9.x/11314/

1 tests failed.
FAILED:  org.apache.solr.cloud.LeaderTragicEventTest.classMethod

Error Message:
java.lang.Exception: Error shutting down MiniSolrCloudCluster

Stack Trace:
java.lang.Exception: Error shutting down MiniSolrCloudCluster
	at __randomizedtesting.SeedInfo.seed([898F26CB91183204]:0)
	at org.apache.solr.cloud.MiniSolrCloudCluster.checkForExceptions(MiniSolrCloudCluster.java:850)
	at org.apache.solr.cloud.MiniSolrCloudCluster.shutdown(MiniSolrCloudCluster.java:752)
	at org.apache.solr.cloud.SolrCloudTestCase.shutdownCluster(SolrCloudTestCase.java:118)
	at java.base/jdk.internal.reflect.NativeMethodAccessorImpl.invoke0(Native Method)
	at java.base/jdk.internal.reflect.NativeMethodAccessorImpl.invoke(NativeMethodAccessorImpl.java:62)
	at java.base/jdk.internal.reflect.DelegatingMethodAccessorImpl.invoke(DelegatingMethodAccessorImpl.java:43)
	at java.base/java.lang.reflect.Method.invoke(Method.java:566)
	at com.carrotsearch.randomizedtesting.RandomizedRunner.invoke(RandomizedRunner.java:1780)
	at com.carrotsearch.randomizedtesting.RandomizedRunner$7.evaluate(RandomizedRunner.java:922)
	at com.carrotsearch.randomizedtesting.rules.StatementAdapter.evaluate(StatementAdapter.java:36)
	at com.carrotsearch.randomizedtesting.rules.StatementAdapter.evaluate(StatementAdapter.java:36)
	at org.apache.lucene.tests.util.AbstractBeforeAfterRule$1.evaluate(AbstractBeforeAfterRule.java:43)
	at org.apache.lucene.tests.util.AbstractBeforeAfterRule$1.evaluate(AbstractBeforeAfterRule.java:43)
	at com.carrotsearch.randomizedtesting.rules.SystemPropertiesRestoreRule$1.evaluate(SystemPropertiesRestoreRule.java:80)
	at org.junit.rules.RunRules.evaluate(RunRules.java:20)
	at org.apache.lucene.tests.util.AbstractBeforeAfterRule$1.evaluate(AbstractBeforeAfterRule.java:43)
	at com.carrotsearch.randomizedtesting.rules.StatementAdapter.evaluate(StatementAdapter.java:36)
	at org.apache.lucene.tests.util.TestRuleStoreClassName$1.evaluate(TestRuleStoreClassName.java:38)
	at com.carrotsearch.randomizedtesting.rules.NoShadowingOrOverridesOnMethodsRule$1.evaluate(NoShadowingOrOverridesOnMethodsRule.java:40)
	at com.carrotsearch.randomizedtesting.rules.NoShadowingOrOverridesOnMethodsRule$1.evaluate(NoShadowingOrOverridesOnMethodsRule.java:40)
	at com.carrotsearch.randomizedtesting.rules.StatementAdapter.evaluate(StatementAdapter.java:36)
	at com.carrotsearch.randomizedtesting.rules.StatementAdapter.evaluate(StatementAdapter.java:36)
	at org.apache.lucene.tests.util.TestRuleAssertionsRequired$1.evaluate(TestRuleAssertionsRequired.java:53)
	at org.apache.lucene.tests.util.AbstractBeforeAfterRule$1.evaluate(AbstractBeforeAfterRule.java:43)
	at org.apache.lucene.tests.util.TestRuleMarkFailure$1.evaluate(TestRuleMarkFailure.java:44)
	at org.apache.lucene.tests.util.TestRuleIgnoreAfterMaxFailures$1.evaluate(TestRuleIgnoreAfterMaxFailures.java:60)
	at org.apache.lucene.tests.util.TestRuleIgnoreTestSuites$1.evaluate(TestRuleIgnoreTestSuites.java:47)
	at org.junit.rules.RunRules.evaluate(RunRules.java:20)
	at com.carrotsearch.randomizedtesting.rules.StatementAdapter.evaluate(StatementAdapter.java:36)
	at com.carrotsearch.randomizedtesting.ThreadLeakControl$StatementRunner.run(ThreadLeakControl.java:390)
	at com.carrotsearch.randomizedtesting.ThreadLeakControl.lambda$forkTimeoutingTask$0(ThreadLeakControl.java:850)
	at java.base/java.lang.Thread.run(Thread.java:829)
	Suppressed: java.util.concurrent.TimeoutException
		at java.base/java.util.concurrent.CompletableFuture.timedGet(CompletableFuture.java:1892)
		at java.base/java.util.concurrent.CompletableFuture.get(CompletableFuture.java:2027)
		at org.eclipse.jetty.server.Server.doStop(Server.java:490)
		at org.eclipse.jetty.util.component.AbstractLifeCycle.stop(AbstractLifeCycle.java:132)
		at org.apache.solr.embedded.JettySolrRunner.stop(JettySolrRunner.java:643)
		at org.apache.solr.cloud.MiniSolrCloudCluster.stopJettySolrRunner(MiniSolrCloudCluster.java:635)
		at org.apache.solr.cloud.MiniSolrCloudCluster.lambda$shutdown$5(MiniSolrCloudCluster.java:744)
		at java.base/java.util.concurrent.FutureTask.run(FutureTask.java:264)
		at org.apache.solr.common.util.ExecutorUtil$MDCAwareThreadPoolExecutor.lambda$execute$0(ExecutorUtil.java:381)
		at java.base/java.util.concurrent.ThreadPoolExecutor.runWorker(ThreadPoolExecutor.java:1128)
		at java.base/java.util.concurrent.ThreadPoolExecutor$Worker.run(ThreadPoolExecutor.java:628)
		... 1 more




Build Log:
[...truncated 13 lines...]
ERROR: Workspace has a .git repository, but it appears to be corrupt.
hudson.plugins.git.GitException: Command "git rev-parse --resolve-git-dir /home/jenkins/jenkins-agent/workspace/Solr/Solr-Test-9.x/.git" returned status code 128:
stdout: 
stderr: fatal: not a gitdir '/home/jenkins/jenkins-agent/workspace/Solr/Solr-Test-9.x/.git'

	at PluginClassLoader for git-client//org.jenkinsci.plugins.gitclient.CliGitAPIImpl.launchCommandIn(CliGitAPIImpl.java:2848)
	at PluginClassLoader for git-client//org.jenkinsci.plugins.gitclient.CliGitAPIImpl.launchCommandIn(CliGitAPIImpl.java:2768)
	at PluginClassLoader for git-client//org.jenkinsci.plugins.gitclient.CliGitAPIImpl.launchCommandIn(CliGitAPIImpl.java:2763)
	at PluginClassLoader for git-client//org.jenkinsci.plugins.gitclient.CliGitAPIImpl.launchCommand(CliGitAPIImpl.java:2052)
	at PluginClassLoader for git-client//org.jenkinsci.plugins.gitclient.CliGitAPIImpl.launchCommand(CliGitAPIImpl.java:2064)
	at PluginClassLoader for git-client//org.jenkinsci.plugins.gitclient.CliGitAPIImpl.hasGitRepo(CliGitAPIImpl.java:404)
	at PluginClassLoader for git-client//hudson.plugins.git.GitAPI.hasGitRepo(GitAPI.java:281)
	at java.base/jdk.internal.reflect.NativeMethodAccessorImpl.invoke0(Native Method)
	at java.base/jdk.internal.reflect.NativeMethodAccessorImpl.invoke(NativeMethodAccessorImpl.java:77)
	at java.base/jdk.internal.reflect.DelegatingMethodAccessorImpl.invoke(DelegatingMethodAccessorImpl.java:43)
	at java.base/java.lang.reflect.Method.invoke(Method.java:569)
	at hudson.remoting.RemoteInvocationHandler$RPCRequest.perform(RemoteInvocationHandler.java:986)
	at hudson.remoting.RemoteInvocationHandler$RPCRequest.call(RemoteInvocationHandler.java:961)
	at hudson.remoting.RemoteInvocationHandler$RPCRequest.call(RemoteInvocationHandler.java:907)
	at hudson.remoting.UserRequest.perform(UserRequest.java:225)
	at hudson.remoting.UserRequest.perform(UserRequest.java:50)
	at hudson.remoting.Request$2.run(Request.java:391)
	at hudson.remoting.InterceptingExecutorService.lambda$wrap$0(InterceptingExecutorService.java:81)
	at java.base/java.util.concurrent.FutureTask.run(FutureTask.java:264)
	at java.base/java.util.concurrent.ThreadPoolExecutor.runWorker(ThreadPoolExecutor.java:1136)
	at java.base/java.util.concurrent.ThreadPoolExecutor$Worker.run(ThreadPoolExecutor.java:635)
	at java.base/java.lang.Thread.run(Thread.java:840)
Cloning the remote Git repository
Cloning repository https://gitbox.apache.org/repos/asf/solr.git
 > git init /home/jenkins/jenkins-agent/workspace/Solr/Solr-Test-9.x # timeout=10
Fetching upstream changes from https://gitbox.apache.org/repos/asf/solr.git
 > git --version # timeout=10
 > git --version # 'git version 2.43.0'
 > git fetch --tags --force --progress -- https://gitbox.apache.org/repos/asf/solr.git +refs/heads/*:refs/remotes/origin/* # timeout=10
 > git config remote.origin.url https://gitbox.apache.org/repos/asf/solr.git # timeout=10
 > git config --add remote.origin.fetch +refs/heads/*:refs/remotes/origin/* # timeout=10
Avoid second fetch
 > git rev-parse refs/remotes/origin/branch_9x^{commit} # timeout=10
Checking out Revision 0f930a94b947b1a8c82d7bc5763314814eb0dcc1 (refs/remotes/origin/branch_9x)
 > git config core.sparsecheckout # timeout=10
 > git checkout -f 0f930a94b947b1a8c82d7bc5763314814eb0dcc1 # timeout=10
 > git branch -a -v --no-abbrev # timeout=10
 > git checkout -b branch_9x 0f930a94b947b1a8c82d7bc5763314814eb0dcc1 # timeout=10
Commit message: "SOLR-18304: Optimize collapse performance for String fields (#4621)"
 > git rev-list --no-walk 0f930a94b947b1a8c82d7bc5763314814eb0dcc1 # timeout=10
No emails were triggered.
provisioning config files...
copy managed file [gradle.properties] to file:/home/jenkins/jenkins-agent/workspace/Solr/Solr-Test-9.x/gradle.properties
[Gradle] - Launching build.
[Solr-Test-9.x] $ /home/jenkins/jenkins-agent/workspace/Solr/Solr-Test-9.x/gradlew -Dtests.haltonfailure=false -Dtests.badapples=false --continue test
Downloading gradle-wrapper.jar from https://raw.githubusercontent.com/gradle/gradle/v8.10.2/gradle/wrapper/gradle-wrapper.jar
To honour the JVM settings for this build a single-use Daemon process will be forked. For more on this, please refer to https://docs.gradle.org/8.10/userguide/gradle_daemon.html#sec:disabling_the_daemon in the Gradle documentation.
Daemon will be stopped at the end of the build 

> Task :buildSrc:compileJava
Note: /home/jenkins/jenkins-agent/workspace/Solr/Solr-Test-9.x/buildSrc/src/main/java/org/apache/lucene/gradle/Checksum.java uses or overrides a deprecated API.
Note: Recompile with -Xlint:deprecation for details.

> Task :buildSrc:compileGroovy NO-SOURCE
> Task :buildSrc:processResources NO-SOURCE
> Task :buildSrc:classes
> Task :buildSrc:jar
> Task :gitStatus
> Task :checkJdkInternalsExportedToGradle
> Task :solr:api:compileJava
> Task :solr:api:processResources NO-SOURCE
> Task :solr:api:classes
> Task :solr:api:jar
> Task :ensureJdkSupported

> Task :randomizationInfo
Running tests with randomization seed: tests.seed=898F26CB91183204

> Task :solr:api:resolve
SLF4J(W): No SLF4J providers were found.
SLF4J(W): Defaulting to no-operation (NOP) logger implementation
SLF4J(W): See https://www.slf4j.org/codes.html#noProviders for further details.

> Task :solr:solrj:openApiGenerate
Cleaned up output directory /home/jenkins/jenkins-agent/workspace/Solr/Solr-Test-9.x/solr/solrj/build/generated/ before code generation (cleanupOutput set to true).
Multiple schemas found in the OAS 'content' section, returning only the first one (application/json)
Multiple schemas found in the OAS 'content' section, returning only the first one (application/json)
Multiple schemas found in the OAS 'content' section, returning only the first one (application/vnd.apache.solr.raw)
Multiple schemas found in the OAS 'content' section, returning only the first one (application/vnd.apache.solr.raw)
################################################################################
# Thanks for using OpenAPI Generator.                                          #
# Please consider donation to help us maintain this project 🙏                 #
# https://opencollective.com/openapi_generator/donate                          #
################################################################################
Successfully generated code to /home/jenkins/jenkins-agent/workspace/Solr/Solr-Test-9.x/solr/solrj/build/generated/

> Task :spotlessInternalRegisterDependencies
> Task :solr:solrj:generatedSpotlessHelper
> Task :solr:solrj:generatedSpotless

> Task :solr:solrj:compileJava
Note: Some input files use or override a deprecated API.
Note: Recompile with -Xlint:deprecation for details.

> Task :solr:solrj-streaming:compileJava
Note: Some input files use or override a deprecated API.
Note: Recompile with -Xlint:deprecation for details.

> Task :solr:solrj-zookeeper:compileJava
Note: Some input files use or override a deprecated API.
Note: Recompile with -Xlint:deprecation for details.

> Task :solr:core:compileJava
Note: Some input files use or override a deprecated API.
Note: Recompile with -Xlint:deprecation for details.

> Task :solr:test-framework:compileJava
Note: Some input files use or override a deprecated API.
Note: Recompile with -Xlint:deprecation for details.

> Task :solr:api:compileTestJava
> Task :solr:api:processTestResources
> Task :solr:api:testClasses
> Task :solr:core:processResources
> Task :solr:core:classes
> Task :solr:core:jar
> Task :solr:solrj:processResources
> Task :solr:solrj:classes
> Task :solr:solrj:jar
> Task :solr:solrj-streaming:processResources
> Task :solr:solrj-streaming:classes
> Task :solr:solrj-streaming:jar
> Task :solr:solrj-zookeeper:processResources NO-SOURCE
> Task :solr:solrj-zookeeper:classes
> Task :solr:solrj-zookeeper:jar
> Task :solr:test-framework:processResources
> Task :solr:test-framework:classes
> Task :solr:test-framework:jar

> Task :solr:api:test
:solr:api:test (SUCCESS): 6 test(s)

> Task :solr:api:wipeTaskTemp

> Task :solr:benchmark:compileJava
Note: /home/jenkins/jenkins-agent/workspace/Solr/Solr-Test-9.x/solr/benchmark/src/java/org/apache/solr/bench/search/QueryResponseWriters.java uses or overrides a deprecated API.
Note: Recompile with -Xlint:deprecation for details.

> Task :solr:benchmark:processResources
> Task :solr:benchmark:classes
> Task :solr:benchmark:compileTestJava
> Task :solr:benchmark:processTestResources
> Task :solr:benchmark:testClasses

> Task :solr:benchmark:test
:solr:benchmark:test (SUCCESS): 10 test(s)

> Task :solr:benchmark:wipeTaskTemp
> Task :solr:core:compileTestJava
Note: Some input files use or override a deprecated API.
Note: Recompile with -Xlint:deprecation for details.

> Task :solr:core:processTestResources
> Task :solr:core:testClasses

> Task :solr:modules:analysis-extras:compileJava
Note: /home/jenkins/jenkins-agent/workspace/Solr/Solr-Test-9.x/solr/modules/analysis-extras/src/java/org/apache/solr/schema/ICUCollationField.java uses or overrides a deprecated API.
Note: Recompile with -Xlint:deprecation for details.

> Task :solr:modules:analysis-extras:processResources NO-SOURCE
> Task :solr:modules:analysis-extras:classes
> Task :solr:modules:analysis-extras:jar
> Task :solr:core:test
WARNING: Test org.apache.solr.TestRandomFaceting wrote 25,184,890 bytes of output.

LeaderTragicEventTest > classMethod FAILED
    java.lang.Exception: Error shutting down MiniSolrCloudCluster
        at __randomizedtesting.SeedInfo.seed([898F26CB91183204]:0)
        at org.apache.solr.cloud.MiniSolrCloudCluster.checkForExceptions(MiniSolrCloudCluster.java:850)
        at org.apache.solr.cloud.MiniSolrCloudCluster.shutdown(MiniSolrCloudCluster.java:752)
        at org.apache.solr.cloud.SolrCloudTestCase.shutdownCluster(SolrCloudTestCase.java:118)
        at java.base/jdk.internal.reflect.NativeMethodAccessorImpl.invoke0(Native Method)
        at java.base/jdk.internal.reflect.NativeMethodAccessorImpl.invoke(NativeMethodAccessorImpl.java:62)
        at java.base/jdk.internal.reflect.DelegatingMethodAccessorImpl.invoke(DelegatingMethodAccessorImpl.java:43)
        at java.base/java.lang.reflect.Method.invoke(Method.java:566)
        at com.carrotsearch.randomizedtesting.RandomizedRunner.invoke(RandomizedRunner.java:1780)
        at com.carrotsearch.randomizedtesting.RandomizedRunner$7.evaluate(RandomizedRunner.java:922)
        at com.carrotsearch.randomizedtesting.rules.StatementAdapter.evaluate(StatementAdapter.java:36)
        at com.carrotsearch.randomizedtesting.rules.StatementAdapter.evaluate(StatementAdapter.java:36)
        at org.apache.lucene.tests.util.AbstractBeforeAfterRule$1.evaluate(AbstractBeforeAfterRule.java:43)
        at org.apache.lucene.tests.util.AbstractBeforeAfterRule$1.evaluate(AbstractBeforeAfterRule.java:43)
        at com.carrotsearch.randomizedtesting.rules.SystemPropertiesRestoreRule$1.evaluate(SystemPropertiesRestoreRule.java:80)
        at org.junit.rules.RunRules.evaluate(RunRules.java:20)
        at org.apache.lucene.tests.util.AbstractBeforeAfterRule$1.evaluate(AbstractBeforeAfterRule.java:43)
        at com.carrotsearch.randomizedtesting.rules.StatementAdapter.evaluate(StatementAdapter.java:36)
        at org.apache.lucene.tests.util.TestRuleStoreClassName$1.evaluate(TestRuleStoreClassName.java:38)
        at com.carrotsearch.randomizedtesting.rules.NoShadowingOrOverridesOnMethodsRule$1.evaluate(NoShadowingOrOverridesOnMethodsRule.java:40)
        at com.carrotsearch.randomizedtesting.rules.NoShadowingOrOverridesOnMethodsRule$1.evaluate(NoShadowingOrOverridesOnMethodsRule.java:40)
        at com.carrotsearch.randomizedtesting.rules.StatementAdapter.evaluate(StatementAdapter.java:36)
        at com.carrotsearch.randomizedtesting.rules.StatementAdapter.evaluate(StatementAdapter.java:36)
        at org.apache.lucene.tests.util.TestRuleAssertionsRequired$1.evaluate(TestRuleAssertionsRequired.java:53)
        at org.apache.lucene.tests.util.AbstractBeforeAfterRule$1.evaluate(AbstractBeforeAfterRule.java:43)
        at org.apache.lucene.tests.util.TestRuleMarkFailure$1.evaluate(TestRuleMarkFailure.java:44)
        at org.apache.lucene.tests.util.TestRuleIgnoreAfterMaxFailures$1.evaluate(TestRuleIgnoreAfterMaxFailures.java:60)
        at org.apache.lucene.tests.util.TestRuleIgnoreTestSuites$1.evaluate(TestRuleIgnoreTestSuites.java:47)
        at org.junit.rules.RunRules.evaluate(RunRules.java:20)
        at com.carrotsearch.randomizedtesting.rules.StatementAdapter.evaluate(StatementAdapter.java:36)
        at com.carrotsearch.randomizedtesting.ThreadLeakControl$StatementRunner.run(ThreadLeakControl.java:390)
        at com.carrotsearch.randomizedtesting.ThreadLeakControl.lambda$forkTimeoutingTask$0(ThreadLeakControl.java:850)
        at java.base/java.lang.Thread.run(Thread.java:829)

org.apache.solr.cloud.LeaderTragicEventTest > test suite's output saved to /home/jenkins/jenkins-agent/workspace/Solr/Solr-Test-9.x/solr/core/build/test-results/test/outputs/OUTPUT-org.apache.solr.cloud.LeaderTragicEventTest.txt, copied below:
  2> 214879 INFO  (SUITE-LeaderTragicEventTest-seed#[898F26CB91183204]-worker) [] o.a.s.SolrTestCase Setting 'solr.default.confdir' system property to test-framework derived value of '/home/jenkins/jenkins-agent/workspace/Solr/Solr-Test-9.x/solr/server/solr/configsets/_default/conf'
  2> 214879 INFO  (SUITE-LeaderTragicEventTest-seed#[898F26CB91183204]-worker) [] o.a.s.SolrTestCaseJ4 SecureRandom sanity checks: test.solr.allowed.securerandom=null & java.security.egd=file:/dev/./urandom
  2> 214880 INFO  (SUITE-LeaderTragicEventTest-seed#[898F26CB91183204]-worker) [] o.a.s.u.ErrorLogMuter Closing ErrorLogMuter-regex-57 after mutting 0 log messages
  2> 214880 INFO  (SUITE-LeaderTragicEventTest-seed#[898F26CB91183204]-worker) [] o.a.s.u.ErrorLogMuter Creating ErrorLogMuter-regex-58 for ERROR logs matching regex: ignore_exception
  2> 214881 INFO  (SUITE-LeaderTragicEventTest-seed#[898F26CB91183204]-worker) [] o.a.s.SolrTestCaseJ4 Created dataDir: /home/jenkins/jenkins-agent/workspace/Solr/Solr-Test-9.x/solr/core/build/tmp/tests-tmp/org.apache.solr.cloud.LeaderTragicEventTest_898F26CB91183204-001/data-dir-25-001
  2> 214881 WARN  (SUITE-LeaderTragicEventTest-seed#[898F26CB91183204]-worker) [] o.a.s.SolrTestCaseJ4 startTrackingSearchers: numOpens=16 numCloses=16
  2> 214881 INFO  (SUITE-LeaderTragicEventTest-seed#[898F26CB91183204]-worker) [] o.a.s.SolrTestCaseJ4 Using PointFields (NUMERIC_POINTS_SYSPROP=true) w/NUMERIC_DOCVALUES_SYSPROP=false
  2> 214881 INFO  (SUITE-LeaderTragicEventTest-seed#[898F26CB91183204]-worker) [] o.a.s.SolrTestCaseJ4 Randomized ssl (false) and clientAuth (false) via: @org.apache.solr.util.RandomizeSSL(reason="", ssl=0.0/0.0, value=0.0/0.0, clientAuth=0.0/0.0)
  2> 214882 INFO  (SUITE-LeaderTragicEventTest-seed#[898F26CB91183204]-worker) [] o.a.s.u.t.SimplePropagator Always-on trace id generation enabled.
  2> 214882 INFO  (SUITE-LeaderTragicEventTest-seed#[898F26CB91183204]-worker) [] o.a.s.c.MiniSolrCloudCluster Starting cluster of 2 servers in /home/jenkins/jenkins-agent/workspace/Solr/Solr-Test-9.x/solr/core/build/tmp/tests-tmp/org.apache.solr.cloud.LeaderTragicEventTest_898F26CB91183204-001/tempDir-001
  2> 214882 INFO  (SUITE-LeaderTragicEventTest-seed#[898F26CB91183204]-worker) [] o.a.s.c.ZkTestServer STARTING ZK TEST SERVER
  2> 214882 INFO  (ZkTestServer Run Thread) [] o.a.s.c.ZkTestServer client port: /127.0.0.1:0
  2> 214882 INFO  (ZkTestServer Run Thread) [] o.a.s.c.ZkTestServer Starting server
  2> 214883 WARN  (ZkTestServer Run Thread) [] o.a.z.s.ServerCnxnFactory maxCnxns is not configured, using default value 0.
  2> 214982 INFO  (SUITE-LeaderTragicEventTest-seed#[898F26CB91183204]-worker) [] o.a.s.c.ZkTestServer start zk server on port: 37559
  2> 214984 WARN  (SUITE-LeaderTragicEventTest-seed#[898F26CB91183204]-worker) [] o.a.s.c.c.SolrZkClient Using default ZkCredentialsInjector. ZkCredentialsInjector is not secure, it creates an empty list of credentials which leads to 'OPEN_ACL_UNSAFE' ACLs to Zookeeper nodes
  2> 214985 INFO  (SUITE-LeaderTragicEventTest-seed#[898F26CB91183204]-worker) [] o.a.s.c.c.ConnectionManager Waiting up to 30000ms for client to connect to ZooKeeper
  2> 214987 INFO  (zkCallback-2814-thread-1) [] o.a.s.c.c.ConnectionManager zkClient has connected
  2> 214987 INFO  (SUITE-LeaderTragicEventTest-seed#[898F26CB91183204]-worker) [] o.a.s.c.c.ConnectionManager Client is connected to ZooKeeper
  2> 214987 WARN  (SUITE-LeaderTragicEventTest-seed#[898F26CB91183204]-worker) [] o.a.s.c.c.SolrZkClient Using default ZkACLProvider. DefaultZkACLProvider is not secure, it creates 'OPEN_ACL_UNSAFE' ACLs to Zookeeper nodes
  2> 214989 WARN  (SUITE-LeaderTragicEventTest-seed#[898F26CB91183204]-worker) [] o.a.s.c.c.SolrZkClient Using default ZkCredentialsInjector. ZkCredentialsInjector is not secure, it creates an empty list of credentials which leads to 'OPEN_ACL_UNSAFE' ACLs to Zookeeper nodes
  2> 214989 INFO  (SUITE-LeaderTragicEventTest-seed#[898F26CB91183204]-worker) [] o.a.s.c.c.ConnectionManager Waiting up to 30000ms for client to connect to ZooKeeper
  2> 214990 INFO  (zkCallback-2816-thread-1) [] o.a.s.c.c.ConnectionManager zkClient has connected
  2> 214990 INFO  (SUITE-LeaderTragicEventTest-seed#[898F26CB91183204]-worker) [] o.a.s.c.c.ConnectionManager Client is connected to ZooKeeper
  2> 214990 WARN  (SUITE-LeaderTragicEventTest-seed#[898F26CB91183204]-worker) [] o.a.s.c.c.SolrZkClient Using default ZkACLProvider. DefaultZkACLProvider is not secure, it creates 'OPEN_ACL_UNSAFE' ACLs to Zookeeper nodes
  2> 214990 WARN  (SUITE-LeaderTragicEventTest-seed#[898F26CB91183204]-worker) [] o.a.s.c.c.SolrZkClient Using default ZkCredentialsInjector. ZkCredentialsInjector is not secure, it creates an empty list of credentials which leads to 'OPEN_ACL_UNSAFE' ACLs to Zookeeper nodes
  2> 214991 INFO  (SUITE-LeaderTragicEventTest-seed#[898F26CB91183204]-worker) [] o.a.s.c.c.ConnectionManager Waiting up to 15000ms for client to connect to ZooKeeper
  2> 214992 INFO  (zkCallback-2818-thread-1) [] o.a.s.c.c.ConnectionManager zkClient has connected
  2> 214992 INFO  (SUITE-LeaderTragicEventTest-seed#[898F26CB91183204]-worker) [] o.a.s.c.c.ConnectionManager Client is connected to ZooKeeper
  2> 214992 WARN  (SUITE-LeaderTragicEventTest-seed#[898F26CB91183204]-worker) [] o.a.s.c.c.SolrZkClient Using default ZkACLProvider. DefaultZkACLProvider is not secure, it creates 'OPEN_ACL_UNSAFE' ACLs to Zookeeper nodes
  2> 215096 INFO  (jetty-launcher-2820-thread-2) [] o.a.s.e.JettySolrRunner Start Jetty (configured port=0, binding port=0)
  2> 215096 INFO  (jetty-launcher-2820-thread-1) [] o.a.s.e.JettySolrRunner Start Jetty (configured port=0, binding port=0)
  2> 215096 INFO  (jetty-launcher-2820-thread-2) [] o.a.s.e.JettySolrRunner Trying to start Jetty on port 0 try number 2 ...
  2> 215096 INFO  (jetty-launcher-2820-thread-1) [] o.a.s.e.JettySolrRunner Trying to start Jetty on port 0 try number 2 ...
  2> 215096 INFO  (jetty-launcher-2820-thread-2) [] o.e.j.s.Server jetty-10.0.26; built: 2025-08-14T15:56:56.454Z; git: 65a55c55a68c56d5f2e8232164439bd6e76e53d1; jvm 11.0.24+8
  2> 215096 INFO  (jetty-launcher-2820-thread-1) [] o.e.j.s.Server jetty-10.0.26; built: 2025-08-14T15:56:56.454Z; git: 65a55c55a68c56d5f2e8232164439bd6e76e53d1; jvm 11.0.24+8
  2> 215097 INFO  (jetty-launcher-2820-thread-2) [] o.e.j.s.s.DefaultSessionIdManager Session workerName=node0
  2> 215097 INFO  (jetty-launcher-2820-thread-1) [] o.e.j.s.s.DefaultSessionIdManager Session workerName=node0
  2> 215098 INFO  (jetty-launcher-2820-thread-2) [] o.a.s.e.JettySolrRunner Jetty properties: {hostContext=/solr, hostPort=36255, zkHost=127.0.0.1:37559/solr}
  2> 215098 INFO  (jetty-launcher-2820-thread-1) [] o.a.s.e.JettySolrRunner Jetty properties: {hostContext=/solr, hostPort=38699, zkHost=127.0.0.1:37559/solr}
  2> 215098 ERROR (jetty-launcher-2820-thread-2) [] o.a.s.u.StartupLoggingUtils Missing Java Option solr.log.dir. Logging may be missing or incomplete.
  2> 215098 ERROR (jetty-launcher-2820-thread-1) [] o.a.s.u.StartupLoggingUtils Missing Java Option solr.log.dir. Logging may be missing or incomplete.
  2> 215098 INFO  (jetty-launcher-2820-thread-2) [] o.a.s.s.CoreContainerProvider Using logger factory org.apache.logging.slf4j.Log4jLoggerFactory
  2> 215098 INFO  (jetty-launcher-2820-thread-1) [] o.a.s.s.CoreContainerProvider Using logger factory org.apache.logging.slf4j.Log4jLoggerFactory
  2> 215098 INFO  (jetty-launcher-2820-thread-2) [] o.a.s.s.CoreContainerProvider  ___      _       Welcome to Apache Solr™ version 9.11.0
  2> 215098 INFO  (jetty-launcher-2820-thread-1) [] o.a.s.s.CoreContainerProvider  ___      _       Welcome to Apache Solr™ version 9.11.0
  2> 215098 INFO  (jetty-launcher-2820-thread-2) [] o.a.s.s.CoreContainerProvider / __| ___| |_ _   Starting in cloud mode on port null
  2> 215098 INFO  (jetty-launcher-2820-thread-1) [] o.a.s.s.CoreContainerProvider / __| ___| |_ _   Starting in cloud mode on port null
  2> 215098 INFO  (jetty-launcher-2820-thread-2) [] o.a.s.s.CoreContainerProvider \__ \/ _ \ | '_|  Install dir: /home/jenkins/jenkins-agent/workspace/Solr/Solr-Test-9.x/solr
  2> 215098 INFO  (jetty-launcher-2820-thread-1) [] o.a.s.s.CoreContainerProvider \__ \/ _ \ | '_|  Install dir: /home/jenkins/jenkins-agent/workspace/Solr/Solr-Test-9.x/solr
  2> 215098 INFO  (jetty-launcher-2820-thread-2) [] o.a.s.s.CoreContainerProvider |___/\___/_|_|    Start time: 2026-07-27T23:34:25.569746Z
  2> 215098 INFO  (jetty-launcher-2820-thread-1) [] o.a.s.s.CoreContainerProvider |___/\___/_|_|    Start time: 2026-07-27T23:34:25.569750Z
  2> 215098 INFO  (jetty-launcher-2820-thread-1) [] o.a.s.s.CoreContainerProvider Solr Home: /home/jenkins/jenkins-agent/workspace/Solr/Solr-Test-9.x/solr/core/build/tmp/tests-tmp/org.apache.solr.cloud.LeaderTragicEventTest_898F26CB91183204-001/tempDir-001/node1 (source: servlet config: solr.solr.home)
  2> 215098 INFO  (jetty-launcher-2820-thread-2) [] o.a.s.s.CoreContainerProvider Solr Home: /home/jenkins/jenkins-agent/workspace/Solr/Solr-Test-9.x/solr/core/build/tmp/tests-tmp/org.apache.solr.cloud.LeaderTragicEventTest_898F26CB91183204-001/tempDir-001/node2 (source: servlet config: solr.solr.home)
  2> 215099 WARN  (jetty-launcher-2820-thread-1) [] o.a.s.c.c.SolrZkClient Using default ZkCredentialsInjector. ZkCredentialsInjector is not secure, it creates an empty list of credentials which leads to 'OPEN_ACL_UNSAFE' ACLs to Zookeeper nodes
  2> 215099 WARN  (jetty-launcher-2820-thread-2) [] o.a.s.c.c.SolrZkClient Using default ZkCredentialsInjector. ZkCredentialsInjector is not secure, it creates an empty list of credentials which leads to 'OPEN_ACL_UNSAFE' ACLs to Zookeeper nodes
  2> 215100 INFO  (jetty-launcher-2820-thread-2) [] o.a.s.c.c.ConnectionManager Waiting up to 30000ms for client to connect to ZooKeeper
  2> 215100 INFO  (jetty-launcher-2820-thread-1) [] o.a.s.c.c.ConnectionManager Waiting up to 30000ms for client to connect to ZooKeeper
  2> 215101 INFO  (zkCallback-2822-thread-1) [] o.a.s.c.c.ConnectionManager zkClient has connected
  2> 215101 INFO  (jetty-launcher-2820-thread-2) [] o.a.s.c.c.ConnectionManager Client is connected to ZooKeeper
  2> 215101 WARN  (jetty-launcher-2820-thread-2) [] o.a.s.c.c.SolrZkClient Using default ZkACLProvider. DefaultZkACLProvider is not secure, it creates 'OPEN_ACL_UNSAFE' ACLs to Zookeeper nodes
  2> 215101 INFO  (zkCallback-2821-thread-1) [] o.a.s.c.c.ConnectionManager zkClient has connected
  2> 215101 INFO  (jetty-launcher-2820-thread-1) [] o.a.s.c.c.ConnectionManager Client is connected to ZooKeeper
  2> 215101 WARN  (jetty-launcher-2820-thread-1) [] o.a.s.c.c.SolrZkClient Using default ZkACLProvider. DefaultZkACLProvider is not secure, it creates 'OPEN_ACL_UNSAFE' ACLs to Zookeeper nodes
  2> 215102 INFO  (jetty-launcher-2820-thread-2) [] o.a.s.c.NodeConfig solr.xml found in ZooKeeper. Loading...
  2> 215102 INFO  (jetty-launcher-2820-thread-1) [] o.a.s.c.NodeConfig solr.xml found in ZooKeeper. Loading...
  2> 215103 INFO  (jetty-launcher-2820-thread-2) [] o.a.s.c.SolrXmlConfig Metrics collection is disabled.
  2> 215103 INFO  (jetty-launcher-2820-thread-1) [] o.a.s.c.SolrXmlConfig Metrics collection is disabled.
  2> 215213 INFO  (jetty-launcher-2820-thread-2) [] o.a.s.c.ZkContainer Zookeeper client=127.0.0.1:37559/solr
  2> 215213 INFO  (jetty-launcher-2820-thread-2) [] o.a.s.c.DistributedClusterStateUpdater Creating DistributedClusterStateUpdater with useDistributedStateUpdate=false. Solr will be using Overseer based cluster state updates.
  2> 215213 INFO  (jetty-launcher-2820-thread-1) [] o.a.s.c.ZkContainer Zookeeper client=127.0.0.1:37559/solr
  2> 215213 INFO  (jetty-launcher-2820-thread-1) [] o.a.s.c.DistributedClusterStateUpdater Creating DistributedClusterStateUpdater with useDistributedStateUpdate=false. Solr will be using Overseer based cluster state updates.
  2> 215214 INFO  (jetty-launcher-2820-thread-2) [n:127.0.0.1:36255_solr] o.a.s.c.c.ConnectionManager Waiting up to 15000ms for client to connect to ZooKeeper
  2> 215214 INFO  (jetty-launcher-2820-thread-1) [n:127.0.0.1:38699_solr] o.a.s.c.c.ConnectionManager Waiting up to 15000ms for client to connect to ZooKeeper
  2> 215215 INFO  (zkCallback-2847-thread-1) [] o.a.s.c.c.ConnectionManager zkClient has connected
  2> 215215 INFO  (jetty-launcher-2820-thread-1) [n:127.0.0.1:38699_solr] o.a.s.c.c.ConnectionManager Client is connected to ZooKeeper
  2> 215215 INFO  (zkCallback-2845-thread-1) [] o.a.s.c.c.ConnectionManager zkClient has connected
  2> 215215 INFO  (jetty-launcher-2820-thread-2) [n:127.0.0.1:36255_solr] o.a.s.c.c.ConnectionManager Client is connected to ZooKeeper
  2> 215232 WARN  (jetty-launcher-2820-thread-2) [n:127.0.0.1:36255_solr] o.a.s.c.ZkController Contents of zookeeper /security.json are world-readable; consider setting up ACLs as described in https://solr.apache.org/guide/solr/latest/deployment-guide/zookeeper-access-control.html
  2> 215232 WARN  (jetty-launcher-2820-thread-1) [n:127.0.0.1:38699_solr] o.a.s.c.ZkController Contents of zookeeper /security.json are world-readable; consider setting up ACLs as described in https://solr.apache.org/guide/solr/latest/deployment-guide/zookeeper-access-control.html
  2> 215235 INFO  (jetty-launcher-2820-thread-2) [n:127.0.0.1:36255_solr] o.a.s.c.DistributedClusterStateUpdater Creating DistributedClusterStateUpdater with useDistributedStateUpdate=false. Solr will be using Overseer based cluster state updates.
  2> 215235 INFO  (jetty-launcher-2820-thread-1) [n:127.0.0.1:38699_solr] o.a.s.c.DistributedClusterStateUpdater Creating DistributedClusterStateUpdater with useDistributedStateUpdate=false. Solr will be using Overseer based cluster state updates.
  2> 215237 INFO  (jetty-launcher-2820-thread-2) [n:127.0.0.1:36255_solr] o.a.s.c.OverseerElectionContext I am going to be the leader 127.0.0.1:36255_solr
  2> 215237 INFO  (jetty-launcher-2820-thread-2) [n:127.0.0.1:36255_solr] o.a.s.c.Overseer Overseer (id=72118299541897221-127.0.0.1:36255_solr-n_0000000000) starting
  2> 215238 INFO  (jetty-launcher-2820-thread-1) [n:127.0.0.1:38699_solr] o.a.s.c.ZkController Register node as live in ZooKeeper: /live_nodes/127.0.0.1:38699_solr
  2> 215238 INFO  (zkCallback-2845-thread-1) [] o.a.s.c.c.ZkStateReader Updated live nodes from ZooKeeper... (0) -> (1)
  2> 215238 INFO  (zkCallback-2847-thread-1) [] o.a.s.c.c.ZkStateReader Updated live nodes from ZooKeeper... (0) -> (1)
  2> 215241 WARN  (jetty-launcher-2820-thread-1) [n:127.0.0.1:38699_solr] o.a.s.c.CoreContainer Not all security plugins configured!  authentication=disabled authorization=disabled.  Solr is only as secure as you make it. Consider configuring authentication/authorization before exposing Solr to users internal or external.  See https://s.apache.org/solrsecurity for more info
  2> 215242 INFO  (jetty-launcher-2820-thread-2) [n:127.0.0.1:36255_solr] o.a.s.c.ZkController Publish node=127.0.0.1:36255_solr as DOWN
  2> 215242 INFO  (OverseerStateUpdate-72118299541897221-127.0.0.1:36255_solr-n_0000000000) [n:127.0.0.1:36255_solr] o.a.s.c.Overseer Starting to work on the main queue : 127.0.0.1:36255_solr
  2> 215243 INFO  (jetty-launcher-2820-thread-2) [n:127.0.0.1:36255_solr] o.a.s.c.ZkController Register node as live in ZooKeeper: /live_nodes/127.0.0.1:36255_solr
  2> 215244 INFO  (zkCallback-2847-thread-1) [] o.a.s.c.c.ZkStateReader Updated live nodes from ZooKeeper... (1) -> (2)
  2> 215244 INFO  (zkCallback-2845-thread-1) [] o.a.s.c.c.ZkStateReader Updated live nodes from ZooKeeper... (1) -> (2)
  2> 215246 WARN  (jetty-launcher-2820-thread-2) [n:127.0.0.1:36255_solr] o.a.s.c.CoreContainer Not all security plugins configured!  authentication=disabled authorization=disabled.  Solr is only as secure as you make it. Consider configuring authentication/authorization before exposing Solr to users internal or external.  See https://s.apache.org/solrsecurity for more info
  2> 215263 INFO  (jetty-launcher-2820-thread-2) [n:127.0.0.1:36255_solr] o.a.s.c.CorePropertiesLocator Found 0 core definitions underneath /home/jenkins/jenkins-agent/workspace/Solr/Solr-Test-9.x/solr/core/build/tmp/tests-tmp/org.apache.solr.cloud.LeaderTragicEventTest_898F26CB91183204-001/tempDir-001/node2
  2> 215281 INFO  (jetty-launcher-2820-thread-1) [n:127.0.0.1:38699_solr] o.a.s.c.CorePropertiesLocator Found 0 core definitions underneath /home/jenkins/jenkins-agent/workspace/Solr/Solr-Test-9.x/solr/core/build/tmp/tests-tmp/org.apache.solr.cloud.LeaderTragicEventTest_898F26CB91183204-001/tempDir-001/node1
  2> 215293 INFO  (jetty-launcher-2820-thread-2) [n:127.0.0.1:36255_solr] o.a.s.j.SolrRequestAuthorizer Creating a new SolrRequestAuthorizer
  2> 215338 INFO  (jetty-launcher-2820-thread-2) [n:127.0.0.1:36255_solr] o.e.j.s.h.ContextHandler Started o.e.j.s.ServletContextHandler@338906d7{/solr,file:///home/jenkins/jenkins-agent/workspace/Solr/Solr-Test-9.x/solr/core/build/tmp/tests-cwd/,AVAILABLE}
  2> 215338 INFO  (jetty-launcher-2820-thread-2) [n:127.0.0.1:36255_solr] o.e.j.s.AbstractConnector Started ServerConnector@74bd1d76{HTTP/1.1, (http/1.1, h2c)}{127.0.0.1:36255}
  2> 215338 INFO  (jetty-launcher-2820-thread-2) [n:127.0.0.1:36255_solr] o.e.j.s.Server Started Server@64c3128a{STARTING}[10.0.26,sto=15000] @215363ms
  2> 215341 INFO  (jetty-launcher-2820-thread-1) [n:127.0.0.1:38699_solr] o.a.s.j.SolrRequestAuthorizer Creating a new SolrRequestAuthorizer
  2> 215355 INFO  (jetty-launcher-2820-thread-1) [n:127.0.0.1:38699_solr] o.e.j.s.h.ContextHandler Started o.e.j.s.ServletContextHandler@4c2e7cea{/solr,file:///home/jenkins/jenkins-agent/workspace/Solr/Solr-Test-9.x/solr/core/build/tmp/tests-cwd/,AVAILABLE}
  2> 215355 INFO  (jetty-launcher-2820-thread-1) [n:127.0.0.1:38699_solr] o.e.j.s.AbstractConnector Started ServerConnector@6f1a36da{HTTP/1.1, (http/1.1, h2c)}{127.0.0.1:38699}
  2> 215356 INFO  (jetty-launcher-2820-thread-1) [n:127.0.0.1:38699_solr] o.e.j.s.Server Started Server@631320cb{STARTING}[10.0.26,sto=15000] @215380ms
  2> 215357 INFO  (SUITE-LeaderTragicEventTest-seed#[898F26CB91183204]-worker) [] o.a.s.c.MiniSolrCloudCluster waitForAllNodes: numServers=2
  2> 215357 INFO  (SUITE-LeaderTragicEventTest-seed#[898F26CB91183204]-worker) [] o.a.s.c.MiniSolrCloudCluster waitForNode: 127.0.0.1:36255_solr
  2> 215357 WARN  (SUITE-LeaderTragicEventTest-seed#[898F26CB91183204]-worker) [] o.a.s.c.c.SolrZkClient Using default ZkCredentialsInjector. ZkCredentialsInjector is not secure, it creates an empty list of credentials which leads to 'OPEN_ACL_UNSAFE' ACLs to Zookeeper nodes
  2> 215357 INFO  (SUITE-LeaderTragicEventTest-seed#[898F26CB91183204]-worker) [] o.a.s.c.c.ConnectionManager Waiting up to 15000ms for client to connect to ZooKeeper
  2> 215359 INFO  (zkCallback-2864-thread-1) [] o.a.s.c.c.ConnectionManager zkClient has connected
  2> 215359 INFO  (SUITE-LeaderTragicEventTest-seed#[898F26CB91183204]-worker) [] o.a.s.c.c.ConnectionManager Client is connected to ZooKeeper
  2> 215359 WARN  (SUITE-LeaderTragicEventTest-seed#[898F26CB91183204]-worker) [] o.a.s.c.c.SolrZkClient Using default ZkACLProvider. DefaultZkACLProvider is not secure, it creates 'OPEN_ACL_UNSAFE' ACLs to Zookeeper nodes
  2> 215360 INFO  (SUITE-LeaderTragicEventTest-seed#[898F26CB91183204]-worker) [] o.a.s.c.c.ZkStateReader Updated live nodes from ZooKeeper... (0) -> (2)
  2> 215361 INFO  (SUITE-LeaderTragicEventTest-seed#[898F26CB91183204]-worker) [] o.a.s.c.s.i.ZkClientClusterStateProvider Cluster at 127.0.0.1:37559/solr ready
  2> 215361 INFO  (SUITE-LeaderTragicEventTest-seed#[898F26CB91183204]-worker) [] o.a.s.c.MiniSolrCloudCluster waitForNode: 127.0.0.1:38699_solr
  2> 215361 WARN  (SUITE-LeaderTragicEventTest-seed#[898F26CB91183204]-worker) [] o.a.s.c.c.SolrZkClient Using default ZkCredentialsInjector. ZkCredentialsInjector is not secure, it creates an empty list of credentials which leads to 'OPEN_ACL_UNSAFE' ACLs to Zookeeper nodes
  2> 215362 INFO  (SUITE-LeaderTragicEventTest-seed#[898F26CB91183204]-worker) [] o.a.s.c.c.ConnectionManager Waiting up to 45000ms for client to connect to ZooKeeper
  2> 215363 INFO  (zkCallback-2867-thread-1) [] o.a.s.c.c.ConnectionManager zkClient has connected
  2> 215363 INFO  (SUITE-LeaderTragicEventTest-seed#[898F26CB91183204]-worker) [] o.a.s.c.c.ConnectionManager Client is connected to ZooKeeper
  2> 215363 WARN  (SUITE-LeaderTragicEventTest-seed#[898F26CB91183204]-worker) [] o.a.s.c.c.SolrZkClient Using default ZkACLProvider. DefaultZkACLProvider is not secure, it creates 'OPEN_ACL_UNSAFE' ACLs to Zookeeper nodes
  2> 215478 INFO  (TEST-LeaderTragicEventTest.testOtherReplicasAreNotActive-seed#[898F26CB91183204]) [] o.a.s.SolrTestCaseJ4 ###Starting testOtherReplicasAreNotActive
  2> 215484 INFO  (OverseerThreadFactory-2855-thread-1) [ c:testOtherReplicasAreNotActive] o.a.s.c.a.c.CreateCollectionCmd Create collection testOtherReplicasAreNotActive
  2> 215487 INFO  (OverseerThreadFactory-2855-thread-1) [ c:testOtherReplicasAreNotActive] o.a.s.c.c.ZkStateReader /collections/testOtherReplicasAreNotActive/state.json is deleted, stop watching children
  2> 215488 INFO  (zkCallback-2845-thread-1) [] o.a.s.c.c.ZkStateReader A cluster state change: [WatchedEvent state:SyncConnected type:NodeCreated path:/collections/testOtherReplicasAreNotActive/state.json zxid: 179] for collection [testOtherReplicasAreNotActive] has occurred - updating... (live nodes size: [2])
  2> 215494 INFO  (OverseerStateUpdate-72118299541897221-127.0.0.1:36255_solr-n_0000000000) [n:127.0.0.1:36255_solr] o.a.s.c.o.SliceMutator createReplica() {
  2>   "core":"testOtherReplicasAreNotActive_shard1_replica_n1",
  2>   "node_name":"127.0.0.1:36255_solr",
  2>   "base_url":"http://127.0.0.1:36255/solr",
  2>   "collection":"testOtherReplicasAreNotActive",
  2>   "shard":"shard1",
  2>   "state":"down",
  2>   "type":"NRT",
  2>   "operation":"ADDREPLICA",
  2>   "waitForFinalState":"false"} 
  2> 215497 INFO  (OverseerStateUpdate-72118299541897221-127.0.0.1:36255_solr-n_0000000000) [n:127.0.0.1:36255_solr] o.a.s.c.o.SliceMutator createReplica() {
  2>   "core":"testOtherReplicasAreNotActive_shard1_replica_n2",
  2>   "node_name":"127.0.0.1:38699_solr",
  2>   "base_url":"http://127.0.0.1:38699/solr",
  2>   "collection":"testOtherReplicasAreNotActive",
  2>   "shard":"shard1",
  2>   "state":"down",
  2>   "type":"NRT",
  2>   "operation":"ADDREPLICA",
  2>   "waitForFinalState":"false"} 
  2> 215600 INFO  (zkCallback-2845-thread-1) [] o.a.s.c.c.ZkStateReader A cluster state change: [WatchedEvent state:SyncConnected type:NodeDataChanged path:/collections/testOtherReplicasAreNotActive/state.json zxid: 188] for collection [testOtherReplicasAreNotActive] has occurred - updating... (live nodes size: [2])
  2> 215604 INFO  (qtp2054880329-4240-null-3633) [n:127.0.0.1:36255_solr x:testOtherReplicasAreNotActive_shard1_replica_n1 t:null-3633] o.a.s.h.a.CoreAdminOperation core create command coreNodeName=core_node3&collection.configName=config&newCollection=true&name=testOtherReplicasAreNotActive_shard1_replica_n1&action=CREATE&numShards=1&collection=testOtherReplicasAreNotActive&shard=shard1&wt=javabin&version=2&replicaType=NRT
  2> 215604 INFO  (qtp1641923729-4245-null-3633) [n:127.0.0.1:38699_solr x:testOtherReplicasAreNotActive_shard1_replica_n2 t:null-3633] o.a.s.h.a.CoreAdminOperation core create command coreNodeName=core_node4&collection.configName=config&newCollection=true&name=testOtherReplicasAreNotActive_shard1_replica_n2&action=CREATE&numShards=1&collection=testOtherReplicasAreNotActive&shard=shard1&wt=javabin&version=2&replicaType=NRT
  2> 215613 INFO  (qtp2054880329-4240-null-3633) [n:127.0.0.1:36255_solr c:testOtherReplicasAreNotActive s:shard1 r:core_node3 x:testOtherReplicasAreNotActive_shard1_replica_n1 t:null-3633] o.a.s.c.SolrConfig Using Lucene MatchVersion: 9.12.3
  2> 215613 INFO  (qtp1641923729-4245-null-3633) [n:127.0.0.1:38699_solr c:testOtherReplicasAreNotActive s:shard1 r:core_node4 x:testOtherReplicasAreNotActive_shard1_replica_n2 t:null-3633] o.a.s.c.SolrConfig Using Lucene MatchVersion: 9.12.3
  2> 215616 INFO  (qtp2054880329-4240-null-3633) [n:127.0.0.1:36255_solr c:testOtherReplicasAreNotActive s:shard1 r:core_node3 x:testOtherReplicasAreNotActive_shard1_replica_n1 t:null-3633] o.a.s.s.IndexSchema Schema name=minimal
  2> 215616 INFO  (qtp1641923729-4245-null-3633) [n:127.0.0.1:38699_solr c:testOtherReplicasAreNotActive s:shard1 r:core_node4 x:testOtherReplicasAreNotActive_shard1_replica_n2 t:null-3633] o.a.s.s.IndexSchema Schema name=minimal
  2> 215616 INFO  (qtp2054880329-4240-null-3633) [n:127.0.0.1:36255_solr c:testOtherReplicasAreNotActive s:shard1 r:core_node3 x:testOtherReplicasAreNotActive_shard1_replica_n1 t:null-3633] o.a.s.s.IndexSchema Loaded schema minimal/1.7 with uniqueid field id
  2> 215616 INFO  (qtp2054880329-4240-null-3633) [n:127.0.0.1:36255_solr c:testOtherReplicasAreNotActive s:shard1 r:core_node3 x:testOtherReplicasAreNotActive_shard1_replica_n1 t:null-3633] o.a.s.c.CoreContainer Creating SolrCore 'testOtherReplicasAreNotActive_shard1_replica_n1' using configuration from configset config, trusted=true
  2> 215616 INFO  (qtp2054880329-4240-null-3633) [n:127.0.0.1:36255_solr c:testOtherReplicasAreNotActive s:shard1 r:core_node3 x:testOtherReplicasAreNotActive_shard1_replica_n1 t:null-3633] o.a.s.c.SolrCore Opening new SolrCore at [/home/jenkins/jenkins-agent/workspace/Solr/Solr-Test-9.x/solr/core/build/tmp/tests-tmp/org.apache.solr.cloud.LeaderTragicEventTest_898F26CB91183204-001/tempDir-001/node2/testOtherReplicasAreNotActive_shard1_replica_n1], dataDir=[/home/jenkins/jenkins-agent/workspace/Solr/Solr-Test-9.x/solr/core/build/tmp/tests-tmp/org.apache.solr.cloud.LeaderTragicEventTest_898F26CB91183204-001/tempDir-001/node2/testOtherReplicasAreNotActive_shard1_replica_n1/data/]
  2> 215616 INFO  (qtp1641923729-4245-null-3633) [n:127.0.0.1:38699_solr c:testOtherReplicasAreNotActive s:shard1 r:core_node4 x:testOtherReplicasAreNotActive_shard1_replica_n2 t:null-3633] o.a.s.s.IndexSchema Loaded schema minimal/1.7 with uniqueid field id
  2> 215616 INFO  (qtp1641923729-4245-null-3633) [n:127.0.0.1:38699_solr c:testOtherReplicasAreNotActive s:shard1 r:core_node4 x:testOtherReplicasAreNotActive_shard1_replica_n2 t:null-3633] o.a.s.c.CoreContainer Creating SolrCore 'testOtherReplicasAreNotActive_shard1_replica_n2' using configuration from configset config, trusted=true
  2> 215617 INFO  (qtp1641923729-4245-null-3633) [n:127.0.0.1:38699_solr c:testOtherReplicasAreNotActive s:shard1 r:core_node4 x:testOtherReplicasAreNotActive_shard1_replica_n2 t:null-3633] o.a.s.c.SolrCore Opening new SolrCore at [/home/jenkins/jenkins-agent/workspace/Solr/Solr-Test-9.x/solr/core/build/tmp/tests-tmp/org.apache.solr.cloud.LeaderTragicEventTest_898F26CB91183204-001/tempDir-001/node1/testOtherReplicasAreNotActive_shard1_replica_n2], dataDir=[/home/jenkins/jenkins-agent/workspace/Solr/Solr-Test-9.x/solr/core/build/tmp/tests-tmp/org.apache.solr.cloud.LeaderTragicEventTest_898F26CB91183204-001/tempDir-001/node1/testOtherReplicasAreNotActive_shard1_replica_n2/data/]
  2> 215645 INFO  (qtp2054880329-4240-null-3633) [n:127.0.0.1:36255_solr c:testOtherReplicasAreNotActive s:shard1 r:core_node3 x:testOtherReplicasAreNotActive_shard1_replica_n1 t:null-3633] o.a.s.j.SolrRequestAuthorizer Creating a new SolrRequestAuthorizer
  2> 215645 INFO  (qtp1641923729-4245-null-3633) [n:127.0.0.1:38699_solr c:testOtherReplicasAreNotActive s:shard1 r:core_node4 x:testOtherReplicasAreNotActive_shard1_replica_n2 t:null-3633] o.a.s.j.SolrRequestAuthorizer Creating a new SolrRequestAuthorizer
  2> 215649 INFO  (qtp2054880329-4240-null-3633) [n:127.0.0.1:36255_solr c:testOtherReplicasAreNotActive s:shard1 r:core_node3 x:testOtherReplicasAreNotActive_shard1_replica_n1 t:null-3633] o.a.s.u.UpdateHandler Using UpdateLog implementation: org.apache.solr.update.UpdateLog
  2> 215649 INFO  (qtp2054880329-4240-null-3633) [n:127.0.0.1:36255_solr c:testOtherReplicasAreNotActive s:shard1 r:core_node3 x:testOtherReplicasAreNotActive_shard1_replica_n1 t:null-3633] o.a.s.u.UpdateLog Initializing UpdateLog: dataDir=null defaultSyncLevel=FLUSH numRecordsToKeep=100 maxNumLogsToKeep=10
  2> 215649 INFO  (qtp2054880329-4240-null-3633) [n:127.0.0.1:36255_solr c:testOtherReplicasAreNotActive s:shard1 r:core_node3 x:testOtherReplicasAreNotActive_shard1_replica_n1 t:null-3633] o.a.s.u.CommitTracker Hard AutoCommit: disabled
  2> 215649 INFO  (qtp2054880329-4240-null-3633) [n:127.0.0.1:36255_solr c:testOtherReplicasAreNotActive s:shard1 r:core_node3 x:testOtherReplicasAreNotActive_shard1_replica_n1 t:null-3633] o.a.s.u.CommitTracker Soft AutoCommit: disabled
  2> 215649 INFO  (qtp1641923729-4245-null-3633) [n:127.0.0.1:38699_solr c:testOtherReplicasAreNotActive s:shard1 r:core_node4 x:testOtherReplicasAreNotActive_shard1_replica_n2 t:null-3633] o.a.s.u.UpdateHandler Using UpdateLog implementation: org.apache.solr.update.UpdateLog
  2> 215649 INFO  (qtp1641923729-4245-null-3633) [n:127.0.0.1:38699_solr c:testOtherReplicasAreNotActive s:shard1 r:core_node4 x:testOtherReplicasAreNotActive_shard1_replica_n2 t:null-3633] o.a.s.u.UpdateLog Initializing UpdateLog: dataDir=null defaultSyncLevel=FLUSH numRecordsToKeep=100 maxNumLogsToKeep=10
  2> 215649 INFO  (qtp1641923729-4245-null-3633) [n:127.0.0.1:38699_solr c:testOtherReplicasAreNotActive s:shard1 r:core_node4 x:testOtherReplicasAreNotActive_shard1_replica_n2 t:null-3633] o.a.s.u.CommitTracker Hard AutoCommit: disabled
  2> 215649 INFO  (qtp1641923729-4245-null-3633) [n:127.0.0.1:38699_solr c:testOtherReplicasAreNotActive s:shard1 r:core_node4 x:testOtherReplicasAreNotActive_shard1_replica_n2 t:null-3633] o.a.s.u.CommitTracker Soft AutoCommit: disabled
  2> 215652 INFO  (qtp2054880329-4240-null-3633) [n:127.0.0.1:36255_solr c:testOtherReplicasAreNotActive s:shard1 r:core_node3 x:testOtherReplicasAreNotActive_shard1_replica_n1 t:null-3633] o.a.s.r.ManagedResourceStorage Configured ZooKeeperStorageIO with znodeBase: /configs/config
  2> 215652 INFO  (qtp1641923729-4245-null-3633) [n:127.0.0.1:38699_solr c:testOtherReplicasAreNotActive s:shard1 r:core_node4 x:testOtherReplicasAreNotActive_shard1_replica_n2 t:null-3633] o.a.s.r.ManagedResourceStorage Configured ZooKeeperStorageIO with znodeBase: /configs/config
  2> 215652 INFO  (qtp1641923729-4245-null-3633) [n:127.0.0.1:38699_solr c:testOtherReplicasAreNotActive s:shard1 r:core_node4 x:testOtherReplicasAreNotActive_shard1_replica_n2 t:null-3633] o.a.s.r.ManagedResourceStorage Loaded null at path _rest_managed.json using ZooKeeperStorageIO:path=/configs/config
  2> 215652 INFO  (qtp2054880329-4240-null-3633) [n:127.0.0.1:36255_solr c:testOtherReplicasAreNotActive s:shard1 r:core_node3 x:testOtherReplicasAreNotActive_shard1_replica_n1 t:null-3633] o.a.s.r.ManagedResourceStorage Loaded null at path _rest_managed.json using ZooKeeperStorageIO:path=/configs/config
  2> 215652 INFO  (qtp1641923729-4245-null-3633) [n:127.0.0.1:38699_solr c:testOtherReplicasAreNotActive s:shard1 r:core_node4 x:testOtherReplicasAreNotActive_shard1_replica_n2 t:null-3633] o.a.s.h.ReplicationHandler Commits will be reserved for 10000 ms
  2> 215652 INFO  (qtp2054880329-4240-null-3633) [n:127.0.0.1:36255_solr c:testOtherReplicasAreNotActive s:shard1 r:core_node3 x:testOtherReplicasAreNotActive_shard1_replica_n1 t:null-3633] o.a.s.h.ReplicationHandler Commits will be reserved for 10000 ms
  2> 215653 INFO  (searcherExecutor-2873-thread-1-processing-127.0.0.1:38699_solr testOtherReplicasAreNotActive_shard1_replica_n2 null-3633 testOtherReplicasAreNotActive shard1 core_node4) [n:127.0.0.1:38699_solr c:testOtherReplicasAreNotActive s:shard1 r:core_node4 x:testOtherReplicasAreNotActive_shard1_replica_n2 t:null-3633] o.a.s.c.SolrCore Registered new searcher autowarm time: 0 ms
  2> 215653 INFO  (searcherExecutor-2871-thread-1-processing-127.0.0.1:36255_solr testOtherReplicasAreNotActive_shard1_replica_n1 null-3633 testOtherReplicasAreNotActive shard1 core_node3) [n:127.0.0.1:36255_solr c:testOtherReplicasAreNotActive s:shard1 r:core_node3 x:testOtherReplicasAreNotActive_shard1_replica_n1 t:null-3633] o.a.s.c.SolrCore Registered new searcher autowarm time: 0 ms
  2> 215656 INFO  (qtp1641923729-4245-null-3633) [n:127.0.0.1:38699_solr c:testOtherReplicasAreNotActive s:shard1 r:core_node4 x:testOtherReplicasAreNotActive_shard1_replica_n2 t:null-3633] o.a.s.c.ZkShardTerms Failed to save terms, version is not a match, retrying
  2> 215656 INFO  (qtp2054880329-4240-null-3633) [n:127.0.0.1:36255_solr c:testOtherReplicasAreNotActive s:shard1 r:core_node3 x:testOtherReplicasAreNotActive_shard1_replica_n1 t:null-3633] o.a.s.c.ZkShardTerms Successful update of terms at /collections/testOtherReplicasAreNotActive/terms/shard1 to Terms{values={core_node3=0}, version=0} for registerTerm
  2> 215656 INFO  (qtp2054880329-4240-null-3633) [n:127.0.0.1:36255_solr c:testOtherReplicasAreNotActive s:shard1 r:core_node3 x:testOtherReplicasAreNotActive_shard1_replica_n1 t:null-3633] o.a.s.c.ShardLeaderElectionContextBase make sure parent is created /collections/testOtherReplicasAreNotActive/leaders/shard1
  2> 215657 INFO  (qtp1641923729-4245-null-3633) [n:127.0.0.1:38699_solr c:testOtherReplicasAreNotActive s:shard1 r:core_node4 x:testOtherReplicasAreNotActive_shard1_replica_n2 t:null-3633] o.a.s.c.ZkShardTerms Successful update of terms at /collections/testOtherReplicasAreNotActive/terms/shard1 to Terms{values={core_node3=0, core_node4=0}, version=1} for registerTerm
  2> 215657 INFO  (qtp1641923729-4245-null-3633) [n:127.0.0.1:38699_solr c:testOtherReplicasAreNotActive s:shard1 r:core_node4 x:testOtherReplicasAreNotActive_shard1_replica_n2 t:null-3633] o.a.s.c.ShardLeaderElectionContextBase make sure parent is created /collections/testOtherReplicasAreNotActive/leaders/shard1
  2> 215661 INFO  (qtp1641923729-4245-null-3633) [n:127.0.0.1:38699_solr c:testOtherReplicasAreNotActive s:shard1 r:core_node4 x:testOtherReplicasAreNotActive_shard1_replica_n2 t:null-3633] o.a.s.c.ShardLeaderElectionContext Enough replicas found to continue.
  2> 215661 INFO  (qtp1641923729-4245-null-3633) [n:127.0.0.1:38699_solr c:testOtherReplicasAreNotActive s:shard1 r:core_node4 x:testOtherReplicasAreNotActive_shard1_replica_n2 t:null-3633] o.a.s.c.ShardLeaderElectionContext I may be the new leader - try and sync
  2> 215661 INFO  (qtp1641923729-4245-null-3633) [n:127.0.0.1:38699_solr c:testOtherReplicasAreNotActive s:shard1 r:core_node4 x:testOtherReplicasAreNotActive_shard1_replica_n2 t:null-3633] o.a.s.c.SyncStrategy Sync replicas to http://127.0.0.1:38699/solr/testOtherReplicasAreNotActive_shard1_replica_n2/
  2> 215661 INFO  (qtp1641923729-4245-null-3633) [n:127.0.0.1:38699_solr c:testOtherReplicasAreNotActive s:shard1 r:core_node4 x:testOtherReplicasAreNotActive_shard1_replica_n2 t:null-3633] o.a.s.u.PeerSync PeerSync: core=testOtherReplicasAreNotActive_shard1_replica_n2 url=http://127.0.0.1:38699/solr  START replicas=[http://127.0.0.1:36255/solr/testOtherReplicasAreNotActive_shard1_replica_n1/] nUpdates=100
  2> 215662 INFO  (qtp1641923729-4245-null-3633) [n:127.0.0.1:38699_solr c:testOtherReplicasAreNotActive s:shard1 r:core_node4 x:testOtherReplicasAreNotActive_shard1_replica_n2 t:null-3633] o.a.s.u.PeerSync PeerSync: core=testOtherReplicasAreNotActive_shard1_replica_n2 url=http://127.0.0.1:38699/solr  DONE. We have no versions. sync failed.
  2> 215664 INFO  (qtp2054880329-4246-null-3633) [n:127.0.0.1:36255_solr c:testOtherReplicasAreNotActive s:shard1 r:core_node3 x:testOtherReplicasAreNotActive_shard1_replica_n1 t:null-3633] o.a.s.c.S.Request webapp=/solr path=/get params={distrib=false&fingerprint=false&getVersions=100&wt=javabin&version=2} status=0 QTime=0
  2> 215664 INFO  (qtp1641923729-4245-null-3633) [n:127.0.0.1:38699_solr c:testOtherReplicasAreNotActive s:shard1 r:core_node4 x:testOtherReplicasAreNotActive_shard1_replica_n2 t:null-3633] o.a.s.c.SyncStrategy Leader's attempt to sync with shard failed, moving to the next candidate
  2> 215664 INFO  (qtp1641923729-4245-null-3633) [n:127.0.0.1:38699_solr c:testOtherReplicasAreNotActive s:shard1 r:core_node4 x:testOtherReplicasAreNotActive_shard1_replica_n2 t:null-3633] o.a.s.c.ShardLeaderElectionContext We failed sync, but we have no versions - we can't sync in that case - we were active before, so become leader anyway
  2> 215664 INFO  (qtp1641923729-4245-null-3633) [n:127.0.0.1:38699_solr c:testOtherReplicasAreNotActive s:shard1 r:core_node4 x:testOtherReplicasAreNotActive_shard1_replica_n2 t:null-3633] o.a.s.c.ShardLeaderElectionContextBase Creating leader registration node /collections/testOtherReplicasAreNotActive/leaders/shard1/leader after winning as /collections/testOtherReplicasAreNotActive/leader_elect/shard1/election/72118299541897222-core_node4-n_0000000000
  2> 215666 INFO  (qtp1641923729-4245-null-3633) [n:127.0.0.1:38699_solr c:testOtherReplicasAreNotActive s:shard1 r:core_node4 x:testOtherReplicasAreNotActive_shard1_replica_n2 t:null-3633] o.a.s.c.ShardLeaderElectionContext I am the new leader: http://127.0.0.1:38699/solr/testOtherReplicasAreNotActive_shard1_replica_n2/ shard1
  2> 215769 INFO  (zkCallback-2847-thread-1) [] o.a.s.c.c.ZkStateReader A cluster state change: [WatchedEvent state:SyncConnected type:NodeDataChanged path:/collections/testOtherReplicasAreNotActive/state.json zxid: 216] for collection [testOtherReplicasAreNotActive] has occurred - updating... (live nodes size: [2])
  2> 215770 INFO  (qtp1641923729-4245-null-3633) [n:127.0.0.1:38699_solr c:testOtherReplicasAreNotActive s:shard1 r:core_node4 x:testOtherReplicasAreNotActive_shard1_replica_n2 t:null-3633] o.a.s.c.ZkController I am the leader, no recovery necessary
  2> 215773 INFO  (qtp1641923729-4245-null-3633) [n:127.0.0.1:38699_solr t:null-3633] o.a.s.s.HttpSolrCall [admin] webapp=null path=/admin/cores params={coreNodeName=core_node4&collection.configName=config&newCollection=true&name=testOtherReplicasAreNotActive_shard1_replica_n2&action=CREATE&numShards=1&collection=testOtherReplicasAreNotActive&shard=shard1&wt=javabin&version=2&replicaType=NRT} status=0 QTime=168
  2> 215873 INFO  (zkCallback-2847-thread-1) [] o.a.s.c.c.ZkStateReader A cluster state change: [WatchedEvent state:SyncConnected type:NodeDataChanged path:/collections/testOtherReplicasAreNotActive/state.json zxid: 219] for collection [testOtherReplicasAreNotActive] has occurred - updating... (live nodes size: [2])
  2> 216664 INFO  (qtp2054880329-4240-null-3633) [n:127.0.0.1:36255_solr t:null-3633] o.a.s.s.HttpSolrCall [admin] webapp=null path=/admin/cores params={coreNodeName=core_node3&collection.configName=config&newCollection=true&name=testOtherReplicasAreNotActive_shard1_replica_n1&action=CREATE&numShards=1&collection=testOtherReplicasAreNotActive&shard=shard1&wt=javabin&version=2&replicaType=NRT} status=0 QTime=1060
  2> 216667 INFO  (qtp1641923729-4239-null-3632) [n:127.0.0.1:38699_solr c:testOtherReplicasAreNotActive t:null-3632] o.a.s.h.a.CollectionsHandler Wait for new collection to be active for at most 45 seconds. Check all shard replicas
  2> 216765 INFO  (zkCallback-2847-thread-1) [] o.a.s.c.c.ZkStateReader A cluster state change: [WatchedEvent state:SyncConnected type:NodeDataChanged path:/collections/testOtherReplicasAreNotActive/state.json zxid: 225] for collection [testOtherReplicasAreNotActive] has occurred - updating... (live nodes size: [2])
  2> 216765 INFO  (zkCallback-2845-thread-1) [] o.a.s.c.c.ZkStateReader A cluster state change: [WatchedEvent state:SyncConnected type:NodeDataChanged path:/collections/testOtherReplicasAreNotActive/state.json zxid: 225] for collection [testOtherReplicasAreNotActive] has occurred - updating... (live nodes size: [2])
  2> 216766 INFO  (qtp1641923729-4239-null-3632) [n:127.0.0.1:38699_solr c:testOtherReplicasAreNotActive t:null-3632] o.a.s.s.HttpSolrCall [admin] webapp=null path=/admin/collections params={collection.configName=config&name=testOtherReplicasAreNotActive&nrtReplicas=2&action=CREATE&numShards=1&wt=javabin&version=2} status=0 QTime=1285
  2> 216766 INFO  (TEST-LeaderTragicEventTest.testOtherReplicasAreNotActive-seed#[898F26CB91183204]) [] o.a.s.c.MiniSolrCloudCluster waitForActiveCollection: testOtherReplicasAreNotActive
  2> 216768 INFO  (TEST-LeaderTragicEventTest.testOtherReplicasAreNotActive-seed#[898F26CB91183204]) [] o.a.s.c.LeaderTragicEventTest Stop jetty node : http://127.0.0.1:36255/solr state:DocCollection(testOtherReplicasAreNotActive//collections/testOtherReplicasAreNotActive/state.json/4 )={
  2>   "pullReplicas":"0",
  2>   "configName":"config",
  2>   "replicationFactor":2,
  2>   "router":{"name":"compositeId"},
  2>   "nrtReplicas":2,
  2>   "tlogReplicas":"0",
  2>   "shards":{"shard1":{
  2>       "range":"80000000-7fffffff",
  2>       "state":"active",
  2>       "replicas":{
  2>         "core_node3":{
  2>           "core":"testOtherReplicasAreNotActive_shard1_replica_n1",
  2>           "node_name":"127.0.0.1:36255_solr",
  2>           "type":"NRT",
  2>           "state":"active",
  2>           "force_set_state":"false",
  2>           "base_url":"http://127.0.0.1:36255/solr"},
  2>         "core_node4":{
  2>           "core":"testOtherReplicasAreNotActive_shard1_replica_n2",
  2>           "node_name":"127.0.0.1:38699_solr",
  2>           "type":"NRT",
  2>           "state":"active",
  2>           "leader":"true",
  2>           "force_set_state":"false",
  2>           "base_url":"http://127.0.0.1:38699/solr"}}}}}
  2> 216768 INFO  (TEST-LeaderTragicEventTest.testOtherReplicasAreNotActive-seed#[898F26CB91183204]) [] o.e.j.s.Server Stopped Server@64c3128a{STOPPING}[10.0.26,sto=15000]
  2> 216769 INFO  (TEST-LeaderTragicEventTest.testOtherReplicasAreNotActive-seed#[898F26CB91183204]) [] o.e.j.s.Server Shutdown Server@64c3128a{STOPPING}[10.0.26,sto=15000]
  2> 216770 INFO  (TEST-LeaderTragicEventTest.testOtherReplicasAreNotActive-seed#[898F26CB91183204]) [] o.e.j.s.AbstractConnector Stopped ServerConnector@74bd1d76{HTTP/1.1, (http/1.1, h2c)}{127.0.0.1:0}
  2> 216770 INFO  (TEST-LeaderTragicEventTest.testOtherReplicasAreNotActive-seed#[898F26CB91183204]) [] o.a.s.c.CoreContainer Shutting down CoreContainer instance=560801637
  2> 216770 INFO  (TEST-LeaderTragicEventTest.testOtherReplicasAreNotActive-seed#[898F26CB91183204]) [] o.a.s.c.ZkController Remove node as live in ZooKeeper:/live_nodes/127.0.0.1:36255_solr
  2> 216770 INFO  (TEST-LeaderTragicEventTest.testOtherReplicasAreNotActive-seed#[898F26CB91183204]) [] o.a.s.c.ZkController Publish this node as DOWN...
  2> 216770 INFO  (TEST-LeaderTragicEventTest.testOtherReplicasAreNotActive-seed#[898F26CB91183204]) [] o.a.s.c.ZkController Publish node=127.0.0.1:36255_solr as DOWN
  2> 216771 INFO  (zkCallback-2847-thread-1) [] o.a.s.c.c.ZkStateReader Updated live nodes from ZooKeeper... (2) -> (1)
  2> 216771 INFO  (zkCallback-2845-thread-1) [] o.a.s.c.c.ZkStateReader Updated live nodes from ZooKeeper... (2) -> (1)
  2> 216771 INFO  (zkCallback-2864-thread-1) [] o.a.s.c.c.ZkStateReader Updated live nodes from ZooKeeper... (2) -> (1)
  2> 216772 INFO  (TEST-LeaderTragicEventTest.testOtherReplicasAreNotActive-seed#[898F26CB91183204]) [n:127.0.0.1:36255_solr] o.a.s.c.ShardLeaderElectionContextBase No version found for ephemeral leader parent node, won't remove previous leader registration.
  2> 216773 INFO  (coreCloseExecutor-2884-thread-1-processing-127.0.0.1:36255_solr) [n:127.0.0.1:36255_solr c:testOtherReplicasAreNotActive s:shard1 r:core_node3 x:testOtherReplicasAreNotActive_shard1_replica_n1] o.a.s.c.SolrCore CLOSING SolrCore org.apache.solr.core.SolrCore@d8850ba testOtherReplicasAreNotActive_shard1_replica_n1
  2> 216773 INFO  (coreCloseExecutor-2884-thread-1-processing-127.0.0.1:36255_solr) [n:127.0.0.1:36255_solr c:testOtherReplicasAreNotActive s:shard1 r:core_node3 x:testOtherReplicasAreNotActive_shard1_replica_n1] o.a.s.m.SolrMetricManager Closing metric reporters for registry=solr.core.testOtherReplicasAreNotActive.shard1.replica_n1 tag=SolrCore@d8850ba
  2> 216773 INFO  (coreCloseExecutor-2884-thread-1-processing-127.0.0.1:36255_solr) [n:127.0.0.1:36255_solr c:testOtherReplicasAreNotActive s:shard1 r:core_node3 x:testOtherReplicasAreNotActive_shard1_replica_n1] o.a.s.m.SolrMetricManager Closing metric reporters for registry=solr.collection.testOtherReplicasAreNotActive.shard1.leader tag=SolrCore@d8850ba
  2> 216774 INFO  (coreCloseExecutor-2884-thread-1-processing-127.0.0.1:36255_solr) [n:127.0.0.1:36255_solr c:testOtherReplicasAreNotActive s:shard1 r:core_node3 x:testOtherReplicasAreNotActive_shard1_replica_n1] o.a.s.u.DirectUpdateHandler2 Committing on IndexWriter.close()  ... SKIPPED (unnecessary).
  2> 216775 INFO  (TEST-LeaderTragicEventTest.testOtherReplicasAreNotActive-seed#[898F26CB91183204]) [n:127.0.0.1:36255_solr] o.a.s.m.SolrMetricManager Closing metric reporters for registry=solr.node tag=null
  2> 216775 INFO  (TEST-LeaderTragicEventTest.testOtherReplicasAreNotActive-seed#[898F26CB91183204]) [n:127.0.0.1:36255_solr] o.a.s.m.SolrMetricManager Closing metric reporters for registry=solr.jvm tag=null
  2> 216775 INFO  (TEST-LeaderTragicEventTest.testOtherReplicasAreNotActive-seed#[898F26CB91183204]) [n:127.0.0.1:36255_solr] o.a.s.m.SolrMetricManager Closing metric reporters for registry=solr.jetty tag=null
  2> 216775 INFO  (TEST-LeaderTragicEventTest.testOtherReplicasAreNotActive-seed#[898F26CB91183204]) [n:127.0.0.1:36255_solr] o.a.s.m.SolrMetricManager Closing metric reporters for registry=solr.cluster tag=null
  2> 216776 INFO  (closeThreadPool-2885-thread-1-processing-127.0.0.1:36255_solr) [n:127.0.0.1:36255_solr] o.a.s.c.Overseer Overseer (id=72118299541897221-127.0.0.1:36255_solr-n_0000000000) closing
  2> 216776 INFO  (OverseerStateUpdate-72118299541897221-127.0.0.1:36255_solr-n_0000000000) [n:127.0.0.1:36255_solr] o.a.s.c.Overseer Overseer Loop exiting : 127.0.0.1:36255_solr
  2> 216776 INFO  (closeThreadPool-2885-thread-2-processing-127.0.0.1:36255_solr) [n:127.0.0.1:36255_solr] o.a.s.c.Overseer Overseer (id=72118299541897221-127.0.0.1:36255_solr-n_0000000000) closing
  2> 216778 INFO  (zkCallback-2847-thread-1) [] o.a.s.c.OverseerElectionContext I am going to be the leader 127.0.0.1:38699_solr
  2> 216778 INFO  (zkCallback-2847-thread-1) [n:127.0.0.1:38699_solr] o.a.s.c.Overseer Overseer (id=72118299541897222-127.0.0.1:38699_solr-n_0000000001) starting
  2> 216781 INFO  (OverseerStateUpdate-72118299541897222-127.0.0.1:38699_solr-n_0000000001) [n:127.0.0.1:38699_solr] o.a.s.c.Overseer Starting to work on the main queue : 127.0.0.1:38699_solr
  2> 216784 INFO  (zkCallback-2847-thread-1) [] o.a.s.c.c.ZkStateReader A cluster state change: [WatchedEvent state:SyncConnected type:NodeDataChanged path:/collections/testOtherReplicasAreNotActive/state.json zxid: 234] for collection [testOtherReplicasAreNotActive] has occurred - updating... (live nodes size: [1])
  2> 216877 INFO  (TEST-LeaderTragicEventTest.testOtherReplicasAreNotActive-seed#[898F26CB91183204]) [n:127.0.0.1:36255_solr] o.a.s.c.Overseer Overseer (id=72118299541897221-127.0.0.1:36255_solr-n_0000000000) closing
  2> 216878 INFO  (TEST-LeaderTragicEventTest.testOtherReplicasAreNotActive-seed#[898F26CB91183204]) [n:127.0.0.1:36255_solr] o.e.j.s.h.ContextHandler Stopped o.e.j.s.ServletContextHandler@338906d7{/solr,file:///home/jenkins/jenkins-agent/workspace/Solr/Solr-Test-9.x/solr/core/build/tmp/tests-cwd/,STOPPED}
  2> 216879 INFO  (TEST-LeaderTragicEventTest.testOtherReplicasAreNotActive-seed#[898F26CB91183204]) [] o.a.s.c.MiniSolrCloudCluster Cannot wait for Jetty with null node name
  2> 216879 INFO  (TEST-LeaderTragicEventTest.testOtherReplicasAreNotActive-seed#[898F26CB91183204]) [] o.a.s.c.SolrCloudTestCase waitForState (testOtherReplicasAreNotActive): Timeout waiting for replica get down
  2> 216880 INFO  (TEST-LeaderTragicEventTest.testOtherReplicasAreNotActive-seed#[898F26CB91183204]) [] o.a.s.c.LeaderTragicEventTest Will crash leader : core_node4:{
  2>   "core":"testOtherReplicasAreNotActive_shard1_replica_n2",
  2>   "leader":"true",
  2>   "node_name":"127.0.0.1:38699_solr",
  2>   "base_url":"http://127.0.0.1:38699/solr",
  2>   "state":"active",
  2>   "type":"NRT",
  2>   "force_set_state":"false"}
  2> 216886 ERROR (qtp1641923729-4243-null-3634) [n:127.0.0.1:38699_solr c:testOtherReplicasAreNotActive s:shard1 r:core_node4 x:testOtherReplicasAreNotActive_shard1_replica_n2 t:null-3634] o.a.s.u.SolrIndexWriter Error closing IndexWriter
  2>           =>java.lang.IllegalStateException: this writer hit an unrecoverable error; cannot flush
  2> 	at org.apache.lucene.index.IndexWriter.doFlush(IndexWriter.java:4268)
  2> 
  2> 216887 INFO  (qtp1641923729-4243-null-3634) [n:127.0.0.1:38699_solr c:testOtherReplicasAreNotActive s:shard1 r:core_node4 x:testOtherReplicasAreNotActive_shard1_replica_n2 t:null-3634] o.a.s.u.DefaultSolrCoreState New IndexWriter is ready to be used.
  2> 216887 ERROR (qtp1641923729-4243-null-3634) [n:127.0.0.1:38699_solr c:testOtherReplicasAreNotActive s:shard1 r:core_node4 x:testOtherReplicasAreNotActive_shard1_replica_n2 t:null-3634] o.a.s.h.RequestHandlerBase Server exception
  2>           =>org.apache.solr.common.SolrException: Random tragedy fail
  2> 	at org.apache.solr.util.TestInjection.injectLeaderTragedy(TestInjection.java:407)
  2> 
  2> 216887 INFO  (qtp1641923729-4243-null-3634) [n:127.0.0.1:38699_solr c:testOtherReplicasAreNotActive s:shard1 r:core_node4 x:testOtherReplicasAreNotActive_shard1_replica_n2 t:null-3634] o.a.s.c.S.Request webapp=/solr path=/update params={commit=true&wt=javabin&version=2} status=500 QTime=2
  2> 216887 ERROR (qtp1641923729-4243-null-3634) [n:127.0.0.1:38699_solr c:testOtherReplicasAreNotActive s:shard1 r:core_node4 x:testOtherReplicasAreNotActive_shard1_replica_n2 t:null-3634] o.a.s.s.HttpSolrCall 500 Exception
  2>           =>org.apache.solr.common.SolrException: Random tragedy fail
  2> 	at org.apache.solr.util.TestInjection.injectLeaderTragedy(TestInjection.java:407)
  2> 
  2> 216888 INFO  (TEST-LeaderTragicEventTest.testOtherReplicasAreNotActive-seed#[898F26CB91183204]) [] o.a.s.c.LeaderTragicEventTest Tragic event triggered on attempt 1
  2> 216889 INFO  (TEST-LeaderTragicEventTest.testOtherReplicasAreNotActive-seed#[898F26CB91183204]) [] o.a.s.e.JettySolrRunner Start Jetty (configured port=0, binding port=36255)
  2> 216889 INFO  (TEST-LeaderTragicEventTest.testOtherReplicasAreNotActive-seed#[898F26CB91183204]) [] o.a.s.e.JettySolrRunner Trying to start Jetty on port 36255 try number 2 ...
  2> 216890 INFO  (TEST-LeaderTragicEventTest.testOtherReplicasAreNotActive-seed#[898F26CB91183204]) [] o.e.j.s.Server jetty-10.0.26; built: 2025-08-14T15:56:56.454Z; git: 65a55c55a68c56d5f2e8232164439bd6e76e53d1; jvm 11.0.24+8
  2> 216890 INFO  (TEST-LeaderTragicEventTest.testOtherReplicasAreNotActive-seed#[898F26CB91183204]) [] o.e.j.s.s.DefaultSessionIdManager Session workerName=node0
  2> 216891 INFO  (TEST-LeaderTragicEventTest.testOtherReplicasAreNotActive-seed#[898F26CB91183204]) [] o.a.s.e.JettySolrRunner Jetty properties: {hostContext=/solr, hostPort=36255, zkHost=127.0.0.1:37559/solr}
  2> 216891 ERROR (TEST-LeaderTragicEventTest.testOtherReplicasAreNotActive-seed#[898F26CB91183204]) [] o.a.s.u.StartupLoggingUtils Missing Java Option solr.log.dir. Logging may be missing or incomplete.
  2> 216891 INFO  (TEST-LeaderTragicEventTest.testOtherReplicasAreNotActive-seed#[898F26CB91183204]) [] o.a.s.s.CoreContainerProvider Using logger factory org.apache.logging.slf4j.Log4jLoggerFactory
  2> 216891 INFO  (TEST-LeaderTragicEventTest.testOtherReplicasAreNotActive-seed#[898F26CB91183204]) [] o.a.s.s.CoreContainerProvider  ___      _       Welcome to Apache Solr™ version 9.11.0
  2> 216891 INFO  (TEST-LeaderTragicEventTest.testOtherReplicasAreNotActive-seed#[898F26CB91183204]) [] o.a.s.s.CoreContainerProvider / __| ___| |_ _   Starting in cloud mode on port null
  2> 216891 INFO  (TEST-LeaderTragicEventTest.testOtherReplicasAreNotActive-seed#[898F26CB91183204]) [] o.a.s.s.CoreContainerProvider \__ \/ _ \ | '_|  Install dir: /home/jenkins/jenkins-agent/workspace/Solr/Solr-Test-9.x/solr
  2> 216891 INFO  (TEST-LeaderTragicEventTest.testOtherReplicasAreNotActive-seed#[898F26CB91183204]) [] o.a.s.s.CoreContainerProvider |___/\___/_|_|    Start time: 2026-07-27T23:34:27.362629Z
  2> 216891 INFO  (TEST-LeaderTragicEventTest.testOtherReplicasAreNotActive-seed#[898F26CB91183204]) [] o.a.s.s.CoreContainerProvider Solr Home: /home/jenkins/jenkins-agent/workspace/Solr/Solr-Test-9.x/solr/core/build/tmp/tests-tmp/org.apache.solr.cloud.LeaderTragicEventTest_898F26CB91183204-001/tempDir-001/node2 (source: servlet config: solr.solr.home)
  2> 216891 WARN  (TEST-LeaderTragicEventTest.testOtherReplicasAreNotActive-seed#[898F26CB91183204]) [] o.a.s.c.c.SolrZkClient Using default ZkCredentialsInjector. ZkCredentialsInjector is not secure, it creates an empty list of credentials which leads to 'OPEN_ACL_UNSAFE' ACLs to Zookeeper nodes
  2> 216892 INFO  (TEST-LeaderTragicEventTest.testOtherReplicasAreNotActive-seed#[898F26CB91183204]) [] o.a.s.c.c.ConnectionManager Waiting up to 30000ms for client to connect to ZooKeeper
  2> 216893 INFO  (zkCallback-2889-thread-1) [] o.a.s.c.c.ConnectionManager zkClient has connected
  2> 216894 INFO  (TEST-LeaderTragicEventTest.testOtherReplicasAreNotActive-seed#[898F26CB91183204]) [] o.a.s.c.c.ConnectionManager Client is connected to ZooKeeper
  2> 216894 WARN  (TEST-LeaderTragicEventTest.testOtherReplicasAreNotActive-seed#[898F26CB91183204]) [] o.a.s.c.c.SolrZkClient Using default ZkACLProvider. DefaultZkACLProvider is not secure, it creates 'OPEN_ACL_UNSAFE' ACLs to Zookeeper nodes
  2> 216894 INFO  (TEST-LeaderTragicEventTest.testOtherReplicasAreNotActive-seed#[898F26CB91183204]) [] o.a.s.c.NodeConfig solr.xml found in ZooKeeper. Loading...
  2> 216896 INFO  (TEST-LeaderTragicEventTest.testOtherReplicasAreNotActive-seed#[898F26CB91183204]) [] o.a.s.c.SolrXmlConfig Metrics collection is disabled.
  2> 217006 INFO  (TEST-LeaderTragicEventTest.testOtherReplicasAreNotActive-seed#[898F26CB91183204]) [] o.a.s.c.ZkContainer Zookeeper client=127.0.0.1:37559/solr
  2> 217006 INFO  (TEST-LeaderTragicEventTest.testOtherReplicasAreNotActive-seed#[898F26CB91183204]) [] o.a.s.c.DistributedClusterStateUpdater Creating DistributedClusterStateUpdater with useDistributedStateUpdate=false. Solr will be using Overseer based cluster state updates.
  2> 217007 INFO  (TEST-LeaderTragicEventTest.testOtherReplicasAreNotActive-seed#[898F26CB91183204]) [n:127.0.0.1:36255_solr] o.a.s.c.c.ConnectionManager Waiting up to 15000ms for client to connect to ZooKeeper
  2> 217008 INFO  (zkCallback-2901-thread-1) [] o.a.s.c.c.ConnectionManager zkClient has connected
  2> 217008 INFO  (TEST-LeaderTragicEventTest.testOtherReplicasAreNotActive-seed#[898F26CB91183204]) [n:127.0.0.1:36255_solr] o.a.s.c.c.ConnectionManager Client is connected to ZooKeeper
  2> 217015 WARN  (TEST-LeaderTragicEventTest.testOtherReplicasAreNotActive-seed#[898F26CB91183204]) [n:127.0.0.1:36255_solr] o.a.s.c.ZkController Contents of zookeeper /security.json are world-readable; consider setting up ACLs as described in https://solr.apache.org/guide/solr/latest/deployment-guide/zookeeper-access-control.html
  2> 217016 INFO  (TEST-LeaderTragicEventTest.testOtherReplicasAreNotActive-seed#[898F26CB91183204]) [n:127.0.0.1:36255_solr] o.a.s.c.c.ZkStateReader Updated live nodes from ZooKeeper... (0) -> (1)
  2> 217018 INFO  (TEST-LeaderTragicEventTest.testOtherReplicasAreNotActive-seed#[898F26CB91183204]) [n:127.0.0.1:36255_solr] o.a.s.c.DistributedClusterStateUpdater Creating DistributedClusterStateUpdater with useDistributedStateUpdate=false. Solr will be using Overseer based cluster state updates.
  2> 217020 INFO  (TEST-LeaderTragicEventTest.testOtherReplicasAreNotActive-seed#[898F26CB91183204]) [n:127.0.0.1:36255_solr] o.a.s.c.ZkController Publish node=127.0.0.1:36255_solr as DOWN
  2> 217024 INFO  (TEST-LeaderTragicEventTest.testOtherReplicasAreNotActive-seed#[898F26CB91183204]) [n:127.0.0.1:36255_solr] o.a.s.c.ZkController Register node as live in ZooKeeper: /live_nodes/127.0.0.1:36255_solr
  2> 217025 INFO  (zkCallback-2901-thread-1) [] o.a.s.c.c.ZkStateReader Updated live nodes from ZooKeeper... (1) -> (2)
  2> 217025 INFO  (zkCallback-2864-thread-1) [] o.a.s.c.c.ZkStateReader Updated live nodes from ZooKeeper... (1) -> (2)
  2> 217025 INFO  (zkCallback-2847-thread-2) [] o.a.s.c.c.ZkStateReader Updated live nodes from ZooKeeper... (1) -> (2)
  2> 217027 WARN  (TEST-LeaderTragicEventTest.testOtherReplicasAreNotActive-seed#[898F26CB91183204]) [n:127.0.0.1:36255_solr] o.a.s.c.CoreContainer Not all security plugins configured!  authentication=disabled authorization=disabled.  Solr is only as secure as you make it. Consider configuring authentication/authorization before exposing Solr to users internal or external.  See https://s.apache.org/solrsecurity for more info
  2> 217044 INFO  (TEST-LeaderTragicEventTest.testOtherReplicasAreNotActive-seed#[898F26CB91183204]) [n:127.0.0.1:36255_solr] o.a.s.c.CorePropertiesLocator Found 1 core definitions underneath /home/jenkins/jenkins-agent/workspace/Solr/Solr-Test-9.x/solr/core/build/tmp/tests-tmp/org.apache.solr.cloud.LeaderTragicEventTest_898F26CB91183204-001/tempDir-001/node2
  2> 217044 INFO  (TEST-LeaderTragicEventTest.testOtherReplicasAreNotActive-seed#[898F26CB91183204]) [n:127.0.0.1:36255_solr] o.a.s.c.CorePropertiesLocator Cores are: [testOtherReplicasAreNotActive_shard1_replica_n1]
  2> 217050 INFO  (coreLoadExecutor-2907-thread-1-processing-127.0.0.1:36255_solr) [n:127.0.0.1:36255_solr] o.a.s.c.SolrConfig Using Lucene MatchVersion: 9.12.3
  2> 217052 INFO  (coreLoadExecutor-2907-thread-1-processing-127.0.0.1:36255_solr) [n:127.0.0.1:36255_solr] o.a.s.s.IndexSchema Schema name=minimal
  2> 217052 INFO  (coreLoadExecutor-2907-thread-1-processing-127.0.0.1:36255_solr) [n:127.0.0.1:36255_solr] o.a.s.s.IndexSchema Loaded schema minimal/1.7 with uniqueid field id
  2> 217056 INFO  (coreLoadExecutor-2907-thread-1-processing-127.0.0.1:36255_solr) [n:127.0.0.1:36255_solr c:testOtherReplicasAreNotActive s:shard1 r:core_node3 x:testOtherReplicasAreNotActive_shard1_replica_n1] o.a.s.c.SolrConfig Using Lucene MatchVersion: 9.12.3
  2> 217056 INFO  (coreLoadExecutor-2907-thread-1-processing-127.0.0.1:36255_solr) [n:127.0.0.1:36255_solr c:testOtherReplicasAreNotActive s:shard1 r:core_node3 x:testOtherReplicasAreNotActive_shard1_replica_n1] o.a.s.s.IndexSchema Schema name=minimal
  2> 217057 INFO  (coreLoadExecutor-2907-thread-1-processing-127.0.0.1:36255_solr) [n:127.0.0.1:36255_solr c:testOtherReplicasAreNotActive s:shard1 r:core_node3 x:testOtherReplicasAreNotActive_shard1_replica_n1] o.a.s.s.IndexSchema Loaded schema minimal/1.7 with uniqueid field id
  2> 217057 INFO  (coreLoadExecutor-2907-thread-1-processing-127.0.0.1:36255_solr) [n:127.0.0.1:36255_solr c:testOtherReplicasAreNotActive s:shard1 r:core_node3 x:testOtherReplicasAreNotActive_shard1_replica_n1] o.a.s.c.CoreContainer Creating SolrCore 'testOtherReplicasAreNotActive_shard1_replica_n1' using configuration from configset config, trusted=true
  2> 217057 INFO  (coreLoadExecutor-2907-thread-1-processing-127.0.0.1:36255_solr) [n:127.0.0.1:36255_solr c:testOtherReplicasAreNotActive s:shard1 r:core_node3 x:testOtherReplicasAreNotActive_shard1_replica_n1] o.a.s.c.SolrCore Opening new SolrCore at [/home/jenkins/jenkins-agent/workspace/Solr/Solr-Test-9.x/solr/core/build/tmp/tests-tmp/org.apache.solr.cloud.LeaderTragicEventTest_898F26CB91183204-001/tempDir-001/node2/testOtherReplicasAreNotActive_shard1_replica_n1], dataDir=[/home/jenkins/jenkins-agent/workspace/Solr/Solr-Test-9.x/solr/core/build/tmp/tests-tmp/org.apache.solr.cloud.LeaderTragicEventTest_898F26CB91183204-001/tempDir-001/node2/testOtherReplicasAreNotActive_shard1_replica_n1/data/]
  2> 217075 INFO  (TEST-LeaderTragicEventTest.testOtherReplicasAreNotActive-seed#[898F26CB91183204]) [n:127.0.0.1:36255_solr] o.a.s.j.SolrRequestAuthorizer Creating a new SolrRequestAuthorizer
  2> 217076 INFO  (coreLoadExecutor-2907-thread-1-processing-127.0.0.1:36255_solr) [n:127.0.0.1:36255_solr c:testOtherReplicasAreNotActive s:shard1 r:core_node3 x:testOtherReplicasAreNotActive_shard1_replica_n1] o.a.s.j.SolrRequestAuthorizer Creating a new SolrRequestAuthorizer
  2> 217079 INFO  (coreLoadExecutor-2907-thread-1-processing-127.0.0.1:36255_solr) [n:127.0.0.1:36255_solr c:testOtherReplicasAreNotActive s:shard1 r:core_node3 x:testOtherReplicasAreNotActive_shard1_replica_n1] o.a.s.u.UpdateHandler Using UpdateLog implementation: org.apache.solr.update.UpdateLog
  2> 217079 INFO  (coreLoadExecutor-2907-thread-1-processing-127.0.0.1:36255_solr) [n:127.0.0.1:36255_solr c:testOtherReplicasAreNotActive s:shard1 r:core_node3 x:testOtherReplicasAreNotActive_shard1_replica_n1] o.a.s.u.UpdateLog Initializing UpdateLog: dataDir=null defaultSyncLevel=FLUSH numRecordsToKeep=100 maxNumLogsToKeep=10
  2> 217079 INFO  (coreLoadExecutor-2907-thread-1-processing-127.0.0.1:36255_solr) [n:127.0.0.1:36255_solr c:testOtherReplicasAreNotActive s:shard1 r:core_node3 x:testOtherReplicasAreNotActive_shard1_replica_n1] o.a.s.u.CommitTracker Hard AutoCommit: disabled
  2> 217080 INFO  (coreLoadExecutor-2907-thread-1-processing-127.0.0.1:36255_solr) [n:127.0.0.1:36255_solr c:testOtherReplicasAreNotActive s:shard1 r:core_node3 x:testOtherReplicasAreNotActive_shard1_replica_n1] o.a.s.u.CommitTracker Soft AutoCommit: disabled
  2> 217082 INFO  (coreLoadExecutor-2907-thread-1-processing-127.0.0.1:36255_solr) [n:127.0.0.1:36255_solr c:testOtherReplicasAreNotActive s:shard1 r:core_node3 x:testOtherReplicasAreNotActive_shard1_replica_n1] o.a.s.r.ManagedResourceStorage Configured ZooKeeperStorageIO with znodeBase: /configs/config
  2> 217082 INFO  (coreLoadExecutor-2907-thread-1-processing-127.0.0.1:36255_solr) [n:127.0.0.1:36255_solr c:testOtherReplicasAreNotActive s:shard1 r:core_node3 x:testOtherReplicasAreNotActive_shard1_replica_n1] o.a.s.r.ManagedResourceStorage Loaded null at path _rest_managed.json using ZooKeeperStorageIO:path=/configs/config
  2> 217082 INFO  (coreLoadExecutor-2907-thread-1-processing-127.0.0.1:36255_solr) [n:127.0.0.1:36255_solr c:testOtherReplicasAreNotActive s:shard1 r:core_node3 x:testOtherReplicasAreNotActive_shard1_replica_n1] o.a.s.h.ReplicationHandler Commits will be reserved for 10000 ms
  2> 217083 INFO  (searcherExecutor-2910-thread-1-processing-127.0.0.1:36255_solr testOtherReplicasAreNotActive_shard1_replica_n1 testOtherReplicasAreNotActive shard1 core_node3) [n:127.0.0.1:36255_solr c:testOtherReplicasAreNotActive s:shard1 r:core_node3 x:testOtherReplicasAreNotActive_shard1_replica_n1] o.a.s.c.SolrCore Registered new searcher autowarm time: 0 ms
  2> 217086 INFO  (coreZkRegister-2891-thread-1-processing-127.0.0.1:36255_solr testOtherReplicasAreNotActive_shard1_replica_n1 testOtherReplicasAreNotActive shard1 core_node3) [n:127.0.0.1:36255_solr c:testOtherReplicasAreNotActive s:shard1 r:core_node3 x:testOtherReplicasAreNotActive_shard1_replica_n1] o.a.s.c.ShardLeaderElectionContextBase make sure parent is created /collections/testOtherReplicasAreNotActive/leaders/shard1
  2> 217089 INFO  (coreZkRegister-2891-thread-1-processing-127.0.0.1:36255_solr testOtherReplicasAreNotActive_shard1_replica_n1 testOtherReplicasAreNotActive shard1 core_node3) [n:127.0.0.1:36255_solr c:testOtherReplicasAreNotActive s:shard1 r:core_node3 x:testOtherReplicasAreNotActive_shard1_replica_n1] o.a.s.c.ZkController Core needs to recover:testOtherReplicasAreNotActive_shard1_replica_n1
  2> 217089 INFO  (updateExecutor-2896-thread-1-processing-127.0.0.1:36255_solr testOtherReplicasAreNotActive_shard1_replica_n1 testOtherReplicasAreNotActive shard1 core_node3) [n:127.0.0.1:36255_solr c:testOtherReplicasAreNotActive s:shard1 r:core_node3 x:testOtherReplicasAreNotActive_shard1_replica_n1] o.a.s.u.DefaultSolrCoreState Running recovery
  2> 217089 INFO  (recoveryExecutor-2899-thread-1-processing-127.0.0.1:36255_solr testOtherReplicasAreNotActive_shard1_replica_n1 testOtherReplicasAreNotActive shard1 core_node3) [n:127.0.0.1:36255_solr c:testOtherReplicasAreNotActive s:shard1 r:core_node3 x:testOtherReplicasAreNotActive_shard1_replica_n1] o.a.s.c.RecoveryStrategy Starting recovery process. recoveringAfterStartup=true
  2> 217089 INFO  (recoveryExecutor-2899-thread-1-processing-127.0.0.1:36255_solr testOtherReplicasAreNotActive_shard1_replica_n1 testOtherReplicasAreNotActive shard1 core_node3) [n:127.0.0.1:36255_solr c:testOtherReplicasAreNotActive s:shard1 r:core_node3 x:testOtherReplicasAreNotActive_shard1_replica_n1] o.a.s.c.RecoveryStrategy startupVersions is empty
  2> 217090 INFO  (TEST-LeaderTragicEventTest.testOtherReplicasAreNotActive-seed#[898F26CB91183204]) [n:127.0.0.1:36255_solr] o.e.j.s.h.ContextHandler Started o.e.j.s.ServletContextHandler@52909aae{/solr,file:///home/jenkins/jenkins-agent/workspace/Solr/Solr-Test-9.x/solr/core/build/tmp/tests-cwd/,AVAILABLE}
  2> 217090 INFO  (TEST-LeaderTragicEventTest.testOtherReplicasAreNotActive-seed#[898F26CB91183204]) [n:127.0.0.1:36255_solr] o.e.j.s.AbstractConnector Started ServerConnector@23b08220{HTTP/1.1, (http/1.1, h2c)}{127.0.0.1:36255}
  2> 217090 INFO  (TEST-LeaderTragicEventTest.testOtherReplicasAreNotActive-seed#[898F26CB91183204]) [n:127.0.0.1:36255_solr] o.e.j.s.Server Started Server@1a34a14d{STARTING}[10.0.26,sto=15000] @217115ms
  2> 217090 INFO  (TEST-LeaderTragicEventTest.testOtherReplicasAreNotActive-seed#[898F26CB91183204]) [] o.a.s.c.MiniSolrCloudCluster waitForNode: 127.0.0.1:36255_solr
  2> 217090 INFO  (TEST-LeaderTragicEventTest.testOtherReplicasAreNotActive-seed#[898F26CB91183204]) [] o.a.s.SolrTestCaseJ4 ###Ending testOtherReplicasAreNotActive
  2> 217093 INFO  (qtp1641923729-4241-null-3636) [n:127.0.0.1:38699_solr c:testOtherReplicasAreNotActive s:shard1 r:core_node4 x:testOtherReplicasAreNotActive_shard1_replica_n2 t:null-3636] o.a.s.c.S.Request webapp=/solr path=/admin/ping params={wt=javabin&version=2} hits=0 status=0 QTime=0
  2> 217093 INFO  (qtp1641923729-4241-null-3636) [n:127.0.0.1:38699_solr c:testOtherReplicasAreNotActive s:shard1 r:core_node4 x:testOtherReplicasAreNotActive_shard1_replica_n2 t:null-3636] o.a.s.c.S.Request webapp=/solr path=/admin/ping params={wt=javabin&version=2} status=0 QTime=0
  2> 217093 INFO  (recoveryExecutor-2899-thread-1-processing-127.0.0.1:36255_solr testOtherReplicasAreNotActive_shard1_replica_n1 testOtherReplicasAreNotActive shard1 core_node3) [n:127.0.0.1:36255_solr c:testOtherReplicasAreNotActive s:shard1 r:core_node3 x:testOtherReplicasAreNotActive_shard1_replica_n1] o.a.s.c.RecoveryStrategy Begin buffering updates. core=[testOtherReplicasAreNotActive_shard1_replica_n1]
  2> 217094 INFO  (recoveryExecutor-2899-thread-1-processing-127.0.0.1:36255_solr testOtherReplicasAreNotActive_shard1_replica_n1 testOtherReplicasAreNotActive shard1 core_node3) [n:127.0.0.1:36255_solr c:testOtherReplicasAreNotActive s:shard1 r:core_node3 x:testOtherReplicasAreNotActive_shard1_replica_n1] o.a.s.u.UpdateLog Starting to buffer updates. FSUpdateLog{state=ACTIVE, tlog=null}
  2> 217094 INFO  (recoveryExecutor-2899-thread-1-processing-127.0.0.1:36255_solr testOtherReplicasAreNotActive_shard1_replica_n1 testOtherReplicasAreNotActive shard1 core_node3) [n:127.0.0.1:36255_solr c:testOtherReplicasAreNotActive s:shard1 r:core_node3 x:testOtherReplicasAreNotActive_shard1_replica_n1] o.a.s.c.RecoveryStrategy Publishing state of core [testOtherReplicasAreNotActive_shard1_replica_n1] as recovering, leader is [http://127.0.0.1:38699/solr/testOtherReplicasAreNotActive_shard1_replica_n2/] and I am [http://127.0.0.1:36255/solr/testOtherReplicasAreNotActive_shard1_replica_n1/]
  2> 217095 INFO  (recoveryExecutor-2899-thread-1-processing-127.0.0.1:36255_solr testOtherReplicasAreNotActive_shard1_replica_n1 testOtherReplicasAreNotActive shard1 core_node3) [n:127.0.0.1:36255_solr c:testOtherReplicasAreNotActive s:shard1 r:core_node3 x:testOtherReplicasAreNotActive_shard1_replica_n1] o.a.s.c.RecoveryStrategy Sending prep recovery command to [http://127.0.0.1:38699/solr]; [WaitForState: action=PREPRECOVERY&core=testOtherReplicasAreNotActive_shard1_replica_n2&nodeName=127.0.0.1:36255_solr&coreNodeName=core_node3&state=recovering&checkLive=true&onlyIfLeader=true&onlyIfLeaderActive=true]
  2> 217095 INFO  (OverseerThreadFactory-2887-thread-1) [ c:testOtherReplicasAreNotActive] o.a.s.c.a.c.CollectionHandlingUtils Executing Collection Cmd=action=UNLOAD&deleteInstanceDir=true&deleteDataDir=true, asyncId=null
  2> 217095 INFO  (qtp1641923729-4243-null-3638) [n:127.0.0.1:38699_solr x:testOtherReplicasAreNotActive_shard1_replica_n2 t:null-3638] o.a.s.h.a.PrepRecoveryOp Going to wait for coreNodeName: core_node3, state: recovering, checkLive: true, onlyIfLeader: true, onlyIfLeaderActive: true
  2> 217095 INFO  (qtp1641923729-4243-null-3638) [n:127.0.0.1:38699_solr t:null-3638] o.a.s.h.a.PrepRecoveryOp In WaitForState(recovering): collection=testOtherReplicasAreNotActive, shard=shard1, thisCore=testOtherReplicasAreNotActive_shard1_replica_n2, leaderDoesNotNeedRecovery=false, isLeader=true, live=true, checkLive=true, currentState=down, localState=active, nodeName=127.0.0.1:36255_solr, coreNodeName=core_node3, onlyIfActiveCheckResult=false, nodeProps: core_node3:{
  2>   "core":"testOtherReplicasAreNotActive_shard1_replica_n1",
  2>   "node_name":"127.0.0.1:36255_solr",
  2>   "base_url":"http://127.0.0.1:36255/solr",
  2>   "state":"down",
  2>   "type":"NRT",
  2>   "force_set_state":"false"}
  2> 217095 INFO  (qtp1641923729-4243-null-3638) [n:127.0.0.1:38699_solr t:null-3638] o.a.s.h.a.PrepRecoveryOp In WaitForState(recovering): collection=testOtherReplicasAreNotActive, shard=shard1, thisCore=testOtherReplicasAreNotActive_shard1_replica_n2, leaderDoesNotNeedRecovery=false, isLeader=true, live=true, checkLive=true, currentState=down, localState=active, nodeName=127.0.0.1:36255_solr, coreNodeName=core_node3, onlyIfActiveCheckResult=false, nodeProps: core_node3:{
  2>   "core":"testOtherReplicasAreNotActive_shard1_replica_n1",
  2>   "node_name":"127.0.0.1:36255_solr",
  2>   "base_url":"http://127.0.0.1:36255/solr",
  2>   "state":"down",
  2>   "type":"NRT",
  2>   "force_set_state":"false"}
  2> 217095 INFO  (qtp1641923729-4243-null-3638) [n:127.0.0.1:38699_solr t:null-3638] o.a.s.h.a.PrepRecoveryOp In WaitForState(recovering): collection=testOtherReplicasAreNotActive, shard=shard1, thisCore=testOtherReplicasAreNotActive_shard1_replica_n2, leaderDoesNotNeedRecovery=false, isLeader=true, live=true, checkLive=true, currentState=down, localState=active, nodeName=127.0.0.1:36255_solr, coreNodeName=core_node3, onlyIfActiveCheckResult=false, nodeProps: core_node3:{
  2>   "core":"testOtherReplicasAreNotActive_shard1_replica_n1",
  2>   "node_name":"127.0.0.1:36255_solr",
  2>   "base_url":"http://127.0.0.1:36255/solr",
  2>   "state":"down",
  2>   "type":"NRT",
  2>   "force_set_state":"false"}
  2> 217096 INFO  (qtp1641923729-4243-null-3638) [n:127.0.0.1:38699_solr t:null-3638] o.a.s.h.a.PrepRecoveryOp In WaitForState(recovering): collection=testOtherReplicasAreNotActive, shard=shard1, thisCore=testOtherReplicasAreNotActive_shard1_replica_n2, leaderDoesNotNeedRecovery=false, isLeader=true, live=true, checkLive=true, currentState=down, localState=active, nodeName=127.0.0.1:36255_solr, coreNodeName=core_node3, onlyIfActiveCheckResult=false, nodeProps: core_node3:{
  2>   "core":"testOtherReplicasAreNotActive_shard1_replica_n1",
  2>   "node_name":"127.0.0.1:36255_solr",
  2>   "base_url":"http://127.0.0.1:36255/solr",
  2>   "state":"down",
  2>   "type":"NRT",
  2>   "force_set_state":"false"}
  2> 217097 INFO  (qtp1641923729-4237-null-3637) [n:127.0.0.1:38699_solr x:testOtherReplicasAreNotActive_shard1_replica_n2 t:null-3637] o.a.s.m.SolrMetricManager Closing metric reporters for registry=solr.core.testOtherReplicasAreNotActive.shard1.replica_n2 tag=null
  2> 217097 INFO  (qtp1641923729-4237-null-3637) [n:127.0.0.1:38699_solr x:testOtherReplicasAreNotActive_shard1_replica_n2 t:null-3637] o.a.s.c.SolrCore CLOSING SolrCore org.apache.solr.core.SolrCore@2b05e318 testOtherReplicasAreNotActive_shard1_re

[...truncated too long message...]

jenkins/jenkins-agent/workspace/Solr/Solr-Test-9.x/solr/modules/gcs-repository/src/test/org/apache/solr/gcs/ConcurrentDelegatingStorage.java uses or overrides a deprecated API.
Note: Recompile with -Xlint:deprecation for details.

> Task :solr:modules:gcs-repository:processTestResources
> Task :solr:modules:gcs-repository:testClasses

> Task :solr:modules:gcs-repository:test
:solr:modules:gcs-repository:test (SUCCESS): 22 test(s), 1 skipped

> Task :solr:modules:gcs-repository:wipeTaskTemp

> Task :solr:modules:hadoop-auth:compileJava
Note: Some input files use or override a deprecated API.
Note: Recompile with -Xlint:deprecation for details.

> Task :solr:modules:hadoop-auth:processResources NO-SOURCE
> Task :solr:modules:hadoop-auth:classes

> Task :solr:modules:hadoop-auth:compileTestJava
Note: Some input files use or override a deprecated API.
Note: Recompile with -Xlint:deprecation for details.

> Task :solr:modules:hadoop-auth:copySolrCoreTestResources
> Task :solr:modules:hadoop-auth:processTestResources
> Task :solr:modules:hadoop-auth:testClasses

> Task :solr:modules:hadoop-auth:test
:solr:modules:hadoop-auth:test (SUCCESS): 54 test(s), 1 skipped

> Task :solr:modules:hadoop-auth:wipeTaskTemp

> Task :solr:modules:hdfs:compileJava
Note: Some input files use or override a deprecated API.
Note: Recompile with -Xlint:deprecation for details.

> Task :solr:modules:hdfs:processResources NO-SOURCE
> Task :solr:modules:hdfs:classes

> Task :solr:modules:hdfs:compileTestJava
Note: Some input files use or override a deprecated API.
Note: Recompile with -Xlint:deprecation for details.

> Task :solr:modules:hdfs:copySolrCoreTestResources
> Task :solr:modules:hdfs:processTestResources
> Task :solr:modules:hdfs:testClasses
> Task :solr:modules:hdfs:test
:solr:modules:hdfs:test (SUCCESS): 104 test(s), 41 skipped

> Task :solr:modules:hdfs:wipeTaskTemp
> Task :solr:modules:jaegertracer-configurator:compileJava
> Task :solr:modules:jaegertracer-configurator:processResources NO-SOURCE
> Task :solr:modules:jaegertracer-configurator:classes
> Task :solr:modules:jaegertracer-configurator:compileTestJava
> Task :solr:modules:jaegertracer-configurator:processTestResources
> Task :solr:modules:jaegertracer-configurator:testClasses

> Task :solr:modules:jaegertracer-configurator:test
:solr:modules:jaegertracer-configurator:test (SUCCESS): 1 test(s)

> Task :solr:modules:jaegertracer-configurator:wipeTaskTemp
> Task :solr:modules:jwt-auth:compileJava
> Task :solr:modules:jwt-auth:processResources NO-SOURCE
> Task :solr:modules:jwt-auth:classes

> Task :solr:modules:jwt-auth:compileTestJava
Note: /home/jenkins/jenkins-agent/workspace/Solr/Solr-Test-9.x/solr/modules/jwt-auth/src/test/org/apache/solr/security/jwt/JWTAuthPluginIntegrationTest.java uses or overrides a deprecated API.
Note: Recompile with -Xlint:deprecation for details.

> Task :solr:modules:jwt-auth:processTestResources
> Task :solr:modules:jwt-auth:testClasses

> Task :solr:modules:jwt-auth:test
:solr:modules:jwt-auth:test (SUCCESS): 77 test(s), 1 skipped

> Task :solr:modules:jwt-auth:wipeTaskTemp

> Task :solr:modules:langid:compileJava
Note: /home/jenkins/jenkins-agent/workspace/Solr/Solr-Test-9.x/solr/modules/langid/src/java/org/apache/solr/update/processor/LanguageIdentifierUpdateProcessor.java uses or overrides a deprecated API.
Note: Recompile with -Xlint:deprecation for details.

> Task :solr:modules:langid:processResources
> Task :solr:modules:langid:classes
> Task :solr:modules:langid:compileTestJava
> Task :solr:modules:langid:processTestResources
> Task :solr:modules:langid:testClasses

> Task :solr:modules:langid:test
:solr:modules:langid:test (SUCCESS): 49 test(s)

> Task :solr:modules:langid:wipeTaskTemp
> Task :solr:modules:llm:compileJava
> Task :solr:modules:llm:processResources NO-SOURCE
> Task :solr:modules:llm:classes

> Task :solr:modules:llm:compileTestJava
Note: /home/jenkins/jenkins-agent/workspace/Solr/Solr-Test-9.x/solr/modules/llm/src/test/org/apache/solr/llm/TestLlmBase.java uses or overrides a deprecated API.
Note: Recompile with -Xlint:deprecation for details.

> Task :solr:modules:llm:processTestResources
> Task :solr:modules:llm:testClasses

> Task :solr:modules:llm:test
:solr:modules:llm:test (SUCCESS): 47 test(s)

> Task :solr:modules:llm:wipeTaskTemp

> Task :solr:modules:ltr:compileJava
Note: Some input files use or override a deprecated API.
Note: Recompile with -Xlint:deprecation for details.

> Task :solr:modules:ltr:processResources NO-SOURCE
> Task :solr:modules:ltr:classes

> Task :solr:modules:ltr:compileTestJava
Note: Some input files use or override a deprecated API.
Note: Recompile with -Xlint:deprecation for details.

> Task :solr:modules:ltr:processTestResources
> Task :solr:modules:ltr:testClasses
> Task :solr:modules:ltr:test
:solr:modules:ltr:test (SUCCESS): 209 test(s)

> Task :solr:modules:ltr:wipeTaskTemp

> Task :solr:modules:opentelemetry:compileJava
Note: Some input files use or override a deprecated API.
Note: Recompile with -Xlint:deprecation for details.

> Task :solr:modules:opentelemetry:processResources NO-SOURCE
> Task :solr:modules:opentelemetry:classes
> Task :solr:modules:opentelemetry:compileTestJava
> Task :solr:modules:opentelemetry:processTestResources
> Task :solr:modules:opentelemetry:testClasses

> Task :solr:modules:opentelemetry:test
:solr:modules:opentelemetry:test (SUCCESS): 5 test(s)

> Task :solr:modules:opentelemetry:wipeTaskTemp
> Task :solr:modules:s3-repository:compileJava
> Task :solr:modules:s3-repository:processResources NO-SOURCE
> Task :solr:modules:s3-repository:classes
> Task :solr:modules:s3-repository:compileTestJava
> Task :solr:modules:s3-repository:processTestResources
> Task :solr:modules:s3-repository:testClasses
> Task :solr:modules:s3-repository:test
:solr:modules:s3-repository:test (SUCCESS): 53 test(s), 1 skipped

> Task :solr:modules:s3-repository:wipeTaskTemp

> Task :solr:modules:scripting:compileJava
Note: Some input files use or override a deprecated API.
Note: Recompile with -Xlint:deprecation for details.

> Task :solr:modules:scripting:processResources NO-SOURCE
> Task :solr:modules:scripting:classes

> Task :solr:modules:scripting:compileTestJava
Note: Some input files use or override a deprecated API.
Note: Recompile with -Xlint:deprecation for details.

> Task :solr:modules:scripting:processTestResources
> Task :solr:modules:scripting:testClasses

> Task :solr:modules:scripting:test
:solr:modules:scripting:test (SUCCESS): 22 test(s), 1 skipped

> Task :solr:modules:scripting:wipeTaskTemp

> Task :solr:modules:sql:compileTestJava
Note: Some input files use or override a deprecated API.
Note: Recompile with -Xlint:deprecation for details.

> Task :solr:modules:sql:copySolrCoreTestResources
> Task :solr:modules:sql:processTestResources
> Task :solr:modules:sql:testClasses

> Task :solr:modules:sql:test
:solr:modules:sql:test (SUCCESS): 33 test(s)

> Task :solr:modules:sql:wipeTaskTemp
The slowest tests (exceeding 500 ms) during this run:
  55.21s LeaderElectionIntegrationTest.testSimpleSliceLeaderElection (:solr:core)
  53.58s PeerSyncReplicationTest.test (:solr:core)
  46.74s ReplicationFactorTest.test (:solr:core)
  46.03s SyncSliceTest.test (:solr:core)
  42.39s UnloadDistributedZkTest.test (:solr:core)
  40.14s Http2SolrClientTest.testIdleTimeoutWithHttpClient (:solr:solrj)
  39.10s TestCoordinatorRole.testNRTRestart (:solr:core)
  36.01s TestCloudSearcherWarming.testPeersyncFailureReplicationSuccess (:solr:core)
  34.95s CheckHdfsIndexTest.testChecksumsOnly (:solr:modules:hdfs)
  34.54s TestCpuAllowedLimit.testDistribLimit (:solr:core)
The slowest suites (exceeding 1s) during this run:
  126.57s TestRecoveryHdfs (:solr:modules:hdfs)
  84.37s CheckHdfsIndexTest (:solr:modules:hdfs)
  73.86s TestCoordinatorRole (:solr:core)
  65.72s TestCpuAllowedLimit (:solr:core)
  63.15s TestPullReplica (:solr:core)
  61.08s HdfsCloudIncrementalBackupTest (:solr:modules:hdfs)
  60.78s MultiThreadedOCPTest (:solr:core)
  57.06s TestRecovery (:solr:core)
  55.67s LeaderElectionIntegrationTest (:solr:core)
  55.40s TestTlogReplica (:solr:core)
ERROR: The following test(s) have failed:
  - org.apache.solr.cloud.LeaderTragicEventTest (:solr:core)
    Test history: https://develocity.apache.org/scans/tests?search.rootProjectNames=solr-root&tests.container=org.apache.solr.cloud.LeaderTragicEventTest
    Test output: /home/jenkins/jenkins-agent/workspace/Solr/Solr-Test-9.x/solr/core/build/test-results/test/outputs/OUTPUT-org.apache.solr.cloud.LeaderTragicEventTest.txt
    Reproduce with: ./gradlew :solr:core:test --tests "org.apache.solr.cloud.LeaderTragicEventTest" -Ptests.haltonfailure=false "-Ptests.jvmargs=-XX:TieredStopAtLevel=1 -XX:+UseParallelGC -XX:ActiveProcessorCount=1 -XX:ReservedCodeCacheSize=120m" -Ptests.seed=898F26CB91183204 -Ptests.multiplier=2 -Ptests.useSecurityManager=true -Ptests.badapples=false -Ptests.file.encoding=UTF-8


Deprecated Gradle features were used in this build, making it incompatible with Gradle 9.0.

You can use '--warning-mode all' to show the individual deprecation warnings and determine if they come from your own scripts or plugins.

For more on this, please refer to https://docs.gradle.org/8.10/userguide/command_line_interface.html#sec:command_line_warnings in the Gradle documentation.

BUILD SUCCESSFUL in 45m 44s
167 actionable tasks: 167 executed

Publishing build scan...
https://develocity.apache.org/s/fqy5jdspmi6oc

Build step 'Invoke Gradle script' changed build result to SUCCESS
Archiving artifacts
‘**/*.events’ doesn’t match anything: ‘**’ exists but not ‘**/*.events’
No artifacts found that match the file pattern "**/*.events,heapdumps/**,**/hs_err_pid*". Configuration error?
Recording test results
[Checks API] No suitable checks publisher found.
Build step 'Publish JUnit test result report' changed build result to UNSTABLE
Email was triggered for: Unstable (Test Failures)
Sending email for trigger: Unstable (Test Failures)