You are viewing a plain text version of this content. The canonical link for it is here.
Posted to dev@kafka.apache.org by Apache Jenkins Server <je...@builds.apache.org> on 2015/04/24 22:28:32 UTC

Build failed in Jenkins: Kafka-trunk #472

See <https://builds.apache.org/job/Kafka-trunk/472/changes>

Changes:

[jjkoshy] KAFKA-2138; Fix producer to honor retry backoff; reviewed by Joel Koshy and Guozhang Wang

------------------------------------------
[...truncated 2156 lines...]

kafka.log.OffsetIndexTest > lookupExtremeCases PASSED

kafka.log.OffsetIndexTest > appendTooMany PASSED

kafka.log.OffsetIndexTest > appendOutOfOrder PASSED

kafka.log.OffsetIndexTest > testReopen PASSED

kafka.log.OffsetMapTest > testBasicValidation PASSED

kafka.log.OffsetMapTest > testClear PASSED

kafka.log.LogManagerTest > testCreateLog PASSED

kafka.log.LogManagerTest > testGetNonExistentLog PASSED

kafka.log.LogManagerTest > testCleanupExpiredSegments PASSED

kafka.log.LogManagerTest > testCleanupSegmentsToMaintainSize PASSED

kafka.log.LogManagerTest > testTimeBasedFlush PASSED

kafka.log.LogManagerTest > testLeastLoadedAssignment PASSED

kafka.log.LogManagerTest > testTwoLogManagersUsingSameDirFails PASSED

kafka.log.LogManagerTest > testCheckpointRecoveryPoints PASSED

kafka.log.LogManagerTest > testRecoveryDirectoryMappingWithTrailingSlash PASSED

kafka.log.LogManagerTest > testRecoveryDirectoryMappingWithRelativeDirectory PASSED

kafka.log.BrokerCompressionTest > testBrokerSideCompression[0] PASSED

kafka.log.BrokerCompressionTest > testBrokerSideCompression[1] PASSED

kafka.log.BrokerCompressionTest > testBrokerSideCompression[2] PASSED

kafka.log.BrokerCompressionTest > testBrokerSideCompression[3] PASSED

kafka.log.BrokerCompressionTest > testBrokerSideCompression[4] PASSED

kafka.log.BrokerCompressionTest > testBrokerSideCompression[5] PASSED

kafka.log.BrokerCompressionTest > testBrokerSideCompression[6] PASSED

kafka.log.BrokerCompressionTest > testBrokerSideCompression[7] PASSED

kafka.log.BrokerCompressionTest > testBrokerSideCompression[8] PASSED

kafka.log.BrokerCompressionTest > testBrokerSideCompression[9] PASSED

kafka.log.BrokerCompressionTest > testBrokerSideCompression[10] PASSED

kafka.log.BrokerCompressionTest > testBrokerSideCompression[11] PASSED

kafka.log.BrokerCompressionTest > testBrokerSideCompression[12] PASSED

kafka.log.BrokerCompressionTest > testBrokerSideCompression[13] PASSED

kafka.log.BrokerCompressionTest > testBrokerSideCompression[14] PASSED

kafka.log.BrokerCompressionTest > testBrokerSideCompression[15] PASSED

kafka.log.BrokerCompressionTest > testBrokerSideCompression[16] PASSED

kafka.log.BrokerCompressionTest > testBrokerSideCompression[17] PASSED

kafka.log.BrokerCompressionTest > testBrokerSideCompression[18] PASSED

kafka.log.BrokerCompressionTest > testBrokerSideCompression[19] PASSED

kafka.log.LogTest > testTimeBasedLogRoll PASSED

kafka.log.LogTest > testTimeBasedLogRollJitter PASSED

kafka.log.LogTest > testSizeBasedLogRoll PASSED

kafka.log.LogTest > testLoadEmptyLog PASSED

kafka.log.LogTest > testAppendAndReadWithSequentialOffsets PASSED

kafka.log.LogTest > testAppendAndReadWithNonSequentialOffsets PASSED

kafka.log.LogTest > testReadAtLogGap PASSED

kafka.log.LogTest > testReadOutOfRange PASSED

kafka.log.LogTest > testLogRolls PASSED

kafka.log.LogTest > testCompressedMessages PASSED

kafka.log.LogTest > testThatGarbageCollectingSegmentsDoesntChangeOffset PASSED

kafka.log.LogTest > testMessageSetSizeCheck PASSED

kafka.log.LogTest > testCompactedTopicConstraints PASSED

kafka.log.LogTest > testMessageSizeCheck PASSED

kafka.log.LogTest > testLogRecoversToCorrectOffset PASSED

kafka.log.LogTest > testIndexRebuild PASSED

kafka.log.LogTest > testTruncateTo PASSED

kafka.log.LogTest > testIndexResizingAtTruncation PASSED

kafka.log.LogTest > testBogusIndexSegmentsAreRemoved PASSED

kafka.log.LogTest > testReopenThenTruncate PASSED

kafka.log.LogTest > testAsyncDelete PASSED

kafka.log.LogTest > testOpenDeletesObsoleteFiles PASSED

kafka.log.LogTest > testAppendMessageWithNullPayload PASSED

kafka.log.LogTest > testCorruptLog PASSED

kafka.log.LogTest > testCleanShutdownFile PASSED

kafka.log.LogTest > testParseTopicPartitionName PASSED

kafka.log.LogTest > testParseTopicPartitionNameForEmptyName PASSED

kafka.log.LogTest > testParseTopicPartitionNameForNull PASSED

kafka.log.LogTest > testParseTopicPartitionNameForMissingSeparator PASSED

kafka.log.LogTest > testParseTopicPartitionNameForMissingTopic PASSED

kafka.log.LogTest > testParseTopicPartitionNameForMissingPartition PASSED

kafka.log.LogCleanerIntegrationTest > cleanerTest PASSED

kafka.log.CleanerTest > testCleanSegments PASSED

kafka.log.CleanerTest > testCleaningWithDeletes PASSED

kafka.log.CleanerTest > testCleaningWithUnkeyedMessages PASSED

kafka.log.CleanerTest > testCleanSegmentsWithAbort PASSED

kafka.log.CleanerTest > testSegmentGrouping PASSED

kafka.log.CleanerTest > testSegmentGroupingWithSparseOffsets PASSED

kafka.log.CleanerTest > testBuildOffsetMap PASSED

kafka.javaapi.consumer.ZookeeperConsumerConnectorTest > testBasic PASSED

kafka.javaapi.message.ByteBufferMessageSetTest > testWrittenEqualsRead PASSED

kafka.javaapi.message.ByteBufferMessageSetTest > testIteratorIsConsistent PASSED

kafka.javaapi.message.ByteBufferMessageSetTest > testSizeInBytes PASSED

kafka.javaapi.message.ByteBufferMessageSetTest > testEquals PASSED

kafka.javaapi.message.ByteBufferMessageSetTest > testIteratorIsConsistentWithCompression PASSED

kafka.javaapi.message.ByteBufferMessageSetTest > testSizeInBytesWithCompression PASSED

kafka.javaapi.message.ByteBufferMessageSetTest > testEqualsWithCompression PASSED

kafka.network.SocketServerTest > simpleRequest PASSED

kafka.network.SocketServerTest > tooBigRequestIsRejected PASSED

kafka.network.SocketServerTest > testNullResponse PASSED

kafka.network.SocketServerTest > testSocketsCloseOnShutdown PASSED

kafka.network.SocketServerTest > testMaxConnectionsPerIp PASSED

kafka.network.SocketServerTest > testMaxConnectionsPerIPOverrides PASSED

kafka.integration.PrimitiveApiTest > testFetchRequestCanProperlySerialize PASSED

kafka.integration.PrimitiveApiTest > testEmptyFetchRequest PASSED

kafka.integration.PrimitiveApiTest > testDefaultEncoderProducerAndFetch PASSED

kafka.integration.PrimitiveApiTest > testDefaultEncoderProducerAndFetchWithCompression PASSED

kafka.integration.PrimitiveApiTest > testProduceAndMultiFetch PASSED

kafka.integration.PrimitiveApiTest > testMultiProduce PASSED

kafka.integration.PrimitiveApiTest > testConsumerEmptyTopic PASSED

kafka.integration.PrimitiveApiTest > testPipelinedProduceRequests PASSED

kafka.integration.UncleanLeaderElectionTest > testUncleanLeaderElectionEnabled PASSED

kafka.integration.UncleanLeaderElectionTest > testUncleanLeaderElectionDisabled FAILED
    junit.framework.AssertionFailedError: expected:<List(first, second, third)> but was:<List()>
        at junit.framework.Assert.fail(Assert.java:47)
        at junit.framework.Assert.failNotEquals(Assert.java:277)
        at junit.framework.Assert.assertEquals(Assert.java:64)
        at junit.framework.Assert.assertEquals(Assert.java:71)
        at kafka.integration.UncleanLeaderElectionTest.verifyUncleanLeaderElectionDisabled(UncleanLeaderElectionTest.scala:248)
        at kafka.integration.UncleanLeaderElectionTest.testUncleanLeaderElectionDisabled(UncleanLeaderElectionTest.scala:121)

kafka.integration.UncleanLeaderElectionTest > testUncleanLeaderElectionEnabledByTopicOverride PASSED

kafka.integration.UncleanLeaderElectionTest > testCleanLeaderElectionDisabledByTopicOverride PASSED

kafka.integration.UncleanLeaderElectionTest > testUncleanLeaderElectionInvalidTopicOverride PASSED

kafka.integration.TopicMetadataTest > testAutoCreateTopic PASSED

kafka.integration.TopicMetadataTest > testTopicMetadataRequest PASSED

kafka.integration.TopicMetadataTest > testBasicTopicMetadata PASSED

kafka.integration.TopicMetadataTest > testGetAllTopicMetadata PASSED

kafka.integration.AutoOffsetResetTest > testResetToEarliestWhenOffsetTooHigh PASSED

kafka.integration.AutoOffsetResetTest > testResetToEarliestWhenOffsetTooLow PASSED

kafka.integration.AutoOffsetResetTest > testResetToLatestWhenOffsetTooHigh PASSED

kafka.integration.AutoOffsetResetTest > testResetToLatestWhenOffsetTooLow PASSED

kafka.integration.FetcherTest > testFetcher PASSED

kafka.integration.RollingBounceTest > testRollingBounce PASSED

395 tests completed, 1 failed
:core:test FAILED

FAILURE: Build failed with an exception.

* What went wrong:
Execution failed for task ':core:test'.
> There were failing tests. See the report at: file://<https://builds.apache.org/job/Kafka-trunk/ws/core/build/reports/tests/index.html>

* Try:
Run with --stacktrace option to get the stack trace. Run with --info or --debug option to get more log output.

BUILD FAILED

Total time: 8 mins 0.018 secs
Build step 'Execute shell' marked build as failure
Setting GRADLE_2_1_HOME=/home/jenkins/jenkins-slave/tools/hudson.plugins.gradle.GradleInstallation/Gradle_2.1

Jenkins build is back to normal : Kafka-trunk #476

Posted by Apache Jenkins Server <je...@builds.apache.org>.
See <https://builds.apache.org/job/Kafka-trunk/476/changes>


Build failed in Jenkins: Kafka-trunk #475

Posted by Apache Jenkins Server <je...@builds.apache.org>.
See <https://builds.apache.org/job/Kafka-trunk/475/changes>

Changes:

[nehanarkhede] KAFKA-2140 follow up, checking in newly renamed file ConsumerRebalanceFailedException

[nehanarkhede] KAFKA-2128 kafka.Kafka should return non-zero exit code when caught exception; reviewed by Neha

------------------------------------------
[...truncated 986 lines...]
kafka.utils.UtilsTest > testReplaceSuffix PASSED

kafka.utils.UtilsTest > testReadInt PASSED

kafka.utils.UtilsTest > testCsvList PASSED

kafka.utils.UtilsTest > testCsvMap PASSED

kafka.utils.UtilsTest > testInLock PASSED

kafka.utils.UtilsTest > testDoublyLinkedList PASSED

kafka.utils.JsonTest > testJsonEncoding PASSED

kafka.utils.IteratorTemplateTest > testIterator PASSED

kafka.utils.timer.TimerTest > testAlreadyExpiredTask PASSED

kafka.utils.timer.TimerTest > testTaskExpiration PASSED

kafka.utils.timer.TimerTaskListTest > testAll PASSED

kafka.metrics.KafkaTimerTest > testKafkaTimer PASSED

kafka.consumer.TopicFilterTest > testWhitelists PASSED

kafka.consumer.TopicFilterTest > testBlacklists PASSED

kafka.consumer.TopicFilterTest > testWildcardTopicCountGetTopicCountMapEscapeJson PASSED

kafka.consumer.MetricsTest > testMetricsLeak PASSED

kafka.consumer.MetricsTest > testMetricsReporterAfterDeletingTopic PASSED

kafka.consumer.ZookeeperConsumerConnectorTest > testBasic PASSED

kafka.consumer.ZookeeperConsumerConnectorTest > testCompression PASSED

kafka.consumer.ZookeeperConsumerConnectorTest > testCompressionSetConsumption PASSED

kafka.consumer.ZookeeperConsumerConnectorTest > testConsumerDecoder PASSED

kafka.consumer.ZookeeperConsumerConnectorTest > testLeaderSelectionForPartition PASSED

kafka.consumer.ZookeeperConsumerConnectorTest > testConsumerRebalanceListener PASSED

kafka.consumer.ConsumerIteratorTest > testConsumerIteratorDeduplicationDeepIterator PASSED

kafka.consumer.ConsumerIteratorTest > testConsumerIteratorDecodingFailure PASSED

kafka.javaapi.consumer.ZookeeperConsumerConnectorTest > testBasic PASSED

kafka.javaapi.message.ByteBufferMessageSetTest > testWrittenEqualsRead PASSED

kafka.javaapi.message.ByteBufferMessageSetTest > testIteratorIsConsistent PASSED

kafka.javaapi.message.ByteBufferMessageSetTest > testIteratorIsConsistentWithCompression PASSED

kafka.javaapi.message.ByteBufferMessageSetTest > testSizeInBytes PASSED

kafka.javaapi.message.ByteBufferMessageSetTest > testSizeInBytesWithCompression PASSED

kafka.javaapi.message.ByteBufferMessageSetTest > testEquals PASSED

kafka.javaapi.message.ByteBufferMessageSetTest > testEqualsWithCompression PASSED

kafka.server.LogOffsetTest > testGetOffsetsForUnknownTopic PASSED

kafka.server.LogOffsetTest > testGetOffsetsBeforeLatestTime PASSED

kafka.server.LogOffsetTest > testEmptyLogsGetOffsets PASSED

kafka.server.LogOffsetTest > testGetOffsetsBeforeNow PASSED

kafka.server.LogOffsetTest > testGetOffsetsBeforeEarliestTime PASSED

kafka.server.HighwatermarkPersistenceTest > testHighWatermarkPersistenceSinglePartition PASSED

kafka.server.HighwatermarkPersistenceTest > testHighWatermarkPersistenceMultiplePartitions PASSED

kafka.server.KafkaConfigTest > testLogRetentionTimeHoursProvided PASSED

kafka.server.KafkaConfigTest > testLogRetentionTimeMinutesProvided PASSED

kafka.server.KafkaConfigTest > testLogRetentionTimeMsProvided PASSED

kafka.server.KafkaConfigTest > testLogRetentionTimeNoConfigProvided PASSED

kafka.server.KafkaConfigTest > testLogRetentionTimeBothMinutesAndHoursProvided PASSED

kafka.server.KafkaConfigTest > testLogRetentionTimeBothMinutesAndMsProvided PASSED

kafka.server.KafkaConfigTest > testLogRetentionUnlimited PASSED

kafka.server.KafkaConfigTest > testLogRetentionValid PASSED

kafka.server.KafkaConfigTest > testAdvertiseDefaults PASSED

kafka.server.KafkaConfigTest > testAdvertiseConfigured PASSED

kafka.server.KafkaConfigTest > testDuplicateListeners PASSED

kafka.server.KafkaConfigTest > testBadListenerProtocol PASSED

kafka.server.KafkaConfigTest > testListenerDefaults PASSED

kafka.server.KafkaConfigTest > testVersionConfiguration PASSED

kafka.server.KafkaConfigTest > testUncleanLeaderElectionDefault PASSED

kafka.server.KafkaConfigTest > testUncleanElectionDisabled PASSED

kafka.server.KafkaConfigTest > testUncleanElectionEnabled PASSED

kafka.server.KafkaConfigTest > testUncleanElectionInvalid PASSED

kafka.server.KafkaConfigTest > testLogRollTimeMsProvided PASSED

kafka.server.KafkaConfigTest > testLogRollTimeBothMsAndHoursProvided PASSED

kafka.server.KafkaConfigTest > testLogRollTimeNoConfigProvided PASSED

kafka.server.KafkaConfigTest > testDefaultCompressionType PASSED

kafka.server.KafkaConfigTest > testValidCompressionType PASSED

kafka.server.KafkaConfigTest > testInvalidCompressionType PASSED

kafka.server.LogRecoveryTest > testHWCheckpointNoFailuresSingleLogSegment PASSED

kafka.server.LogRecoveryTest > testHWCheckpointWithFailuresSingleLogSegment PASSED

kafka.server.LogRecoveryTest > testHWCheckpointNoFailuresMultipleLogSegments PASSED

kafka.server.LogRecoveryTest > testHWCheckpointWithFailuresMultipleLogSegments PASSED

kafka.server.DelayedOperationTest > testRequestSatisfaction PASSED

kafka.server.DelayedOperationTest > testRequestExpiry PASSED

kafka.server.DelayedOperationTest > testRequestPurge PASSED

kafka.server.AdvertiseBrokerTest > testBrokerAdvertiseToZK PASSED

kafka.server.ReplicaManagerTest > testHighWaterMarkDirectoryMapping PASSED

kafka.server.ReplicaManagerTest > testHighwaterMarkRelativeDirectoryMapping PASSED

kafka.server.ReplicaManagerTest > testIllegalRequiredAcks PASSED

kafka.server.ServerGenerateBrokerIdTest > testAutoGenerateBrokerId PASSED

kafka.server.ServerGenerateBrokerIdTest > testUserConfigAndGeneratedBrokerId PASSED

kafka.server.ServerGenerateBrokerIdTest > testMultipleLogDirsMetaProps PASSED

kafka.server.ServerGenerateBrokerIdTest > testConsistentBrokerIdFromUserConfigAndMetaProps PASSED

kafka.server.OffsetCommitTest > testUpdateOffsets PASSED

kafka.server.OffsetCommitTest > testCommitAndFetchOffsets PASSED

kafka.server.OffsetCommitTest > testLargeMetadataPayload PASSED

kafka.server.OffsetCommitTest > testOffsetExpiration PASSED

kafka.server.OffsetCommitTest > testNonExistingTopicOffsetCommit PASSED

kafka.server.ReplicaFetchTest > testReplicaFetcherThread PASSED

kafka.server.ServerStartupTest > testBrokerCreatesZKChroot PASSED

kafka.server.ServerStartupTest > testConflictBrokerRegistration PASSED

kafka.server.LeaderElectionTest > testLeaderElectionAndEpoch PASSED

kafka.server.LeaderElectionTest > testLeaderElectionWithStaleControllerEpoch PASSED

kafka.server.IsrExpirationTest > testIsrExpirationForStuckFollowers PASSED

kafka.server.IsrExpirationTest > testIsrExpirationIfNoFetchRequestMade PASSED

kafka.server.IsrExpirationTest > testIsrExpirationForSlowFollowers PASSED

kafka.server.SimpleFetchTest > testReadFromLog PASSED

kafka.server.ServerShutdownTest > testCleanShutdown PASSED

kafka.server.ServerShutdownTest > testCleanShutdownWithDeleteTopicEnabled PASSED

kafka.server.ServerShutdownTest > testCleanShutdownAfterFailedStartup PASSED

kafka.server.ServerShutdownTest > testConsecutiveShutdown PASSED

kafka.server.DynamicConfigChangeTest > testConfigChange PASSED

kafka.server.DynamicConfigChangeTest > testConfigChangeOnNonExistingTopic PASSED

kafka.zk.ZKEphemeralTest > testEphemeralNodeCleanup PASSED

kafka.api.ProducerFailureHandlingTest > testNotEnoughReplicas PASSED

kafka.api.ProducerFailureHandlingTest > testInvalidPartition PASSED

kafka.api.ProducerFailureHandlingTest > testTooLargeRecordWithAckZero PASSED

kafka.api.ProducerFailureHandlingTest > testTooLargeRecordWithAckOne PASSED

kafka.api.ProducerFailureHandlingTest > testNonExistentTopic PASSED

kafka.api.ProducerFailureHandlingTest > testWrongBrokerList PASSED

kafka.api.ProducerFailureHandlingTest > testNoResponse PASSED

kafka.api.ProducerFailureHandlingTest > testSendAfterClosed PASSED

kafka.api.ProducerFailureHandlingTest > testCannotSendToInternalTopic PASSED

kafka.api.ProducerFailureHandlingTest > testNotEnoughReplicasAfterBrokerShutdown PASSED

kafka.api.ConsumerBounceTest > testConsumptionWithBrokerFailures PASSED

kafka.api.ConsumerBounceTest > testSeekAndCommitWithBrokerFailures FAILED
    java.lang.AssertionError: expected:<1000> but was:<980>
        at org.junit.Assert.fail(Assert.java:92)
        at org.junit.Assert.failNotEquals(Assert.java:689)
        at org.junit.Assert.assertEquals(Assert.java:127)
        at org.junit.Assert.assertEquals(Assert.java:514)
        at org.junit.Assert.assertEquals(Assert.java:498)
        at kafka.api.ConsumerBounceTest.seekAndCommitWithBrokerFailures(ConsumerBounceTest.scala:117)
        at kafka.api.ConsumerBounceTest.testSeekAndCommitWithBrokerFailures(ConsumerBounceTest.scala:98)

255 tests completed, 1 failed
:core:test FAILED

FAILURE: Build failed with an exception.

* What went wrong:
Execution failed for task ':core:test'.
> Process 'Gradle Test Executor 3' finished with non-zero exit value 1

* Try:
Run with --stacktrace option to get the stack trace. Run with --info or --debug option to get more log output.

BUILD FAILED

Total time: 8 mins 19.863 secs
Build step 'Execute shell' marked build as failure
Setting GRADLE_2_1_HOME=/jenkins/tools/hudson.plugins.gradle.GradleInstallation/Gradle_2.1

Build failed in Jenkins: Kafka-trunk #474

Posted by Apache Jenkins Server <je...@builds.apache.org>.
See <https://builds.apache.org/job/Kafka-trunk/474/changes>

Changes:

[nehanarkhede] KAFKA-2122 Remove controller.message.queue.size Config; reviewed by Neha Narkhede, Jun Rao, Onur

------------------------------------------
[...truncated 451 lines...]
org.apache.kafka.common.record.RecordTest > testFields[33] PASSED

org.apache.kafka.common.record.RecordTest > testChecksum[33] PASSED

org.apache.kafka.common.record.RecordTest > testEquality[33] PASSED

org.apache.kafka.common.record.RecordTest > testFields[34] PASSED

org.apache.kafka.common.record.RecordTest > testChecksum[34] PASSED

org.apache.kafka.common.record.RecordTest > testEquality[34] PASSED

org.apache.kafka.common.record.RecordTest > testFields[35] PASSED

org.apache.kafka.common.record.RecordTest > testChecksum[35] PASSED

org.apache.kafka.common.record.RecordTest > testEquality[35] PASSED

org.apache.kafka.common.record.RecordTest > testFields[36] PASSED

org.apache.kafka.common.record.RecordTest > testChecksum[36] PASSED

org.apache.kafka.common.record.RecordTest > testEquality[36] PASSED

org.apache.kafka.common.record.RecordTest > testFields[37] PASSED

org.apache.kafka.common.record.RecordTest > testChecksum[37] PASSED

org.apache.kafka.common.record.RecordTest > testEquality[37] PASSED

org.apache.kafka.common.record.RecordTest > testFields[38] PASSED

org.apache.kafka.common.record.RecordTest > testChecksum[38] PASSED

org.apache.kafka.common.record.RecordTest > testEquality[38] PASSED

org.apache.kafka.common.record.RecordTest > testFields[39] PASSED

org.apache.kafka.common.record.RecordTest > testChecksum[39] PASSED

org.apache.kafka.common.record.RecordTest > testEquality[39] PASSED

org.apache.kafka.common.record.RecordTest > testFields[40] PASSED

org.apache.kafka.common.record.RecordTest > testChecksum[40] PASSED

org.apache.kafka.common.record.RecordTest > testEquality[40] PASSED

org.apache.kafka.common.record.RecordTest > testFields[41] PASSED

org.apache.kafka.common.record.RecordTest > testChecksum[41] PASSED

org.apache.kafka.common.record.RecordTest > testEquality[41] PASSED

org.apache.kafka.common.record.RecordTest > testFields[42] PASSED

org.apache.kafka.common.record.RecordTest > testChecksum[42] PASSED

org.apache.kafka.common.record.RecordTest > testEquality[42] PASSED

org.apache.kafka.common.record.RecordTest > testFields[43] PASSED

org.apache.kafka.common.record.RecordTest > testChecksum[43] PASSED

org.apache.kafka.common.record.RecordTest > testEquality[43] PASSED

org.apache.kafka.common.record.RecordTest > testFields[44] PASSED

org.apache.kafka.common.record.RecordTest > testChecksum[44] PASSED

org.apache.kafka.common.record.RecordTest > testEquality[44] PASSED

org.apache.kafka.common.record.RecordTest > testFields[45] PASSED

org.apache.kafka.common.record.RecordTest > testChecksum[45] PASSED

org.apache.kafka.common.record.RecordTest > testEquality[45] PASSED

org.apache.kafka.common.record.RecordTest > testFields[46] PASSED

org.apache.kafka.common.record.RecordTest > testChecksum[46] PASSED

org.apache.kafka.common.record.RecordTest > testEquality[46] PASSED

org.apache.kafka.common.record.RecordTest > testFields[47] PASSED

org.apache.kafka.common.record.RecordTest > testChecksum[47] PASSED

org.apache.kafka.common.record.RecordTest > testEquality[47] PASSED

org.apache.kafka.common.record.RecordTest > testFields[48] PASSED

org.apache.kafka.common.record.RecordTest > testChecksum[48] PASSED

org.apache.kafka.common.record.RecordTest > testEquality[48] PASSED

org.apache.kafka.common.record.RecordTest > testFields[49] PASSED

org.apache.kafka.common.record.RecordTest > testChecksum[49] PASSED

org.apache.kafka.common.record.RecordTest > testEquality[49] PASSED

org.apache.kafka.common.record.RecordTest > testFields[50] PASSED

org.apache.kafka.common.record.RecordTest > testChecksum[50] PASSED

org.apache.kafka.common.record.RecordTest > testEquality[50] PASSED

org.apache.kafka.common.record.RecordTest > testFields[51] PASSED

org.apache.kafka.common.record.RecordTest > testChecksum[51] PASSED

org.apache.kafka.common.record.RecordTest > testEquality[51] PASSED

org.apache.kafka.common.record.RecordTest > testFields[52] PASSED

org.apache.kafka.common.record.RecordTest > testChecksum[52] PASSED

org.apache.kafka.common.record.RecordTest > testEquality[52] PASSED

org.apache.kafka.common.record.RecordTest > testFields[53] PASSED

org.apache.kafka.common.record.RecordTest > testChecksum[53] PASSED

org.apache.kafka.common.record.RecordTest > testEquality[53] PASSED

org.apache.kafka.common.record.RecordTest > testFields[54] PASSED

org.apache.kafka.common.record.RecordTest > testChecksum[54] PASSED

org.apache.kafka.common.record.RecordTest > testEquality[54] PASSED

org.apache.kafka.common.record.RecordTest > testFields[55] PASSED

org.apache.kafka.common.record.RecordTest > testChecksum[55] PASSED

org.apache.kafka.common.record.RecordTest > testEquality[55] PASSED

org.apache.kafka.common.record.RecordTest > testFields[56] PASSED

org.apache.kafka.common.record.RecordTest > testChecksum[56] PASSED

org.apache.kafka.common.record.RecordTest > testEquality[56] PASSED

org.apache.kafka.common.record.RecordTest > testFields[57] PASSED

org.apache.kafka.common.record.RecordTest > testChecksum[57] PASSED

org.apache.kafka.common.record.RecordTest > testEquality[57] PASSED

org.apache.kafka.common.record.RecordTest > testFields[58] PASSED

org.apache.kafka.common.record.RecordTest > testChecksum[58] PASSED

org.apache.kafka.common.record.RecordTest > testEquality[58] PASSED

org.apache.kafka.common.record.RecordTest > testFields[59] PASSED

org.apache.kafka.common.record.RecordTest > testChecksum[59] PASSED

org.apache.kafka.common.record.RecordTest > testEquality[59] PASSED

org.apache.kafka.common.record.RecordTest > testFields[60] PASSED

org.apache.kafka.common.record.RecordTest > testChecksum[60] PASSED

org.apache.kafka.common.record.RecordTest > testEquality[60] PASSED

org.apache.kafka.common.record.RecordTest > testFields[61] PASSED

org.apache.kafka.common.record.RecordTest > testChecksum[61] PASSED

org.apache.kafka.common.record.RecordTest > testEquality[61] PASSED

org.apache.kafka.common.record.RecordTest > testFields[62] PASSED

org.apache.kafka.common.record.RecordTest > testChecksum[62] PASSED

org.apache.kafka.common.record.RecordTest > testEquality[62] PASSED

org.apache.kafka.common.record.RecordTest > testFields[63] PASSED

org.apache.kafka.common.record.RecordTest > testChecksum[63] PASSED

org.apache.kafka.common.record.RecordTest > testEquality[63] PASSED
:contrib:compileJava UP-TO-DATE
:contrib:processResources UP-TO-DATE
:contrib:classes UP-TO-DATE
:contrib:compileTestJava UP-TO-DATE
:contrib:processTestResources UP-TO-DATE
:contrib:testClasses UP-TO-DATE
:contrib:test UP-TO-DATE
:clients:jar
:core:compileJava UP-TO-DATE
:core:compileScala
/x1/jenkins/jenkins-slave/workspace/Kafka-trunk/core/src/main/scala/kafka/admin/AdminUtils.scala:320: non-variable type argument String in type pattern scala.collection.Map[String,_] is unchecked since it is eliminated by erasure
        case Some(map: Map[String, _]) => 
                       ^
/x1/jenkins/jenkins-slave/workspace/Kafka-trunk/core/src/main/scala/kafka/admin/AdminUtils.scala:323: non-variable type argument String in type pattern scala.collection.Map[String,String] is unchecked since it is eliminated by erasure
            case Some(config: Map[String, String]) =>
                              ^
/x1/jenkins/jenkins-slave/workspace/Kafka-trunk/core/src/main/scala/kafka/api/OffsetCommitRequest.scala:75: value DEFAULT_TIMESTAMP in object OffsetCommitRequest is deprecated: see corresponding Javadoc for more information.
            org.apache.kafka.common.requests.OffsetCommitRequest.DEFAULT_TIMESTAMP
                                                                 ^
/x1/jenkins/jenkins-slave/workspace/Kafka-trunk/core/src/main/scala/kafka/common/OffsetMetadataAndError.scala:34: value DEFAULT_TIMESTAMP in object OffsetCommitRequest is deprecated: see corresponding Javadoc for more information.
                             commitTimestamp: Long = org.apache.kafka.common.requests.OffsetCommitRequest.DEFAULT_TIMESTAMP,
                                                                                                          ^
/x1/jenkins/jenkins-slave/workspace/Kafka-trunk/core/src/main/scala/kafka/common/OffsetMetadataAndError.scala:35: value DEFAULT_TIMESTAMP in object OffsetCommitRequest is deprecated: see corresponding Javadoc for more information.
                             expireTimestamp: Long = org.apache.kafka.common.requests.OffsetCommitRequest.DEFAULT_TIMESTAMP) {
                                                                                                          ^
/x1/jenkins/jenkins-slave/workspace/Kafka-trunk/core/src/main/scala/kafka/consumer/ZookeeperConsumerConnector.scala:650: not found: type ConsumerRebalanceFailedException
      throw new ConsumerRebalanceFailedException(consumerIdString + " can't rebalance after " + config.rebalanceMaxRetries +" retries")
                ^
/x1/jenkins/jenkins-slave/workspace/Kafka-trunk/core/src/main/scala/kafka/coordinator/DelayedJoinGroup.scala:46: a pure expression does nothing in statement position; you may be omitting necessary parentheses
    responseCallback
    ^
/x1/jenkins/jenkins-slave/workspace/Kafka-trunk/core/src/main/scala/kafka/server/KafkaApis.scala:187: value DEFAULT_TIMESTAMP in object OffsetCommitRequest is deprecated: see corresponding Javadoc for more information.
          if (offsetAndMetadata.commitTimestamp == org.apache.kafka.common.requests.OffsetCommitRequest.DEFAULT_TIMESTAMP)
                                                                                                        ^
/x1/jenkins/jenkins-slave/workspace/Kafka-trunk/core/src/main/scala/kafka/server/KafkaServer.scala:216: a pure expression does nothing in statement position; you may be omitting necessary parentheses
    ControllerStats.uncleanLeaderElectionRate
                    ^
/x1/jenkins/jenkins-slave/workspace/Kafka-trunk/core/src/main/scala/kafka/server/KafkaServer.scala:217: a pure expression does nothing in statement position; you may be omitting necessary parentheses
    ControllerStats.leaderElectionTimer
                    ^
/x1/jenkins/jenkins-slave/workspace/Kafka-trunk/core/src/main/scala/kafka/server/OffsetManager.scala:391: value DEFAULT_TIMESTAMP in object OffsetCommitRequest is deprecated: see corresponding Javadoc for more information.
                      if (value.expireTimestamp == org.apache.kafka.common.requests.OffsetCommitRequest.DEFAULT_TIMESTAMP)
                                                                                                        ^
/x1/jenkins/jenkins-slave/workspace/Kafka-trunk/core/src/main/scala/kafka/utils/CoreUtils.scala:70: a pure expression does nothing in statement position; you may be omitting necessary parentheses
    Utils.daemonThread(name, runnable(fun))
                                      ^
11 warnings found
one error found
:core:compileScala FAILED

FAILURE: Build failed with an exception.

* What went wrong:
Execution failed for task ':core:compileScala'.
> Compilation failed

* Try:
Run with --stacktrace option to get the stack trace. Run with --info or --debug option to get more log output.

BUILD FAILED

Total time: 44.26 secs
Build step 'Execute shell' marked build as failure
Setting GRADLE_2_1_HOME=/home/jenkins/jenkins-slave/tools/hudson.plugins.gradle.GradleInstallation/Gradle_2.1

Build failed in Jenkins: Kafka-trunk #473

Posted by Apache Jenkins Server <je...@builds.apache.org>.
See <https://builds.apache.org/job/Kafka-trunk/473/changes>

Changes:

[neha.narkhede] KAFKA-2034 sourceCompatibility not set in Kafka build.gradle; reviewed by Neha Narkhede and Ewen Cheslack-Postava

[nehanarkhede] KAFKA-2140 Improve code readability; reviewed by Neha Narkhede

------------------------------------------
[...truncated 451 lines...]
org.apache.kafka.common.record.RecordTest > testEquality[51] PASSED

org.apache.kafka.common.record.RecordTest > testFields[52] PASSED

org.apache.kafka.common.record.RecordTest > testChecksum[52] PASSED

org.apache.kafka.common.record.RecordTest > testEquality[52] PASSED

org.apache.kafka.common.record.RecordTest > testFields[53] PASSED

org.apache.kafka.common.record.RecordTest > testChecksum[53] PASSED

org.apache.kafka.common.record.RecordTest > testEquality[53] PASSED

org.apache.kafka.common.record.RecordTest > testFields[54] PASSED

org.apache.kafka.common.record.RecordTest > testChecksum[54] PASSED

org.apache.kafka.common.record.RecordTest > testEquality[54] PASSED

org.apache.kafka.common.record.RecordTest > testFields[55] PASSED

org.apache.kafka.common.record.RecordTest > testChecksum[55] PASSED

org.apache.kafka.common.record.RecordTest > testEquality[55] PASSED

org.apache.kafka.common.record.RecordTest > testFields[56] PASSED

org.apache.kafka.common.record.RecordTest > testChecksum[56] PASSED

org.apache.kafka.common.record.RecordTest > testEquality[56] PASSED

org.apache.kafka.common.record.RecordTest > testFields[57] PASSED

org.apache.kafka.common.record.RecordTest > testChecksum[57] PASSED

org.apache.kafka.common.record.RecordTest > testEquality[57] PASSED

org.apache.kafka.common.record.RecordTest > testFields[58] PASSED

org.apache.kafka.common.record.RecordTest > testChecksum[58] PASSED

org.apache.kafka.common.record.RecordTest > testEquality[58] PASSED

org.apache.kafka.common.record.RecordTest > testFields[59] PASSED

org.apache.kafka.common.record.RecordTest > testChecksum[59] PASSED

org.apache.kafka.common.record.RecordTest > testEquality[59] PASSED

org.apache.kafka.common.record.RecordTest > testFields[60] PASSED

org.apache.kafka.common.record.RecordTest > testChecksum[60] PASSED

org.apache.kafka.common.record.RecordTest > testEquality[60] PASSED

org.apache.kafka.common.record.RecordTest > testFields[61] PASSED

org.apache.kafka.common.record.RecordTest > testChecksum[61] PASSED

org.apache.kafka.common.record.RecordTest > testEquality[61] PASSED

org.apache.kafka.common.record.RecordTest > testFields[62] PASSED

org.apache.kafka.common.record.RecordTest > testChecksum[62] PASSED

org.apache.kafka.common.record.RecordTest > testEquality[62] PASSED

org.apache.kafka.common.record.RecordTest > testFields[63] PASSED

org.apache.kafka.common.record.RecordTest > testChecksum[63] PASSED

org.apache.kafka.common.record.RecordTest > testEquality[63] PASSED

org.apache.kafka.common.record.MemoryRecordsTest > testIterator[0] PASSED

org.apache.kafka.common.record.MemoryRecordsTest > testIterator[1] PASSED

org.apache.kafka.common.record.MemoryRecordsTest > testIterator[2] PASSED

org.apache.kafka.common.record.MemoryRecordsTest > testIterator[3] PASSED

org.apache.kafka.clients.ClientUtilsTest > testParseAndValidateAddresses PASSED

org.apache.kafka.clients.ClientUtilsTest > testNoPort PASSED

org.apache.kafka.clients.NetworkClientTest > testReadyAndDisconnect PASSED

org.apache.kafka.clients.NetworkClientTest > testSendToUnreadyNode PASSED

org.apache.kafka.clients.NetworkClientTest > testSimpleRequestResponse PASSED

org.apache.kafka.clients.MetadataTest > testMetadata PASSED

org.apache.kafka.clients.MetadataTest > testMetadataUpdateWaitTime PASSED

org.apache.kafka.clients.producer.KafkaProducerTest > testConstructorClose PASSED

org.apache.kafka.clients.producer.ProducerRecordTest > testEqualsAndHashCode PASSED

org.apache.kafka.clients.producer.MockProducerTest > testAutoCompleteMock PASSED

org.apache.kafka.clients.producer.MockProducerTest > testManualCompletion PASSED

org.apache.kafka.clients.producer.RecordSendTest > testTimeout PASSED

org.apache.kafka.clients.producer.RecordSendTest > testError PASSED

org.apache.kafka.clients.producer.RecordSendTest > testBlocking PASSED

org.apache.kafka.clients.producer.internals.RecordAccumulatorTest > testFull PASSED

org.apache.kafka.clients.producer.internals.RecordAccumulatorTest > testAppendLarge PASSED

org.apache.kafka.clients.producer.internals.RecordAccumulatorTest > testLinger PASSED

org.apache.kafka.clients.producer.internals.RecordAccumulatorTest > testPartialDrain PASSED

org.apache.kafka.clients.producer.internals.RecordAccumulatorTest > testStressfulSituation PASSED

org.apache.kafka.clients.producer.internals.RecordAccumulatorTest > testNextReadyCheckDelay PASSED

org.apache.kafka.clients.producer.internals.RecordAccumulatorTest > testRetryBackoff PASSED

org.apache.kafka.clients.producer.internals.RecordAccumulatorTest > testFlush PASSED

org.apache.kafka.clients.producer.internals.BufferPoolTest > testSimple PASSED

org.apache.kafka.clients.producer.internals.BufferPoolTest > testStressfulSituation PASSED

org.apache.kafka.clients.producer.internals.BufferPoolTest > testCantAllocateMoreMemoryThanWeHave PASSED

org.apache.kafka.clients.producer.internals.BufferPoolTest > testNonblockingMode PASSED

org.apache.kafka.clients.producer.internals.BufferPoolTest > testDelayedAllocation PASSED

org.apache.kafka.clients.producer.internals.SenderTest > testSimple PASSED

org.apache.kafka.clients.producer.internals.SenderTest > testRetries PASSED

org.apache.kafka.clients.producer.internals.PartitionerTest > testUserSuppliedPartitioning PASSED

org.apache.kafka.clients.producer.internals.PartitionerTest > testKeyPartitionIsStable PASSED

org.apache.kafka.clients.producer.internals.PartitionerTest > testRoundRobinWithUnavailablePartitions PASSED

org.apache.kafka.clients.consumer.KafkaConsumerTest > testConstructorClose PASSED

org.apache.kafka.clients.consumer.MockConsumerTest > testSimpleMock PASSED

org.apache.kafka.clients.consumer.internals.HeartbeatTest > testShouldHeartbeat PASSED

org.apache.kafka.clients.consumer.internals.HeartbeatTest > testShouldNotHeartbeat PASSED

org.apache.kafka.clients.consumer.internals.FetcherTest > testFetchNormal PASSED

org.apache.kafka.clients.consumer.internals.FetcherTest > testFetchFailed PASSED

org.apache.kafka.clients.consumer.internals.FetcherTest > testFetchOutOfRange PASSED

org.apache.kafka.clients.consumer.internals.CoordinatorTest > testNormalHeartbeat PASSED

org.apache.kafka.clients.consumer.internals.CoordinatorTest > testCoordinatorNotAvailable PASSED

org.apache.kafka.clients.consumer.internals.CoordinatorTest > testNotCoordinator PASSED

org.apache.kafka.clients.consumer.internals.CoordinatorTest > testIllegalGeneration PASSED

org.apache.kafka.clients.consumer.internals.CoordinatorTest > testCoordinatorDisconnect PASSED

org.apache.kafka.clients.consumer.internals.CoordinatorTest > testNormalJoinGroup PASSED

org.apache.kafka.clients.consumer.internals.CoordinatorTest > testReJoinGroup PASSED

org.apache.kafka.clients.consumer.internals.CoordinatorTest > testCommitOffsetNormal PASSED

org.apache.kafka.clients.consumer.internals.CoordinatorTest > testCommitOffsetError PASSED

org.apache.kafka.clients.consumer.internals.CoordinatorTest > testFetchOffset PASSED

org.apache.kafka.clients.consumer.internals.SubscriptionStateTest > partitionSubscription PASSED

org.apache.kafka.clients.consumer.internals.SubscriptionStateTest > cantChangeFetchPositionForNonAssignedPartition PASSED

org.apache.kafka.clients.consumer.internals.SubscriptionStateTest > cantChangeConsumedPositionForNonAssignedPartition PASSED
:contrib:compileJava UP-TO-DATE
:contrib:processResources UP-TO-DATE
:contrib:classes UP-TO-DATE
:contrib:compileTestJava UP-TO-DATE
:contrib:processTestResources UP-TO-DATE
:contrib:testClasses UP-TO-DATE
:contrib:test UP-TO-DATE
:clients:jar
:core:compileJava UP-TO-DATE
:core:compileScala
<https://builds.apache.org/job/Kafka-trunk/ws/core/src/main/scala/kafka/admin/AdminUtils.scala>:320: non-variable type argument String in type pattern scala.collection.Map[String,_] is unchecked since it is eliminated by erasure
        case Some(map: Map[String, _]) => 
                       ^
<https://builds.apache.org/job/Kafka-trunk/ws/core/src/main/scala/kafka/admin/AdminUtils.scala>:323: non-variable type argument String in type pattern scala.collection.Map[String,String] is unchecked since it is eliminated by erasure
            case Some(config: Map[String, String]) =>
                              ^
<https://builds.apache.org/job/Kafka-trunk/ws/core/src/main/scala/kafka/api/OffsetCommitRequest.scala>:75: value DEFAULT_TIMESTAMP in object OffsetCommitRequest is deprecated: see corresponding Javadoc for more information.
            org.apache.kafka.common.requests.OffsetCommitRequest.DEFAULT_TIMESTAMP
                                                                 ^
<https://builds.apache.org/job/Kafka-trunk/ws/core/src/main/scala/kafka/common/OffsetMetadataAndError.scala>:34: value DEFAULT_TIMESTAMP in object OffsetCommitRequest is deprecated: see corresponding Javadoc for more information.
                             commitTimestamp: Long = org.apache.kafka.common.requests.OffsetCommitRequest.DEFAULT_TIMESTAMP,
                                                                                                          ^
<https://builds.apache.org/job/Kafka-trunk/ws/core/src/main/scala/kafka/common/OffsetMetadataAndError.scala>:35: value DEFAULT_TIMESTAMP in object OffsetCommitRequest is deprecated: see corresponding Javadoc for more information.
                             expireTimestamp: Long = org.apache.kafka.common.requests.OffsetCommitRequest.DEFAULT_TIMESTAMP) {
                                                                                                          ^
<https://builds.apache.org/job/Kafka-trunk/ws/core/src/main/scala/kafka/consumer/ZookeeperConsumerConnector.scala>:650: not found: type ConsumerRebalanceFailedException
      throw new ConsumerRebalanceFailedException(consumerIdString + " can't rebalance after " + config.rebalanceMaxRetries +" retries")
                ^
<https://builds.apache.org/job/Kafka-trunk/ws/core/src/main/scala/kafka/coordinator/DelayedJoinGroup.scala>:46: a pure expression does nothing in statement position; you may be omitting necessary parentheses
    responseCallback
    ^
<https://builds.apache.org/job/Kafka-trunk/ws/core/src/main/scala/kafka/server/KafkaApis.scala>:187: value DEFAULT_TIMESTAMP in object OffsetCommitRequest is deprecated: see corresponding Javadoc for more information.
          if (offsetAndMetadata.commitTimestamp == org.apache.kafka.common.requests.OffsetCommitRequest.DEFAULT_TIMESTAMP)
                                                                                                        ^
<https://builds.apache.org/job/Kafka-trunk/ws/core/src/main/scala/kafka/server/KafkaServer.scala>:216: a pure expression does nothing in statement position; you may be omitting necessary parentheses
    ControllerStats.uncleanLeaderElectionRate
                    ^
<https://builds.apache.org/job/Kafka-trunk/ws/core/src/main/scala/kafka/server/KafkaServer.scala>:217: a pure expression does nothing in statement position; you may be omitting necessary parentheses
    ControllerStats.leaderElectionTimer
                    ^
<https://builds.apache.org/job/Kafka-trunk/ws/core/src/main/scala/kafka/server/OffsetManager.scala>:391: value DEFAULT_TIMESTAMP in object OffsetCommitRequest is deprecated: see corresponding Javadoc for more information.
                      if (value.expireTimestamp == org.apache.kafka.common.requests.OffsetCommitRequest.DEFAULT_TIMESTAMP)
                                                                                                        ^
<https://builds.apache.org/job/Kafka-trunk/ws/core/src/main/scala/kafka/utils/CoreUtils.scala>:70: a pure expression does nothing in statement position; you may be omitting necessary parentheses
    Utils.daemonThread(name, runnable(fun))
                                      ^
11 warnings found
one error found
:core:compileScala FAILED

FAILURE: Build failed with an exception.

* What went wrong:
Execution failed for task ':core:compileScala'.
> Compilation failed

* Try:
Run with --stacktrace option to get the stack trace. Run with --info or --debug option to get more log output.

BUILD FAILED

Total time: 52.115 secs
Build step 'Execute shell' marked build as failure
Setting GRADLE_2_1_HOME=/home/jenkins/jenkins-slave/tools/hudson.plugins.gradle.GradleInstallation/Gradle_2.1