You are viewing a plain text version of this content. The canonical link for it is here.
Posted to builds@hbase.apache.org by Apache Jenkins Server <je...@builds.apache.org> on 2015/10/06 06:22:37 UTC
Build failed in Jenkins: HBase-1.2 » latest1.8,Hadoop #228
See <https://builds.apache.org/job/HBase-1.2/jdk=latest1.8,label=Hadoop/228/changes>
Changes:
[eclark] HBASE-14555 Fix Deadlock in MVCC branch-1.2 toString()
------------------------------------------
[...truncated 52310 lines...]
java.lang.Thread.State: TIMED_WAITING (sleeping)
at java.lang.Thread.sleep(Native Method)
at org.apache.hadoop.hdfs.server.blockmanagement.BlockManager$ReplicationMonitor.run(BlockManager.java:3397)
at java.lang.Thread.run(Thread.java:745)
"org.apache.hadoop.hdfs.server.blockmanagement.HeartbeatManager$Monitor@31000e60" #32 daemon prio=5 os_prio=0 tid=0x00007f5b852ff800 nid=0x377 waiting on condition [0x00007f5b53cfb000]
java.lang.Thread.State: TIMED_WAITING (sleeping)
at java.lang.Thread.sleep(Native Method)
at org.apache.hadoop.hdfs.server.blockmanagement.HeartbeatManager$Monitor.run(HeartbeatManager.java:319)
at java.lang.Thread.run(Thread.java:745)
"org.apache.hadoop.hdfs.server.blockmanagement.DecommissionManager$Monitor@1643d68f" #42 daemon prio=5 os_prio=0 tid=0x00007f5b852fe000 nid=0x376 waiting on condition [0x00007f5b53dfc000]
java.lang.Thread.State: TIMED_WAITING (sleeping)
at java.lang.Thread.sleep(Native Method)
at org.apache.hadoop.hdfs.server.blockmanagement.DecommissionManager$Monitor.run(DecommissionManager.java:76)
at java.lang.Thread.run(Thread.java:745)
"org.apache.hadoop.hdfs.server.blockmanagement.PendingReplicationBlocks$PendingReplicationMonitor@631e06ab" #41 daemon prio=5 os_prio=0 tid=0x00007f5b852fc000 nid=0x375 waiting on condition [0x00007f5b53efd000]
java.lang.Thread.State: TIMED_WAITING (sleeping)
at java.lang.Thread.sleep(Native Method)
at org.apache.hadoop.hdfs.server.blockmanagement.PendingReplicationBlocks$PendingReplicationMonitor.run(PendingReplicationBlocks.java:221)
at java.lang.Thread.run(Thread.java:745)
"org.apache.hadoop.util.JvmPauseMonitor$Monitor@3276732" #37 daemon prio=5 os_prio=0 tid=0x00007f5b852f2800 nid=0x36d waiting on condition [0x00007f5b58139000]
java.lang.Thread.State: TIMED_WAITING (sleeping)
at java.lang.Thread.sleep(Native Method)
at org.apache.hadoop.util.JvmPauseMonitor$Monitor.run(JvmPauseMonitor.java:180)
at java.lang.Thread.run(Thread.java:745)
"IPC Server idle connection scanner for port 38858" #35 daemon prio=5 os_prio=0 tid=0x00007f5b852d0800 nid=0x36c in Object.wait() [0x00007f5b5823a000]
java.lang.Thread.State: TIMED_WAITING (on object monitor)
at java.lang.Object.wait(Native Method)
at java.util.TimerThread.mainLoop(Timer.java:552)
- locked <0x0000000715ee9288> (a java.util.TaskQueue)
at java.util.TimerThread.run(Timer.java:505)
"Socket Reader #1 for port 38858" #34 prio=5 os_prio=0 tid=0x00007f5b8529c000 nid=0x36b runnable [0x00007f5b5833b000]
java.lang.Thread.State: RUNNABLE
at sun.nio.ch.EPollArrayWrapper.epollWait(Native Method)
at sun.nio.ch.EPollArrayWrapper.poll(EPollArrayWrapper.java:269)
at sun.nio.ch.EPollSelectorImpl.doSelect(EPollSelectorImpl.java:79)
at sun.nio.ch.SelectorImpl.lockAndDoSelect(SelectorImpl.java:86)
- locked <0x000000071553b638> (a sun.nio.ch.Util$2)
- locked <0x000000071553b628> (a java.util.Collections$UnmodifiableSet)
- locked <0x000000071553aca8> (a sun.nio.ch.EPollSelectorImpl)
at sun.nio.ch.SelectorImpl.select(SelectorImpl.java:97)
at sun.nio.ch.SelectorImpl.select(SelectorImpl.java:101)
at org.apache.hadoop.ipc.Server$Listener$Reader.doRunLoop(Server.java:616)
- locked <0x0000000715eed0c0> (a org.apache.hadoop.ipc.Server$Listener$Reader)
at org.apache.hadoop.ipc.Server$Listener$Reader.run(Server.java:595)
"Timer-0" #30 daemon prio=5 os_prio=0 tid=0x00007f5b85189000 nid=0x343 in Object.wait() [0x00007f5b5883c000]
java.lang.Thread.State: TIMED_WAITING (on object monitor)
at java.lang.Object.wait(Native Method)
at java.util.TimerThread.mainLoop(Timer.java:552)
- locked <0x0000000715efbe78> (a java.util.TaskQueue)
at java.util.TimerThread.run(Timer.java:505)
"1558763625@qtp-1446922577-1 - Acceptor0 HttpServer2$SelectChannelConnectorWithSafeStartup@localhost:54150" #29 daemon prio=5 os_prio=0 tid=0x00007f5b85170800 nid=0x2cf runnable [0x00007f5b5893d000]
java.lang.Thread.State: RUNNABLE
at sun.nio.ch.EPollArrayWrapper.epollWait(Native Method)
at sun.nio.ch.EPollArrayWrapper.poll(EPollArrayWrapper.java:269)
at sun.nio.ch.EPollSelectorImpl.doSelect(EPollSelectorImpl.java:79)
at sun.nio.ch.SelectorImpl.lockAndDoSelect(SelectorImpl.java:86)
- locked <0x000000071423fe48> (a sun.nio.ch.Util$2)
- locked <0x000000071423fe38> (a java.util.Collections$UnmodifiableSet)
- locked <0x000000071423fa60> (a sun.nio.ch.EPollSelectorImpl)
at sun.nio.ch.SelectorImpl.select(SelectorImpl.java:97)
at org.mortbay.io.nio.SelectorManager$SelectSet.doSelect(SelectorManager.java:498)
at org.mortbay.io.nio.SelectorManager.doSelect(SelectorManager.java:192)
at org.mortbay.jetty.nio.SelectChannelConnector.accept(SelectChannelConnector.java:124)
at org.mortbay.jetty.AbstractConnector$Acceptor.run(AbstractConnector.java:708)
at org.mortbay.thread.QueuedThreadPool$PoolThread.run(QueuedThreadPool.java:582)
"1180858072@qtp-1446922577-0" #28 daemon prio=5 os_prio=0 tid=0x00007f5b85176800 nid=0x2ce in Object.wait() [0x00007f5b58e3e000]
java.lang.Thread.State: TIMED_WAITING (on object monitor)
at java.lang.Object.wait(Native Method)
at org.mortbay.thread.QueuedThreadPool$PoolThread.run(QueuedThreadPool.java:626)
- locked <0x0000000714240288> (a org.mortbay.thread.QueuedThreadPool$PoolThread)
"Timer for 'NameNode' metrics system" #26 daemon prio=5 os_prio=0 tid=0x00007f5b85108800 nid=0x2ab in Object.wait() [0x00007f5b599b1000]
java.lang.Thread.State: TIMED_WAITING (on object monitor)
at java.lang.Object.wait(Native Method)
at java.util.TimerThread.mainLoop(Timer.java:552)
- locked <0x0000000711029620> (a java.util.TaskQueue)
at java.util.TimerThread.run(Timer.java:505)
"Service Thread" #17 daemon prio=9 os_prio=0 tid=0x00007f5b842df000 nid=0x7fba runnable [0x0000000000000000]
java.lang.Thread.State: RUNNABLE
"C1 CompilerThread11" #16 daemon prio=9 os_prio=0 tid=0x00007f5b842d2000 nid=0x7fb9 waiting on condition [0x0000000000000000]
java.lang.Thread.State: RUNNABLE
"C1 CompilerThread10" #15 daemon prio=9 os_prio=0 tid=0x00007f5b842d0000 nid=0x7fb8 waiting on condition [0x0000000000000000]
java.lang.Thread.State: RUNNABLE
"C1 CompilerThread9" #14 daemon prio=9 os_prio=0 tid=0x00007f5b842cd800 nid=0x7fb6 waiting on condition [0x0000000000000000]
java.lang.Thread.State: RUNNABLE
"C1 CompilerThread8" #13 daemon prio=9 os_prio=0 tid=0x00007f5b842cb800 nid=0x7fb5 waiting on condition [0x0000000000000000]
java.lang.Thread.State: RUNNABLE
"C2 CompilerThread7" #12 daemon prio=9 os_prio=0 tid=0x00007f5b842c9800 nid=0x7fb4 waiting on condition [0x0000000000000000]
java.lang.Thread.State: RUNNABLE
"C2 CompilerThread6" #11 daemon prio=9 os_prio=0 tid=0x00007f5b842c7800 nid=0x7fb3 waiting on condition [0x0000000000000000]
java.lang.Thread.State: RUNNABLE
"C2 CompilerThread5" #10 daemon prio=9 os_prio=0 tid=0x00007f5b842c5000 nid=0x7fb2 waiting on condition [0x0000000000000000]
java.lang.Thread.State: RUNNABLE
"C2 CompilerThread4" #9 daemon prio=9 os_prio=0 tid=0x00007f5b842bb000 nid=0x7fb1 waiting on condition [0x0000000000000000]
java.lang.Thread.State: RUNNABLE
"C2 CompilerThread3" #8 daemon prio=9 os_prio=0 tid=0x00007f5b842b9000 nid=0x7fb0 waiting on condition [0x0000000000000000]
java.lang.Thread.State: RUNNABLE
"C2 CompilerThread2" #7 daemon prio=9 os_prio=0 tid=0x00007f5b842b6800 nid=0x7faf waiting on condition [0x0000000000000000]
java.lang.Thread.State: RUNNABLE
"C2 CompilerThread1" #6 daemon prio=9 os_prio=0 tid=0x00007f5b842b5000 nid=0x7fae waiting on condition [0x0000000000000000]
java.lang.Thread.State: RUNNABLE
"C2 CompilerThread0" #5 daemon prio=9 os_prio=0 tid=0x00007f5b842b2000 nid=0x7fad waiting on condition [0x0000000000000000]
java.lang.Thread.State: RUNNABLE
"Signal Dispatcher" #4 daemon prio=9 os_prio=0 tid=0x00007f5b842b0800 nid=0x7fac runnable [0x0000000000000000]
java.lang.Thread.State: RUNNABLE
"Finalizer" #3 daemon prio=8 os_prio=0 tid=0x00007f5b84279000 nid=0x7fab in Object.wait() [0x00007f5b5befd000]
java.lang.Thread.State: WAITING (on object monitor)
at java.lang.Object.wait(Native Method)
at java.lang.ref.ReferenceQueue.remove(ReferenceQueue.java:143)
- locked <0x0000000711036650> (a java.lang.ref.ReferenceQueue$Lock)
at java.lang.ref.ReferenceQueue.remove(ReferenceQueue.java:164)
at java.lang.ref.Finalizer$FinalizerThread.run(Finalizer.java:209)
"Reference Handler" #2 daemon prio=10 os_prio=0 tid=0x00007f5b84276800 nid=0x7faa in Object.wait() [0x00007f5b5bffe000]
java.lang.Thread.State: WAITING (on object monitor)
at java.lang.Object.wait(Native Method)
at java.lang.Object.wait(Object.java:502)
at java.lang.ref.Reference$ReferenceHandler.run(Reference.java:157)
- locked <0x0000000711024ff8> (a java.lang.ref.Reference$Lock)
"main" #1 prio=5 os_prio=0 tid=0x00007f5b8400a800 nid=0x7f9b in Object.wait() [0x00007f5b8b51f000]
java.lang.Thread.State: TIMED_WAITING (on object monitor)
at java.lang.Object.wait(Native Method)
at org.apache.hadoop.hbase.ipc.RpcClientImpl.call(RpcClientImpl.java:1228)
- locked <0x0000000789323490> (a org.apache.hadoop.hbase.ipc.Call)
at org.apache.hadoop.hbase.ipc.AbstractRpcClient.callBlockingMethod(AbstractRpcClient.java:214)
at org.apache.hadoop.hbase.ipc.AbstractRpcClient$BlockingRpcChannelImplementation.callBlockingMethod(AbstractRpcClient.java:288)
at org.apache.hadoop.hbase.protobuf.generated.ClientProtos$ClientService$BlockingStub.execService(ClientProtos.java:33056)
at org.apache.hadoop.hbase.protobuf.ProtobufUtil.execService(ProtobufUtil.java:1623)
at org.apache.hadoop.hbase.ipc.RegionCoprocessorRpcChannel$1.call(RegionCoprocessorRpcChannel.java:92)
at org.apache.hadoop.hbase.ipc.RegionCoprocessorRpcChannel$1.call(RegionCoprocessorRpcChannel.java:89)
at org.apache.hadoop.hbase.client.RpcRetryingCaller.callWithRetries(RpcRetryingCaller.java:126)
at org.apache.hadoop.hbase.ipc.RegionCoprocessorRpcChannel.callExecService(RegionCoprocessorRpcChannel.java:96)
at org.apache.hadoop.hbase.ipc.CoprocessorRpcChannel.callBlockingMethod(CoprocessorRpcChannel.java:73)
at org.apache.hadoop.hbase.protobuf.generated.AccessControlProtos$AccessControlService$BlockingStub.grant(AccessControlProtos.java:10280)
at org.apache.hadoop.hbase.protobuf.ProtobufUtil.grant(ProtobufUtil.java:2209)
at org.apache.hadoop.hbase.security.access.SecureTestUtil$8.call(SecureTestUtil.java:502)
at org.apache.hadoop.hbase.security.access.SecureTestUtil$8.call(SecureTestUtil.java:494)
at org.apache.hadoop.hbase.security.access.SecureTestUtil.updateACLs(SecureTestUtil.java:324)
at org.apache.hadoop.hbase.security.access.SecureTestUtil.grantOnTable(SecureTestUtil.java:494)
at org.apache.hadoop.hbase.security.visibility.TestVisibilityLabelsWithACL.testVisibilityLabelsForUserWithNoAuths(TestVisibilityLabelsWithACL.java:203)
at sun.reflect.NativeMethodAccessorImpl.invoke0(Native Method)
at sun.reflect.NativeMethodAccessorImpl.invoke(NativeMethodAccessorImpl.java:62)
at sun.reflect.DelegatingMethodAccessorImpl.invoke(DelegatingMethodAccessorImpl.java:43)
at java.lang.reflect.Method.invoke(Method.java:497)
at org.junit.runners.model.FrameworkMethod$1.runReflectiveCall(FrameworkMethod.java:50)
at org.junit.internal.runners.model.ReflectiveCallable.run(ReflectiveCallable.java:12)
at org.junit.runners.model.FrameworkMethod.invokeExplosively(FrameworkMethod.java:47)
at org.junit.internal.runners.statements.InvokeMethod.evaluate(InvokeMethod.java:17)
at org.junit.rules.TestWatcher$1.evaluate(TestWatcher.java:55)
at org.junit.rules.RunRules.evaluate(RunRules.java:20)
at org.junit.runners.ParentRunner.runLeaf(ParentRunner.java:325)
at org.junit.runners.BlockJUnit4ClassRunner.runChild(BlockJUnit4ClassRunner.java:78)
at org.junit.runners.BlockJUnit4ClassRunner.runChild(BlockJUnit4ClassRunner.java:57)
at org.junit.runners.ParentRunner$3.run(ParentRunner.java:290)
at org.junit.runners.ParentRunner$1.schedule(ParentRunner.java:71)
at org.junit.runners.ParentRunner.runChildren(ParentRunner.java:288)
at org.junit.runners.ParentRunner.access$000(ParentRunner.java:58)
at org.junit.runners.ParentRunner$2.evaluate(ParentRunner.java:268)
at org.junit.internal.runners.statements.RunBefores.evaluate(RunBefores.java:26)
at org.junit.internal.runners.statements.RunAfters.evaluate(RunAfters.java:27)
at org.junit.runners.ParentRunner.run(ParentRunner.java:363)
at org.junit.runners.Suite.runChild(Suite.java:128)
at org.junit.runners.Suite.runChild(Suite.java:27)
at org.junit.runners.ParentRunner$3.run(ParentRunner.java:290)
at org.junit.runners.ParentRunner$1.schedule(ParentRunner.java:71)
at org.junit.runners.ParentRunner.runChildren(ParentRunner.java:288)
at org.junit.runners.ParentRunner.access$000(ParentRunner.java:58)
at org.junit.runners.ParentRunner$2.evaluate(ParentRunner.java:268)
at org.junit.runners.ParentRunner.run(ParentRunner.java:363)
at org.junit.runner.JUnitCore.run(JUnitCore.java:137)
at org.junit.runner.JUnitCore.run(JUnitCore.java:115)
at org.apache.maven.surefire.junitcore.JUnitCoreWrapper.createRequestAndRun(JUnitCoreWrapper.java:108)
at org.apache.maven.surefire.junitcore.JUnitCoreWrapper.executeEager(JUnitCoreWrapper.java:78)
at org.apache.maven.surefire.junitcore.JUnitCoreWrapper.execute(JUnitCoreWrapper.java:54)
at org.apache.maven.surefire.junitcore.JUnitCoreProvider.invoke(JUnitCoreProvider.java:144)
at org.apache.maven.surefire.booter.ForkedBooter.invokeProviderInSameClassLoader(ForkedBooter.java:203)
at org.apache.maven.surefire.booter.ForkedBooter.runSuitesInProcess(ForkedBooter.java:155)
at org.apache.maven.surefire.booter.ForkedBooter.main(ForkedBooter.java:103)
"VM Thread" os_prio=0 tid=0x00007f5b84271800 nid=0x7fa9 runnable
"GC task thread#0 (ParallelGC)" os_prio=0 tid=0x00007f5b8401f800 nid=0x7f9c runnable
"GC task thread#1 (ParallelGC)" os_prio=0 tid=0x00007f5b84021800 nid=0x7f9d runnable
"GC task thread#2 (ParallelGC)" os_prio=0 tid=0x00007f5b84023000 nid=0x7f9e runnable
"GC task thread#3 (ParallelGC)" os_prio=0 tid=0x00007f5b84025000 nid=0x7f9f runnable
"GC task thread#4 (ParallelGC)" os_prio=0 tid=0x00007f5b84026800 nid=0x7fa0 runnable
"GC task thread#5 (ParallelGC)" os_prio=0 tid=0x00007f5b84028800 nid=0x7fa1 runnable
"GC task thread#6 (ParallelGC)" os_prio=0 tid=0x00007f5b8402a000 nid=0x7fa2 runnable
"GC task thread#7 (ParallelGC)" os_prio=0 tid=0x00007f5b8402c000 nid=0x7fa3 runnable
"GC task thread#8 (ParallelGC)" os_prio=0 tid=0x00007f5b8402d800 nid=0x7fa4 runnable
"GC task thread#9 (ParallelGC)" os_prio=0 tid=0x00007f5b8402f800 nid=0x7fa5 runnable
"GC task thread#10 (ParallelGC)" os_prio=0 tid=0x00007f5b84031000 nid=0x7fa6 runnable
"GC task thread#11 (ParallelGC)" os_prio=0 tid=0x00007f5b84033000 nid=0x7fa7 runnable
"GC task thread#12 (ParallelGC)" os_prio=0 tid=0x00007f5b84034800 nid=0x7fa8 runnable
"VM Periodic Task Thread" os_prio=0 tid=0x00007f5b842e2000 nid=0x7fbb waiting on condition
JNI global references: 286
+ echo '************ END zombies jstack extract'
************ END zombies jstack extract
+ JIRA_COMMENT='
{color:red}-1 core zombie tests{color}. There are 2 zombie test(s): at org.apache.hadoop.hbase.security.visibility.TestVisibilityLabelsWithACL.testVisibilityLabelsForUserWithNoAuths(TestVisibilityLabelsWithACL.java:203)'
+ BAD=1
+ jps
+ grep surefirebooter
+ cut -d ' ' -f 1
+ xargs kill -9
POST BUILD TASK : SUCCESS
END OF POST BUILD TASK : 0
Archiving artifacts
Jenkins build is back to normal : HBase-1.2 » latest1.8,Hadoop #243
Posted by Apache Jenkins Server <je...@builds.apache.org>.
See <https://builds.apache.org/job/HBase-1.2/jdk=latest1.8,label=Hadoop/243/changes>
Build failed in Jenkins: HBase-1.2 » latest1.8,Hadoop #242
Posted by Apache Jenkins Server <je...@builds.apache.org>.
See <https://builds.apache.org/job/HBase-1.2/jdk=latest1.8,label=Hadoop/242/changes>
Changes:
[eclark] HBASE-14544 Allow HConnectionImpl to not refresh the dns on errors
[stack] HBASE-14582 Regionserver status webpage bucketcache list can become huge
[eclark] HBASE-14211 Add more rigorous integration tests of splits
[matteo.bertozzi] HBASE-14577 HBase shell help for scan and returning a column family has
[stack] HBASE-14587 Attach a test-sources.jar for hbase-server (Andrew Wang)
------------------------------------------
[...truncated 46721 lines...]
Running org.apache.hadoop.hbase.mapreduce.TestMultithreadedTableMapper
Tests run: 4, Failures: 0, Errors: 0, Skipped: 0, Time elapsed: 190.767 sec - in org.apache.hadoop.hbase.mapreduce.TestMultiTableSnapshotInputFormat
Java HotSpot(TM) 64-Bit Server VM warning: ignoring option MaxPermSize=256m; support was removed in 8.0
Running org.apache.hadoop.hbase.mapreduce.TestTimeRangeMapRed
Tests run: 1, Failures: 0, Errors: 0, Skipped: 0, Time elapsed: 133.376 sec - in org.apache.hadoop.hbase.mapreduce.TestMultithreadedTableMapper
Java HotSpot(TM) 64-Bit Server VM warning: ignoring option MaxPermSize=256m; support was removed in 8.0
Running org.apache.hadoop.hbase.mapreduce.TestSyncTable
Tests run: 7, Failures: 0, Errors: 0, Skipped: 0, Time elapsed: 271.98 sec - in org.apache.hadoop.hbase.mapreduce.TestTableInputFormatScan1
Java HotSpot(TM) 64-Bit Server VM warning: ignoring option MaxPermSize=256m; support was removed in 8.0
Tests run: 1, Failures: 0, Errors: 0, Skipped: 0, Time elapsed: 73.237 sec - in org.apache.hadoop.hbase.mapreduce.TestTimeRangeMapRed
Java HotSpot(TM) 64-Bit Server VM warning: ignoring option MaxPermSize=256m; support was removed in 8.0
Tests run: 12, Failures: 0, Errors: 0, Skipped: 0, Time elapsed: 461.437 sec - in org.apache.hadoop.hbase.mapreduce.TestImportExport
Java HotSpot(TM) 64-Bit Server VM warning: ignoring option MaxPermSize=256m; support was removed in 8.0
Java HotSpot(TM) 64-Bit Server VM warning: ignoring option MaxPermSize=256m; support was removed in 8.0
Running org.apache.hadoop.hbase.mapreduce.TestCopyTable
Running org.apache.hadoop.hbase.TestMetaTableAccessor
Running org.apache.hadoop.hbase.mapreduce.TestMultiTableInputFormat
Tests run: 13, Failures: 0, Errors: 0, Skipped: 0, Time elapsed: 14.529 sec - in org.apache.hadoop.hbase.TestMetaTableAccessor
Java HotSpot(TM) 64-Bit Server VM warning: ignoring option MaxPermSize=256m; support was removed in 8.0
Java HotSpot(TM) 64-Bit Server VM warning: ignoring option MaxPermSize=256m; support was removed in 8.0
Running org.apache.hadoop.hbase.io.TestFileLink
Tests run: 5, Failures: 0, Errors: 0, Skipped: 0, Time elapsed: 15.772 sec - in org.apache.hadoop.hbase.io.TestFileLink
Java HotSpot(TM) 64-Bit Server VM warning: ignoring option MaxPermSize=256m; support was removed in 8.0
Java HotSpot(TM) 64-Bit Server VM warning: ignoring option MaxPermSize=256m; support was removed in 8.0
Tests run: 1, Failures: 0, Errors: 0, Skipped: 0, Time elapsed: 103.442 sec - in org.apache.hadoop.hbase.mapreduce.TestSyncTable
Java HotSpot(TM) 64-Bit Server VM warning: ignoring option MaxPermSize=256m; support was removed in 8.0
Java HotSpot(TM) 64-Bit Server VM warning: ignoring option MaxPermSize=256m; support was removed in 8.0
Java HotSpot(TM) 64-Bit Server VM warning: ignoring option MaxPermSize=256m; support was removed in 8.0
Java HotSpot(TM) 64-Bit Server VM warning: ignoring option MaxPermSize=256m; support was removed in 8.0
Java HotSpot(TM) 64-Bit Server VM warning: ignoring option MaxPermSize=256m; support was removed in 8.0
Running org.apache.hadoop.hbase.io.hfile.TestHFileBlockIndex
Java HotSpot(TM) 64-Bit Server VM warning: ignoring option MaxPermSize=256m; support was removed in 8.0
Java HotSpot(TM) 64-Bit Server VM warning: ignoring option MaxPermSize=256m; support was removed in 8.0
Java HotSpot(TM) 64-Bit Server VM warning: ignoring option MaxPermSize=256m; support was removed in 8.0
Java HotSpot(TM) 64-Bit Server VM warning: ignoring option MaxPermSize=256m; support was removed in 8.0
Java HotSpot(TM) 64-Bit Server VM warning: ignoring option MaxPermSize=256m; support was removed in 8.0
Java HotSpot(TM) 64-Bit Server VM warning: ignoring option MaxPermSize=256m; support was removed in 8.0
Java HotSpot(TM) 64-Bit Server VM warning: ignoring option MaxPermSize=256m; support was removed in 8.0
Running org.apache.hadoop.hbase.io.hfile.TestScannerSelectionUsingTTL
Tests run: 10, Failures: 0, Errors: 0, Skipped: 0, Time elapsed: 9.1 sec - in org.apache.hadoop.hbase.io.hfile.TestHFileBlockIndex
Java HotSpot(TM) 64-Bit Server VM warning: ignoring option MaxPermSize=256m; support was removed in 8.0
Java HotSpot(TM) 64-Bit Server VM warning: ignoring option MaxPermSize=256m; support was removed in 8.0
Running org.apache.hadoop.hbase.io.hfile.TestHFileSeek
Tests run: 1, Failures: 0, Errors: 0, Skipped: 0, Time elapsed: 1.583 sec - in org.apache.hadoop.hbase.io.hfile.TestHFileSeek
Java HotSpot(TM) 64-Bit Server VM warning: ignoring option MaxPermSize=256m; support was removed in 8.0
Java HotSpot(TM) 64-Bit Server VM warning: ignoring option MaxPermSize=256m; support was removed in 8.0
Java HotSpot(TM) 64-Bit Server VM warning: ignoring option MaxPermSize=256m; support was removed in 8.0
Running org.apache.hadoop.hbase.io.hfile.TestHFileBlock
Tests run: 6, Failures: 0, Errors: 0, Skipped: 0, Time elapsed: 63.7 sec - in org.apache.hadoop.hbase.io.hfile.TestScannerSelectionUsingTTL
Java HotSpot(TM) 64-Bit Server VM warning: ignoring option MaxPermSize=256m; support was removed in 8.0
Java HotSpot(TM) 64-Bit Server VM warning: ignoring option MaxPermSize=256m; support was removed in 8.0
Java HotSpot(TM) 64-Bit Server VM warning: ignoring option MaxPermSize=256m; support was removed in 8.0
Java HotSpot(TM) 64-Bit Server VM warning: ignoring option MaxPermSize=256m; support was removed in 8.0
Java HotSpot(TM) 64-Bit Server VM warning: ignoring option MaxPermSize=256m; support was removed in 8.0
Java HotSpot(TM) 64-Bit Server VM warning: ignoring option MaxPermSize=256m; support was removed in 8.0
Java HotSpot(TM) 64-Bit Server VM warning: ignoring option MaxPermSize=256m; support was removed in 8.0
Java HotSpot(TM) 64-Bit Server VM warning: ignoring option MaxPermSize=256m; support was removed in 8.0
Running org.apache.hadoop.hbase.io.hfile.TestCacheConfig
Tests run: 6, Failures: 0, Errors: 0, Skipped: 0, Time elapsed: 1.752 sec - in org.apache.hadoop.hbase.io.hfile.TestCacheConfig
Java HotSpot(TM) 64-Bit Server VM warning: ignoring option MaxPermSize=256m; support was removed in 8.0
Java HotSpot(TM) 64-Bit Server VM warning: ignoring option MaxPermSize=256m; support was removed in 8.0
Java HotSpot(TM) 64-Bit Server VM warning: ignoring option MaxPermSize=256m; support was removed in 8.0
Java HotSpot(TM) 64-Bit Server VM warning: ignoring option MaxPermSize=256m; support was removed in 8.0
Java HotSpot(TM) 64-Bit Server VM warning: ignoring option MaxPermSize=256m; support was removed in 8.0
Java HotSpot(TM) 64-Bit Server VM warning: ignoring option MaxPermSize=256m; support was removed in 8.0
Running org.apache.hadoop.hbase.io.hfile.TestForceCacheImportantBlocks
Tests run: 8, Failures: 0, Errors: 0, Skipped: 0, Time elapsed: 367.279 sec - in org.apache.hadoop.hbase.mapreduce.TestTableSnapshotInputFormat
Java HotSpot(TM) 64-Bit Server VM warning: ignoring option MaxPermSize=256m; support was removed in 8.0
Running org.apache.hadoop.hbase.io.hfile.TestCacheOnWrite
Tests run: 28, Failures: 0, Errors: 0, Skipped: 0, Time elapsed: 92.913 sec - in org.apache.hadoop.hbase.io.hfile.TestHFileBlock
Java HotSpot(TM) 64-Bit Server VM warning: ignoring option MaxPermSize=256m; support was removed in 8.0
Java HotSpot(TM) 64-Bit Server VM warning: ignoring option MaxPermSize=256m; support was removed in 8.0
Java HotSpot(TM) 64-Bit Server VM warning: ignoring option MaxPermSize=256m; support was removed in 8.0
Java HotSpot(TM) 64-Bit Server VM warning: ignoring option MaxPermSize=256m; support was removed in 8.0
Running org.apache.hadoop.hbase.io.encoding.TestLoadAndSwitchEncodeOnDisk
Tests run: 5, Failures: 0, Errors: 0, Skipped: 0, Time elapsed: 161.209 sec - in org.apache.hadoop.hbase.mapreduce.TestCopyTable
Java HotSpot(TM) 64-Bit Server VM warning: ignoring option MaxPermSize=256m; support was removed in 8.0
Tests run: 4, Failures: 0, Errors: 0, Skipped: 0, Time elapsed: 36.096 sec - in org.apache.hadoop.hbase.io.hfile.TestForceCacheImportantBlocks
Java HotSpot(TM) 64-Bit Server VM warning: ignoring option MaxPermSize=256m; support was removed in 8.0
Running org.apache.hadoop.hbase.io.encoding.TestEncodedSeekers
Running org.apache.hadoop.hbase.io.encoding.TestChangingEncoding
Tests run: 4, Failures: 0, Errors: 0, Skipped: 0, Time elapsed: 161.302 sec - in org.apache.hadoop.hbase.mapreduce.TestMultiTableInputFormat
Java HotSpot(TM) 64-Bit Server VM warning: ignoring option MaxPermSize=256m; support was removed in 8.0
Running org.apache.hadoop.hbase.io.encoding.TestDataBlockEncoders
Tests run: 1, Failures: 0, Errors: 0, Skipped: 0, Time elapsed: 27.316 sec - in org.apache.hadoop.hbase.io.encoding.TestLoadAndSwitchEncodeOnDisk
Java HotSpot(TM) 64-Bit Server VM warning: ignoring option MaxPermSize=256m; support was removed in 8.0
Running org.apache.hadoop.hbase.io.encoding.TestBufferedDataBlockEncoder
Tests run: 1, Failures: 0, Errors: 0, Skipped: 0, Time elapsed: 13.722 sec - in org.apache.hadoop.hbase.io.encoding.TestBufferedDataBlockEncoder
Java HotSpot(TM) 64-Bit Server VM warning: ignoring option MaxPermSize=256m; support was removed in 8.0
Java HotSpot(TM) 64-Bit Server VM warning: ignoring option MaxPermSize=256m; support was removed in 8.0
Java HotSpot(TM) 64-Bit Server VM warning: ignoring option MaxPermSize=256m; support was removed in 8.0
Java HotSpot(TM) 64-Bit Server VM warning: ignoring option MaxPermSize=256m; support was removed in 8.0
Java HotSpot(TM) 64-Bit Server VM warning: ignoring option MaxPermSize=256m; support was removed in 8.0
Java HotSpot(TM) 64-Bit Server VM warning: ignoring option MaxPermSize=256m; support was removed in 8.0
Java HotSpot(TM) 64-Bit Server VM warning: ignoring option MaxPermSize=256m; support was removed in 8.0
Running org.apache.hadoop.hbase.filter.TestScanRowPrefix
Tests run: 1, Failures: 0, Errors: 0, Skipped: 0, Time elapsed: 5.3 sec - in org.apache.hadoop.hbase.filter.TestScanRowPrefix
Java HotSpot(TM) 64-Bit Server VM warning: ignoring option MaxPermSize=256m; support was removed in 8.0
Running org.apache.hadoop.hbase.filter.TestFilterWithScanLimits
Tests run: 1, Failures: 0, Errors: 0, Skipped: 0, Time elapsed: 3.878 sec - in org.apache.hadoop.hbase.filter.TestFilterWithScanLimits
Java HotSpot(TM) 64-Bit Server VM warning: ignoring option MaxPermSize=256m; support was removed in 8.0
Java HotSpot(TM) 64-Bit Server VM warning: ignoring option MaxPermSize=256m; support was removed in 8.0
Java HotSpot(TM) 64-Bit Server VM warning: ignoring option MaxPermSize=256m; support was removed in 8.0
Java HotSpot(TM) 64-Bit Server VM warning: ignoring option MaxPermSize=256m; support was removed in 8.0
Java HotSpot(TM) 64-Bit Server VM warning: ignoring option MaxPermSize=256m; support was removed in 8.0
Java HotSpot(TM) 64-Bit Server VM warning: ignoring option MaxPermSize=256m; support was removed in 8.0
Java HotSpot(TM) 64-Bit Server VM warning: ignoring option MaxPermSize=256m; support was removed in 8.0
Running org.apache.hadoop.hbase.filter.TestFilterWrapper
Tests run: 1, Failures: 0, Errors: 0, Skipped: 0, Time elapsed: 3.878 sec - in org.apache.hadoop.hbase.filter.TestFilterWrapper
Java HotSpot(TM) 64-Bit Server VM warning: ignoring option MaxPermSize=256m; support was removed in 8.0
Java HotSpot(TM) 64-Bit Server VM warning: ignoring option MaxPermSize=256m; support was removed in 8.0
Java HotSpot(TM) 64-Bit Server VM warning: ignoring option MaxPermSize=256m; support was removed in 8.0
Java HotSpot(TM) 64-Bit Server VM warning: ignoring option MaxPermSize=256m; support was removed in 8.0
Running org.apache.hadoop.hbase.filter.TestFuzzyRowFilterEndToEnd
Tests run: 72, Failures: 0, Errors: 0, Skipped: 0, Time elapsed: 128.272 sec - in org.apache.hadoop.hbase.io.hfile.TestCacheOnWrite
Java HotSpot(TM) 64-Bit Server VM warning: ignoring option MaxPermSize=256m; support was removed in 8.0
Java HotSpot(TM) 64-Bit Server VM warning: ignoring option MaxPermSize=256m; support was removed in 8.0
Java HotSpot(TM) 64-Bit Server VM warning: ignoring option MaxPermSize=256m; support was removed in 8.0
Java HotSpot(TM) 64-Bit Server VM warning: ignoring option MaxPermSize=256m; support was removed in 8.0
Java HotSpot(TM) 64-Bit Server VM warning: ignoring option MaxPermSize=256m; support was removed in 8.0
Java HotSpot(TM) 64-Bit Server VM warning: ignoring option MaxPermSize=256m; support was removed in 8.0
Java HotSpot(TM) 64-Bit Server VM warning: ignoring option MaxPermSize=256m; support was removed in 8.0
Java HotSpot(TM) 64-Bit Server VM warning: ignoring option MaxPermSize=256m; support was removed in 8.0
Java HotSpot(TM) 64-Bit Server VM warning: ignoring option MaxPermSize=256m; support was removed in 8.0
Running org.apache.hadoop.hbase.filter.TestColumnRangeFilter
Tests run: 20, Failures: 0, Errors: 0, Skipped: 0, Time elapsed: 119.35 sec - in org.apache.hadoop.hbase.io.encoding.TestEncodedSeekers
Java HotSpot(TM) 64-Bit Server VM warning: ignoring option MaxPermSize=256m; support was removed in 8.0
Java HotSpot(TM) 64-Bit Server VM warning: ignoring option MaxPermSize=256m; support was removed in 8.0
Java HotSpot(TM) 64-Bit Server VM warning: ignoring option MaxPermSize=256m; support was removed in 8.0
Java HotSpot(TM) 64-Bit Server VM warning: ignoring option MaxPermSize=256m; support was removed in 8.0
Java HotSpot(TM) 64-Bit Server VM warning: ignoring option MaxPermSize=256m; support was removed in 8.0
Tests run: 1, Failures: 0, Errors: 0, Skipped: 0, Time elapsed: 6.515 sec - in org.apache.hadoop.hbase.filter.TestColumnRangeFilter
Java HotSpot(TM) 64-Bit Server VM warning: ignoring option MaxPermSize=256m; support was removed in 8.0
Running org.apache.hadoop.hbase.filter.TestFuzzyRowAndColumnRangeFilter
Running org.apache.hadoop.hbase.filter.TestMultiRowRangeFilter
Tests run: 1, Failures: 0, Errors: 0, Skipped: 0, Time elapsed: 2.924 sec - in org.apache.hadoop.hbase.filter.TestFuzzyRowAndColumnRangeFilter
Tests run: 3, Failures: 0, Errors: 0, Skipped: 0, Time elapsed: 137.058 sec - in org.apache.hadoop.hbase.io.encoding.TestChangingEncoding
Tests run: 20, Failures: 0, Errors: 0, Skipped: 0, Time elapsed: 18.109 sec - in org.apache.hadoop.hbase.filter.TestMultiRowRangeFilter
Tests run: 28, Failures: 0, Errors: 0, Skipped: 0, Time elapsed: 210.597 sec - in org.apache.hadoop.hbase.io.encoding.TestDataBlockEncoders
Tests run: 2, Failures: 0, Errors: 0, Skipped: 0, Time elapsed: 215.603 sec - in org.apache.hadoop.hbase.filter.TestFuzzyRowFilterEndToEnd
Results :
Flaked tests:
org.apache.hadoop.hbase.master.TestTableLockManager.testReapAllTableLocks(org.apache.hadoop.hbase.master.TestTableLockManager)
Run 1: TestTableLockManager.testReapAllTableLocks:283 » LockTimeout Timed out acquiri...
Run 2: PASS
Tests run: 2529, Failures: 0, Errors: 0, Skipped: 57, Flakes: 1
[INFO] ------------------------------------------------------------------------
[INFO] Reactor Summary:
[INFO]
[INFO] Apache HBase ...................................... SUCCESS [1:07.164s]
[INFO] Apache HBase - Checkstyle ......................... SUCCESS [5.536s]
[INFO] Apache HBase - Resource Bundle .................... SUCCESS [0.162s]
[INFO] Apache HBase - Annotations ........................ SUCCESS [1.429s]
[INFO] Apache HBase - Protocol ........................... SUCCESS [18.334s]
[INFO] Apache HBase - Common ............................. SUCCESS [5:14.698s]
[INFO] Apache HBase - Procedure .......................... SUCCESS [1:53.277s]
[INFO] Apache HBase - Client ............................. SUCCESS [1:26.329s]
[INFO] Apache HBase - Hadoop Compatibility ............... SUCCESS [8.796s]
[INFO] Apache HBase - Hadoop Two Compatibility ........... SUCCESS [7.772s]
[INFO] Apache HBase - Prefix Tree ........................ SUCCESS [7.545s]
[INFO] Apache HBase - Server ............................. FAILURE [1:31:48.614s]
[INFO] Apache HBase - Testing Util ....................... SKIPPED
[INFO] Apache HBase - Thrift ............................. SKIPPED
[INFO] Apache HBase - Rest ............................... SKIPPED
[INFO] Apache HBase - Shell .............................. SKIPPED
[INFO] Apache HBase - Integration Tests .................. SKIPPED
[INFO] Apache HBase - Examples ........................... SKIPPED
[INFO] Apache HBase - External Block Cache ............... SKIPPED
[INFO] Apache HBase - Assembly ........................... SKIPPED
[INFO] Apache HBase - Shaded ............................. SKIPPED
[INFO] Apache HBase - Shaded - Client .................... SKIPPED
[INFO] Apache HBase - Shaded - Server .................... SKIPPED
[INFO] ------------------------------------------------------------------------
[INFO] BUILD FAILURE
[INFO] ------------------------------------------------------------------------
[INFO] Total time: 1:42:39.846s
[INFO] Finished at: Mon Oct 12 23:25:41 UTC 2015
[INFO] Final Memory: 451M/907M
[INFO] ------------------------------------------------------------------------
[ERROR] Failed to execute goal org.apache.maven.plugins:maven-surefire-plugin:2.18.1:test (secondPartTestsExecution) on project hbase-server: There was a timeout or other error in the fork -> [Help 1]
[ERROR]
[ERROR] To see the full stack trace of the errors, re-run Maven with the -e switch.
[ERROR] Re-run Maven using the -X switch to enable full debug logging.
[ERROR]
[ERROR] For more information about the errors and possible solutions, please read the following articles:
[ERROR] [Help 1] http://cwiki.apache.org/confluence/display/MAVEN/MojoFailureException
[ERROR]
[ERROR] After correcting the problems, you can resume the build with the command
[ERROR] mvn <goals> -rf :hbase-server
Build step 'Invoke top-level Maven targets' marked build as failure
Performing Post build task...
Match found for :.* : True
Logical operation result is TRUE
Running script : ZOMBIE_TESTS_COUNT=`jps | grep surefirebooter | wc -l`
if [[ $ZOMBIE_TESTS_COUNT != 0 ]] ; then
#It seems sometimes the tests are not dying immediately. Let's give them 10s
echo "Suspicious java process found - waiting 10s to see if there are just slow to stop"
sleep 10
ZOMBIE_TESTS_COUNT=`jps | grep surefirebooter | wc -l`
if [[ $ZOMBIE_TESTS_COUNT != 0 ]] ; then
echo "There are $ZOMBIE_TESTS_COUNT zombie tests, they should have been killed by surefire but survived"
echo "************ BEGIN zombies jstack extract"
ZB_STACK=`jps | grep surefirebooter | cut -d ' ' -f 1 | xargs -n 1 jstack | grep ".test" | grep "\.java"`
jps | grep surefirebooter | cut -d ' ' -f 1 | xargs -n 1 jstack
echo "************ END zombies jstack extract"
JIRA_COMMENT="$JIRA_COMMENT
{color:red}-1 core zombie tests{color}. There are ${ZOMBIE_TESTS_COUNT} zombie test(s): ${ZB_STACK}"
BAD=1
jps | grep surefirebooter | cut -d ' ' -f 1 | xargs kill -9
else
echo "We're ok: there is no zombie test, but some tests took some time to stop"
fi
else
echo "We're ok: there is no zombie test"
fi
[Hadoop] $ /bin/bash -xe /tmp/hudson5632173649251470752.sh
++ jps
++ wc -l
++ grep surefirebooter
+ ZOMBIE_TESTS_COUNT=2
+ [[ 2 != 0 ]]
+ echo 'Suspicious java process found - waiting 10s to see if there are just slow to stop'
Suspicious java process found - waiting 10s to see if there are just slow to stop
+ sleep 10
++ jps
++ grep surefirebooter
++ wc -l
+ ZOMBIE_TESTS_COUNT=2
+ [[ 2 != 0 ]]
+ echo 'There are 2 zombie tests, they should have been killed by surefire but survived'
There are 2 zombie tests, they should have been killed by surefire but survived
+ echo '************ BEGIN zombies jstack extract'
************ BEGIN zombies jstack extract
++ jps
++ cut -d ' ' -f 1
++ xargs -n 1 jstack
++ grep '\.java'
++ grep surefirebooter
++ grep .test
+ ZB_STACK=
POST BUILD TASK : FAILURE
END OF POST BUILD TASK : 0
Archiving artifacts
Build failed in Jenkins: HBase-1.2 » latest1.8,Hadoop #241
Posted by Apache Jenkins Server <je...@builds.apache.org>.
See <https://builds.apache.org/job/HBase-1.2/jdk=latest1.8,label=Hadoop/241/changes>
Changes:
[eclark] HBASE-14585 Clean up TestSnapshotCloneIndependence
------------------------------------------
[...truncated 46553 lines...]
[INFO] Finished at: Mon Oct 12 20:30:30 UTC 2015
[INFO] Final Memory: 454M/673M
[INFO] ------------------------------------------------------------------------
[ERROR] Failed to execute goal org.apache.maven.plugins:maven-surefire-plugin:2.18.1:test (secondPartTestsExecution) on project hbase-server: There was a timeout or other error in the fork -> [Help 1]
[ERROR]
[ERROR] To see the full stack trace of the errors, re-run Maven with the -e switch.
[ERROR] Re-run Maven using the -X switch to enable full debug logging.
[ERROR]
[ERROR] For more information about the errors and possible solutions, please read the following articles:
[ERROR] [Help 1] http://cwiki.apache.org/confluence/display/MAVEN/MojoFailureException
[ERROR]
[ERROR] After correcting the problems, you can resume the build with the command
[ERROR] mvn <goals> -rf :hbase-server
Build step 'Invoke top-level Maven targets' marked build as failure
Performing Post build task...
Match found for :.* : True
Logical operation result is TRUE
Running script : ZOMBIE_TESTS_COUNT=`jps | grep surefirebooter | wc -l`
if [[ $ZOMBIE_TESTS_COUNT != 0 ]] ; then
#It seems sometimes the tests are not dying immediately. Let's give them 10s
echo "Suspicious java process found - waiting 10s to see if there are just slow to stop"
sleep 10
ZOMBIE_TESTS_COUNT=`jps | grep surefirebooter | wc -l`
if [[ $ZOMBIE_TESTS_COUNT != 0 ]] ; then
echo "There are $ZOMBIE_TESTS_COUNT zombie tests, they should have been killed by surefire but survived"
echo "************ BEGIN zombies jstack extract"
ZB_STACK=`jps | grep surefirebooter | cut -d ' ' -f 1 | xargs -n 1 jstack | grep ".test" | grep "\.java"`
jps | grep surefirebooter | cut -d ' ' -f 1 | xargs -n 1 jstack
echo "************ END zombies jstack extract"
JIRA_COMMENT="$JIRA_COMMENT
{color:red}-1 core zombie tests{color}. There are ${ZOMBIE_TESTS_COUNT} zombie test(s): ${ZB_STACK}"
BAD=1
jps | grep surefirebooter | cut -d ' ' -f 1 | xargs kill -9
else
echo "We're ok: there is no zombie test, but some tests took some time to stop"
fi
else
echo "We're ok: there is no zombie test"
fi
[Hadoop] $ /bin/bash -xe /tmp/hudson5995356686362007419.sh
++ jps
++ grep surefirebooter
++ wc -l
+ ZOMBIE_TESTS_COUNT=2
+ [[ 2 != 0 ]]
+ echo 'Suspicious java process found - waiting 10s to see if there are just slow to stop'
Suspicious java process found - waiting 10s to see if there are just slow to stop
+ sleep 10
++ jps
++ grep surefirebooter
++ wc -l
+ ZOMBIE_TESTS_COUNT=1
+ [[ 1 != 0 ]]
+ echo 'There are 1 zombie tests, they should have been killed by surefire but survived'
There are 1 zombie tests, they should have been killed by surefire but survived
+ echo '************ BEGIN zombies jstack extract'
************ BEGIN zombies jstack extract
++ jps
++ grep surefirebooter
++ cut -d ' ' -f 1
++ xargs -n 1 jstack
++ grep '\.java'
++ grep .test
+ ZB_STACK=' at org.apache.hadoop.hdfs.web.TestWebHdfsTokens.testLazyTokenFetchForSWebhdfs(TestWebHdfsTokens.java:223)'
+ jps
+ grep surefirebooter
+ cut -d ' ' -f 1
+ xargs -n 1 jstack
2015-10-12 20:30:43
Full thread dump Java HotSpot(TM) 64-Bit Server VM (24.55-b03 mixed mode):
"Attach Listener" daemon prio=10 tid=0x00007f99c4001000 nid=0x21f0 waiting on condition [0x0000000000000000]
java.lang.Thread.State: RUNNABLE
"Truststore reloader thread" daemon prio=10 tid=0x00007f99bc421800 nid=0x21ce runnable [0x00007f99c2120000]
java.lang.Thread.State: RUNNABLE
at java.lang.ThreadLocal.createMap(ThreadLocal.java:225)
at java.lang.ThreadLocal.setInitialValue(ThreadLocal.java:166)
at java.lang.ThreadLocal.get(ThreadLocal.java:150)
at java.lang.StringCoding.deref(StringCoding.java:63)
at java.lang.StringCoding.encode(StringCoding.java:330)
at java.lang.String.getBytes(String.java:916)
at java.io.UnixFileSystem.getBooleanAttributes0(Native Method)
at java.io.UnixFileSystem.getBooleanAttributes(UnixFileSystem.java:242)
at java.io.File.exists(File.java:813)
at org.apache.hadoop.security.ssl.ReloadingX509TrustManager.needsReload(ReloadingX509TrustManager.java:149)
at org.apache.hadoop.security.ssl.ReloadingX509TrustManager.run(ReloadingX509TrustManager.java:193)
at java.lang.Thread.run(Thread.java:745)
"Truststore reloader thread" daemon prio=10 tid=0x00007f99bc427000 nid=0x21cd waiting on condition [0x00007f99c2222000]
java.lang.Thread.State: TIMED_WAITING (sleeping)
at java.lang.Thread.sleep(Native Method)
at org.apache.hadoop.security.ssl.ReloadingX509TrustManager.run(ReloadingX509TrustManager.java:189)
at java.lang.Thread.run(Thread.java:745)
"Truststore reloader thread" daemon prio=10 tid=0x00007f99bc41f800 nid=0x21cb waiting on condition [0x00007f99c2323000]
java.lang.Thread.State: TIMED_WAITING (sleeping)
at java.lang.Thread.sleep(Native Method)
at org.apache.hadoop.security.ssl.ReloadingX509TrustManager.run(ReloadingX509TrustManager.java:189)
at java.lang.Thread.run(Thread.java:745)
"Truststore reloader thread" daemon prio=10 tid=0x00007f99bc2f0000 nid=0x217f waiting on condition [0x00007f99c2424000]
java.lang.Thread.State: TIMED_WAITING (sleeping)
at java.lang.Thread.sleep(Native Method)
at org.apache.hadoop.security.ssl.ReloadingX509TrustManager.run(ReloadingX509TrustManager.java:189)
at java.lang.Thread.run(Thread.java:745)
"org.apache.hadoop.fs.FileSystem$Statistics$StatisticsDataReferenceCleaner" daemon prio=10 tid=0x00007f99bc0c7000 nid=0x217e in Object.wait() [0x00007f99c2999000]
java.lang.Thread.State: WAITING (on object monitor)
at java.lang.Object.wait(Native Method)
- waiting on <0x00000007e12a8068> (a java.lang.ref.ReferenceQueue$Lock)
at java.lang.ref.ReferenceQueue.remove(ReferenceQueue.java:135)
- locked <0x00000007e12a8068> (a java.lang.ref.ReferenceQueue$Lock)
at java.lang.ref.ReferenceQueue.remove(ReferenceQueue.java:151)
at org.apache.hadoop.fs.FileSystem$Statistics$StatisticsDataReferenceCleaner.run(FileSystem.java:3101)
at java.lang.Thread.run(Thread.java:745)
"process reaper" daemon prio=10 tid=0x00007f99d4941800 nid=0x2179 waiting on condition [0x00007f99c2efb000]
java.lang.Thread.State: TIMED_WAITING (parking)
at sun.misc.Unsafe.park(Native Method)
- parking to wait for <0x00000007e12b0078> (a java.util.concurrent.SynchronousQueue$TransferStack)
at java.util.concurrent.locks.LockSupport.parkNanos(LockSupport.java:226)
at java.util.concurrent.SynchronousQueue$TransferStack.awaitFulfill(SynchronousQueue.java:460)
at java.util.concurrent.SynchronousQueue$TransferStack.transfer(SynchronousQueue.java:359)
at java.util.concurrent.SynchronousQueue.poll(SynchronousQueue.java:942)
at java.util.concurrent.ThreadPoolExecutor.getTask(ThreadPoolExecutor.java:1068)
at java.util.concurrent.ThreadPoolExecutor.runWorker(ThreadPoolExecutor.java:1130)
at java.util.concurrent.ThreadPoolExecutor$Worker.run(ThreadPoolExecutor.java:615)
at java.lang.Thread.run(Thread.java:745)
"Service Thread" daemon prio=10 tid=0x00007f99d4291000 nid=0x2176 runnable [0x0000000000000000]
java.lang.Thread.State: RUNNABLE
"C2 CompilerThread1" daemon prio=10 tid=0x00007f99d428e800 nid=0x2175 waiting on condition [0x0000000000000000]
java.lang.Thread.State: RUNNABLE
"C2 CompilerThread0" daemon prio=10 tid=0x00007f99d428b800 nid=0x2174 runnable [0x0000000000000000]
java.lang.Thread.State: RUNNABLE
"Signal Dispatcher" daemon prio=10 tid=0x00007f99d4281800 nid=0x2173 runnable [0x0000000000000000]
java.lang.Thread.State: RUNNABLE
"Finalizer" daemon prio=10 tid=0x00007f99d426b000 nid=0x2172 in Object.wait() [0x00007f99c8378000]
java.lang.Thread.State: WAITING (on object monitor)
at java.lang.Object.wait(Native Method)
- waiting on <0x00000007e1281e70> (a java.lang.ref.ReferenceQueue$Lock)
at java.lang.ref.ReferenceQueue.remove(ReferenceQueue.java:135)
- locked <0x00000007e1281e70> (a java.lang.ref.ReferenceQueue$Lock)
at java.lang.ref.ReferenceQueue.remove(ReferenceQueue.java:151)
at java.lang.ref.Finalizer$FinalizerThread.run(Finalizer.java:189)
"Reference Handler" daemon prio=10 tid=0x00007f99d4267000 nid=0x2171 in Object.wait() [0x00007f99c8479000]
java.lang.Thread.State: WAITING (on object monitor)
at java.lang.Object.wait(Native Method)
- waiting on <0x00000007e1281830> (a java.lang.ref.Reference$Lock)
at java.lang.Object.wait(Object.java:503)
at java.lang.ref.Reference$ReferenceHandler.run(Reference.java:133)
- locked <0x00000007e1281830> (a java.lang.ref.Reference$Lock)
"main" prio=10 tid=0x00007f99d400a000 nid=0x2162 runnable [0x00007f99dc538000]
java.lang.Thread.State: RUNNABLE
at sun.misc.Unsafe.putOrderedObject(Native Method)
at java.util.concurrent.ConcurrentHashMap.setEntryAt(ConcurrentHashMap.java:316)
at java.util.concurrent.ConcurrentHashMap$Segment.put(ConcurrentHashMap.java:462)
at java.util.concurrent.ConcurrentHashMap.putIfAbsent(ConcurrentHashMap.java:1150)
at java.lang.ClassLoader.getClassLoadingLock(ClassLoader.java:464)
at java.lang.ClassLoader.loadClass(ClassLoader.java:405)
at java.lang.ClassLoader.loadClass(ClassLoader.java:412)
- locked <0x00000007e12c0638> (a java.lang.Object)
at sun.misc.Launcher$AppClassLoader.loadClass(Launcher.java:308)
at java.lang.ClassLoader.loadClass(ClassLoader.java:358)
at org.apache.hadoop.hdfs.server.namenode.NameNode.createNameNode(NameNode.java:1451)
at org.apache.hadoop.hdfs.MiniDFSCluster.createNameNode(MiniDFSCluster.java:1155)
at org.apache.hadoop.hdfs.MiniDFSCluster.createNameNodesAndSetConf(MiniDFSCluster.java:1030)
at org.apache.hadoop.hdfs.MiniDFSCluster.initMiniDFSCluster(MiniDFSCluster.java:820)
at org.apache.hadoop.hdfs.MiniDFSCluster.<init>(MiniDFSCluster.java:479)
at org.apache.hadoop.hdfs.MiniDFSCluster$Builder.build(MiniDFSCluster.java:438)
at org.apache.hadoop.hdfs.web.TestWebHdfsTokens.testLazyTokenFetchForSWebhdfs(TestWebHdfsTokens.java:223)
at sun.reflect.NativeMethodAccessorImpl.invoke0(Native Method)
at sun.reflect.NativeMethodAccessorImpl.invoke(NativeMethodAccessorImpl.java:57)
at sun.reflect.DelegatingMethodAccessorImpl.invoke(DelegatingMethodAccessorImpl.java:43)
at java.lang.reflect.Method.invoke(Method.java:606)
at org.junit.runners.model.FrameworkMethod$1.runReflectiveCall(FrameworkMethod.java:47)
at org.junit.internal.runners.model.ReflectiveCallable.run(ReflectiveCallable.java:12)
at org.junit.runners.model.FrameworkMethod.invokeExplosively(FrameworkMethod.java:44)
at org.junit.internal.runners.statements.InvokeMethod.evaluate(InvokeMethod.java:17)
at org.junit.runners.ParentRunner.runLeaf(ParentRunner.java:271)
at org.junit.runners.BlockJUnit4ClassRunner.runChild(BlockJUnit4ClassRunner.java:70)
at org.junit.runners.BlockJUnit4ClassRunner.runChild(BlockJUnit4ClassRunner.java:50)
at org.junit.runners.ParentRunner$3.run(ParentRunner.java:238)
at org.junit.runners.ParentRunner$1.schedule(ParentRunner.java:63)
at org.junit.runners.ParentRunner.runChildren(ParentRunner.java:236)
at org.junit.runners.ParentRunner.access$000(ParentRunner.java:53)
at org.junit.runners.ParentRunner$2.evaluate(ParentRunner.java:229)
at org.junit.internal.runners.statements.RunBefores.evaluate(RunBefores.java:26)
at org.junit.runners.ParentRunner.run(ParentRunner.java:309)
at org.apache.maven.surefire.junit4.JUnit4Provider.execute(JUnit4Provider.java:264)
at org.apache.maven.surefire.junit4.JUnit4Provider.executeTestSet(JUnit4Provider.java:153)
at org.apache.maven.surefire.junit4.JUnit4Provider.invoke(JUnit4Provider.java:124)
at org.apache.maven.surefire.booter.ForkedBooter.invokeProviderInSameClassLoader(ForkedBooter.java:200)
at org.apache.maven.surefire.booter.ForkedBooter.runSuitesInProcess(ForkedBooter.java:153)
at org.apache.maven.surefire.booter.ForkedBooter.main(ForkedBooter.java:103)
"VM Thread" prio=10 tid=0x00007f99d4264800 nid=0x2170 runnable
"GC task thread#0 (ParallelGC)" prio=10 tid=0x00007f99d4020000 nid=0x2163 runnable
"GC task thread#1 (ParallelGC)" prio=10 tid=0x00007f99d4022000 nid=0x2164 runnable
"GC task thread#2 (ParallelGC)" prio=10 tid=0x00007f99d4023800 nid=0x2165 runnable
"GC task thread#3 (ParallelGC)" prio=10 tid=0x00007f99d4025800 nid=0x2166 runnable
"GC task thread#4 (ParallelGC)" prio=10 tid=0x00007f99d4027800 nid=0x2167 runnable
"GC task thread#5 (ParallelGC)" prio=10 tid=0x00007f99d4029800 nid=0x2168 runnable
"GC task thread#6 (ParallelGC)" prio=10 tid=0x00007f99d402b000 nid=0x2169 runnable
"GC task thread#7 (ParallelGC)" prio=10 tid=0x00007f99d402d000 nid=0x216a runnable
"GC task thread#8 (ParallelGC)" prio=10 tid=0x00007f99d402f000 nid=0x216b runnable
"GC task thread#9 (ParallelGC)" prio=10 tid=0x00007f99d4030800 nid=0x216c runnable
"GC task thread#10 (ParallelGC)" prio=10 tid=0x00007f99d4032800 nid=0x216d runnable
"GC task thread#11 (ParallelGC)" prio=10 tid=0x00007f99d4034800 nid=0x216e runnable
"GC task thread#12 (ParallelGC)" prio=10 tid=0x00007f99d4036800 nid=0x216f runnable
"VM Periodic Task Thread" prio=10 tid=0x00007f99d429b800 nid=0x2177 waiting on condition
JNI global references: 158
+ echo '************ END zombies jstack extract'
************ END zombies jstack extract
+ JIRA_COMMENT='
{color:red}-1 core zombie tests{color}. There are 1 zombie test(s): at org.apache.hadoop.hdfs.web.TestWebHdfsTokens.testLazyTokenFetchForSWebhdfs(TestWebHdfsTokens.java:223)'
+ BAD=1
+ jps
+ grep surefirebooter
+ cut -d ' ' -f 1
+ xargs kill -9
POST BUILD TASK : SUCCESS
END OF POST BUILD TASK : 0
Archiving artifacts
Build failed in Jenkins: HBase-1.2 » latest1.8,Hadoop #240
Posted by Apache Jenkins Server <je...@builds.apache.org>.
See <https://builds.apache.org/job/HBase-1.2/jdk=latest1.8,label=Hadoop/240/>
------------------------------------------
[...truncated 49067 lines...]
at sun.nio.ch.EPollSelectorImpl.doSelect(EPollSelectorImpl.java:79)
at sun.nio.ch.SelectorImpl.lockAndDoSelect(SelectorImpl.java:86)
- locked <0x0000000715343c08> (a sun.nio.ch.Util$2)
- locked <0x0000000715343bf8> (a java.util.Collections$UnmodifiableSet)
- locked <0x00000007153437d0> (a sun.nio.ch.EPollSelectorImpl)
at sun.nio.ch.SelectorImpl.select(SelectorImpl.java:97)
at sun.nio.ch.SelectorImpl.select(SelectorImpl.java:101)
at org.apache.hadoop.ipc.Server$Listener.run(Server.java:668)
"IPC Server Responder" #36 daemon prio=5 os_prio=0 tid=0x00007f9ff52c6000 nid=0x7dac runnable [0x00007f9fb5511000]
java.lang.Thread.State: RUNNABLE
at sun.nio.ch.EPollArrayWrapper.epollWait(Native Method)
at sun.nio.ch.EPollArrayWrapper.poll(EPollArrayWrapper.java:269)
at sun.nio.ch.EPollSelectorImpl.doSelect(EPollSelectorImpl.java:79)
at sun.nio.ch.SelectorImpl.lockAndDoSelect(SelectorImpl.java:86)
- locked <0x00000007153458c0> (a sun.nio.ch.Util$2)
- locked <0x00000007153458b0> (a java.util.Collections$UnmodifiableSet)
- locked <0x0000000715345798> (a sun.nio.ch.EPollSelectorImpl)
at sun.nio.ch.SelectorImpl.select(SelectorImpl.java:97)
at org.apache.hadoop.ipc.Server$Responder.doRunLoop(Server.java:835)
at org.apache.hadoop.ipc.Server$Responder.run(Server.java:818)
"org.apache.hadoop.hdfs.server.blockmanagement.BlockManager$ReplicationMonitor@6ff65192" #31 daemon prio=5 os_prio=0 tid=0x00007f9ff52b9000 nid=0x7dab waiting on condition [0x00007f9fb510d000]
java.lang.Thread.State: TIMED_WAITING (sleeping)
at java.lang.Thread.sleep(Native Method)
at org.apache.hadoop.hdfs.server.blockmanagement.BlockManager$ReplicationMonitor.run(BlockManager.java:3397)
at java.lang.Thread.run(Thread.java:745)
"org.apache.hadoop.hdfs.server.blockmanagement.HeartbeatManager$Monitor@2dd80673" #32 daemon prio=5 os_prio=0 tid=0x00007f9ff52b7000 nid=0x7daa waiting on condition [0x00007f9fb520e000]
java.lang.Thread.State: TIMED_WAITING (sleeping)
at java.lang.Thread.sleep(Native Method)
at org.apache.hadoop.hdfs.server.blockmanagement.HeartbeatManager$Monitor.run(HeartbeatManager.java:319)
at java.lang.Thread.run(Thread.java:745)
"org.apache.hadoop.hdfs.server.blockmanagement.DecommissionManager$Monitor@7a7471ce" #42 daemon prio=5 os_prio=0 tid=0x00007f9ff52b6000 nid=0x7da9 waiting on condition [0x00007f9fb530f000]
java.lang.Thread.State: TIMED_WAITING (sleeping)
at java.lang.Thread.sleep(Native Method)
at org.apache.hadoop.hdfs.server.blockmanagement.DecommissionManager$Monitor.run(DecommissionManager.java:76)
at java.lang.Thread.run(Thread.java:745)
"org.apache.hadoop.hdfs.server.blockmanagement.PendingReplicationBlocks$PendingReplicationMonitor@132ddbab" #41 daemon prio=5 os_prio=0 tid=0x00007f9ff52b3800 nid=0x7da8 waiting on condition [0x00007f9fb5410000]
java.lang.Thread.State: TIMED_WAITING (sleeping)
at java.lang.Thread.sleep(Native Method)
at org.apache.hadoop.hdfs.server.blockmanagement.PendingReplicationBlocks$PendingReplicationMonitor.run(PendingReplicationBlocks.java:221)
at java.lang.Thread.run(Thread.java:745)
"org.apache.hadoop.util.JvmPauseMonitor$Monitor@48c35007" #37 daemon prio=5 os_prio=0 tid=0x00007f9ff52a8800 nid=0x7da2 waiting on condition [0x00007f9fb5612000]
java.lang.Thread.State: TIMED_WAITING (sleeping)
at java.lang.Thread.sleep(Native Method)
at org.apache.hadoop.util.JvmPauseMonitor$Monitor.run(JvmPauseMonitor.java:180)
at java.lang.Thread.run(Thread.java:745)
"IPC Server idle connection scanner for port 53475" #35 daemon prio=5 os_prio=0 tid=0x00007f9ff5288000 nid=0x7da1 in Object.wait() [0x00007f9fb5713000]
java.lang.Thread.State: TIMED_WAITING (on object monitor)
at java.lang.Object.wait(Native Method)
at java.util.TimerThread.mainLoop(Timer.java:552)
- locked <0x0000000715342ec8> (a java.util.TaskQueue)
at java.util.TimerThread.run(Timer.java:505)
"Socket Reader #1 for port 53475" #34 prio=5 os_prio=0 tid=0x00007f9ff5286800 nid=0x7da0 runnable [0x00007f9fb5814000]
java.lang.Thread.State: RUNNABLE
at sun.nio.ch.EPollArrayWrapper.epollWait(Native Method)
at sun.nio.ch.EPollArrayWrapper.poll(EPollArrayWrapper.java:269)
at sun.nio.ch.EPollSelectorImpl.doSelect(EPollSelectorImpl.java:79)
at sun.nio.ch.SelectorImpl.lockAndDoSelect(SelectorImpl.java:86)
- locked <0x0000000715342c08> (a sun.nio.ch.Util$2)
- locked <0x0000000715342bf8> (a java.util.Collections$UnmodifiableSet)
- locked <0x0000000714b32e08> (a sun.nio.ch.EPollSelectorImpl)
at sun.nio.ch.SelectorImpl.select(SelectorImpl.java:97)
at sun.nio.ch.SelectorImpl.select(SelectorImpl.java:101)
at org.apache.hadoop.ipc.Server$Listener$Reader.doRunLoop(Server.java:616)
- locked <0x0000000715343ed0> (a org.apache.hadoop.ipc.Server$Listener$Reader)
at org.apache.hadoop.ipc.Server$Listener$Reader.run(Server.java:595)
"Timer-0" #30 daemon prio=5 os_prio=0 tid=0x00007f9ff513e800 nid=0x7d93 in Object.wait() [0x00007f9fb5d15000]
java.lang.Thread.State: TIMED_WAITING (on object monitor)
at java.lang.Object.wait(Native Method)
at java.util.TimerThread.mainLoop(Timer.java:552)
- locked <0x0000000714b08910> (a java.util.TaskQueue)
at java.util.TimerThread.run(Timer.java:505)
"1811922029@qtp-2024415090-1 - Acceptor0 HttpServer2$SelectChannelConnectorWithSafeStartup@localhost:37139" #29 daemon prio=5 os_prio=0 tid=0x00007f9ff512c800 nid=0x7d37 runnable [0x00007f9fb5e15000]
java.lang.Thread.State: RUNNABLE
at sun.nio.ch.EPollArrayWrapper.epollWait(Native Method)
at sun.nio.ch.EPollArrayWrapper.poll(EPollArrayWrapper.java:269)
at sun.nio.ch.EPollSelectorImpl.doSelect(EPollSelectorImpl.java:79)
at sun.nio.ch.SelectorImpl.lockAndDoSelect(SelectorImpl.java:86)
- locked <0x000000071535ae30> (a sun.nio.ch.Util$2)
- locked <0x000000071535ae40> (a java.util.Collections$UnmodifiableSet)
- locked <0x000000071535ade8> (a sun.nio.ch.EPollSelectorImpl)
at sun.nio.ch.SelectorImpl.select(SelectorImpl.java:97)
at org.mortbay.io.nio.SelectorManager$SelectSet.doSelect(SelectorManager.java:498)
at org.mortbay.io.nio.SelectorManager.doSelect(SelectorManager.java:192)
at org.mortbay.jetty.nio.SelectChannelConnector.accept(SelectChannelConnector.java:124)
at org.mortbay.jetty.AbstractConnector$Acceptor.run(AbstractConnector.java:708)
at org.mortbay.thread.QueuedThreadPool$PoolThread.run(QueuedThreadPool.java:582)
"1408695561@qtp-2024415090-0" #28 daemon prio=5 os_prio=0 tid=0x00007f9ff512b800 nid=0x7d36 in Object.wait() [0x00007f9fb6317000]
java.lang.Thread.State: TIMED_WAITING (on object monitor)
at java.lang.Object.wait(Native Method)
at org.mortbay.thread.QueuedThreadPool$PoolThread.run(QueuedThreadPool.java:626)
- locked <0x0000000714b08960> (a org.mortbay.thread.QueuedThreadPool$PoolThread)
"Timer for 'NameNode' metrics system" #26 daemon prio=5 os_prio=0 tid=0x00007f9ff50c2800 nid=0x7ca7 in Object.wait() [0x00007f9fb6e8a000]
java.lang.Thread.State: TIMED_WAITING (on object monitor)
at java.lang.Object.wait(Native Method)
at java.util.TimerThread.mainLoop(Timer.java:552)
- locked <0x000000071102f3b0> (a java.util.TaskQueue)
at java.util.TimerThread.run(Timer.java:505)
"Service Thread" #17 daemon prio=9 os_prio=0 tid=0x00007f9ff42d6800 nid=0x7ba6 runnable [0x0000000000000000]
java.lang.Thread.State: RUNNABLE
"C1 CompilerThread11" #16 daemon prio=9 os_prio=0 tid=0x00007f9ff42d1800 nid=0x7ba5 waiting on condition [0x0000000000000000]
java.lang.Thread.State: RUNNABLE
"C1 CompilerThread10" #15 daemon prio=9 os_prio=0 tid=0x00007f9ff42cf800 nid=0x7ba4 waiting on condition [0x0000000000000000]
java.lang.Thread.State: RUNNABLE
"C1 CompilerThread9" #14 daemon prio=9 os_prio=0 tid=0x00007f9ff42cd800 nid=0x7ba3 waiting on condition [0x0000000000000000]
java.lang.Thread.State: RUNNABLE
"C1 CompilerThread8" #13 daemon prio=9 os_prio=0 tid=0x00007f9ff42cb800 nid=0x7ba2 waiting on condition [0x0000000000000000]
java.lang.Thread.State: RUNNABLE
"C2 CompilerThread7" #12 daemon prio=9 os_prio=0 tid=0x00007f9ff42c9800 nid=0x7ba1 waiting on condition [0x0000000000000000]
java.lang.Thread.State: RUNNABLE
"C2 CompilerThread6" #11 daemon prio=9 os_prio=0 tid=0x00007f9ff42c7800 nid=0x7ba0 waiting on condition [0x0000000000000000]
java.lang.Thread.State: RUNNABLE
"C2 CompilerThread5" #10 daemon prio=9 os_prio=0 tid=0x00007f9ff42c5000 nid=0x7b9f waiting on condition [0x0000000000000000]
java.lang.Thread.State: RUNNABLE
"C2 CompilerThread4" #9 daemon prio=9 os_prio=0 tid=0x00007f9ff42bb000 nid=0x7b9e waiting on condition [0x0000000000000000]
java.lang.Thread.State: RUNNABLE
"C2 CompilerThread3" #8 daemon prio=9 os_prio=0 tid=0x00007f9ff42b9000 nid=0x7b9d waiting on condition [0x0000000000000000]
java.lang.Thread.State: RUNNABLE
"C2 CompilerThread2" #7 daemon prio=9 os_prio=0 tid=0x00007f9ff42b6800 nid=0x7b9c waiting on condition [0x0000000000000000]
java.lang.Thread.State: RUNNABLE
"C2 CompilerThread1" #6 daemon prio=9 os_prio=0 tid=0x00007f9ff42b5000 nid=0x7b9b waiting on condition [0x0000000000000000]
java.lang.Thread.State: RUNNABLE
"C2 CompilerThread0" #5 daemon prio=9 os_prio=0 tid=0x00007f9ff42b2000 nid=0x7b9a waiting on condition [0x0000000000000000]
java.lang.Thread.State: RUNNABLE
"Signal Dispatcher" #4 daemon prio=9 os_prio=0 tid=0x00007f9ff42b0800 nid=0x7b99 runnable [0x0000000000000000]
java.lang.Thread.State: RUNNABLE
"Finalizer" #3 daemon prio=8 os_prio=0 tid=0x00007f9ff4279000 nid=0x7b95 in Object.wait() [0x00007f9fbd3d2000]
java.lang.Thread.State: WAITING (on object monitor)
at java.lang.Object.wait(Native Method)
at java.lang.ref.ReferenceQueue.remove(ReferenceQueue.java:143)
- locked <0x000000071102dab0> (a java.lang.ref.ReferenceQueue$Lock)
at java.lang.ref.ReferenceQueue.remove(ReferenceQueue.java:164)
at java.lang.ref.Finalizer$FinalizerThread.run(Finalizer.java:209)
"Reference Handler" #2 daemon prio=10 os_prio=0 tid=0x00007f9ff4276800 nid=0x7b94 in Object.wait() [0x00007f9fbd4d3000]
java.lang.Thread.State: WAITING (on object monitor)
at java.lang.Object.wait(Native Method)
at java.lang.Object.wait(Object.java:502)
at java.lang.ref.Reference$ReferenceHandler.run(Reference.java:157)
- locked <0x000000071102dd10> (a java.lang.ref.Reference$Lock)
"main" #1 prio=5 os_prio=0 tid=0x00007f9ff400a800 nid=0x7b7e waiting on condition [0x00007f9ffc9ee000]
java.lang.Thread.State: TIMED_WAITING (sleeping)
at java.lang.Thread.sleep(Native Method)
at org.apache.hadoop.hbase.client.HBaseAdmin$ProcedureFuture.waitProcedureResult(HBaseAdmin.java:4244)
at org.apache.hadoop.hbase.client.HBaseAdmin$ProcedureFuture.get(HBaseAdmin.java:4173)
at org.apache.hadoop.hbase.client.HBaseAdmin.disableTable(HBaseAdmin.java:1219)
at org.apache.hadoop.hbase.HBaseTestingUtility.deleteTable(HBaseTestingUtility.java:1877)
at org.apache.hadoop.hbase.security.access.TestCellACLs.tearDown(TestCellACLs.java:482)
at sun.reflect.NativeMethodAccessorImpl.invoke0(Native Method)
at sun.reflect.NativeMethodAccessorImpl.invoke(NativeMethodAccessorImpl.java:62)
at sun.reflect.DelegatingMethodAccessorImpl.invoke(DelegatingMethodAccessorImpl.java:43)
at java.lang.reflect.Method.invoke(Method.java:497)
at org.junit.runners.model.FrameworkMethod$1.runReflectiveCall(FrameworkMethod.java:50)
at org.junit.internal.runners.model.ReflectiveCallable.run(ReflectiveCallable.java:12)
at org.junit.runners.model.FrameworkMethod.invokeExplosively(FrameworkMethod.java:47)
at org.junit.internal.runners.statements.RunAfters.evaluate(RunAfters.java:33)
at org.junit.rules.TestWatcher$1.evaluate(TestWatcher.java:55)
at org.junit.rules.RunRules.evaluate(RunRules.java:20)
at org.junit.runners.ParentRunner.runLeaf(ParentRunner.java:325)
at org.junit.runners.BlockJUnit4ClassRunner.runChild(BlockJUnit4ClassRunner.java:78)
at org.junit.runners.BlockJUnit4ClassRunner.runChild(BlockJUnit4ClassRunner.java:57)
at org.junit.runners.ParentRunner$3.run(ParentRunner.java:290)
at org.junit.runners.ParentRunner$1.schedule(ParentRunner.java:71)
at org.junit.runners.ParentRunner.runChildren(ParentRunner.java:288)
at org.junit.runners.ParentRunner.access$000(ParentRunner.java:58)
at org.junit.runners.ParentRunner$2.evaluate(ParentRunner.java:268)
at org.junit.internal.runners.statements.RunBefores.evaluate(RunBefores.java:26)
at org.junit.internal.runners.statements.RunAfters.evaluate(RunAfters.java:27)
at org.junit.runners.ParentRunner.run(ParentRunner.java:363)
at org.junit.runners.Suite.runChild(Suite.java:128)
at org.junit.runners.Suite.runChild(Suite.java:27)
at org.junit.runners.ParentRunner$3.run(ParentRunner.java:290)
at org.junit.runners.ParentRunner$1.schedule(ParentRunner.java:71)
at org.junit.runners.ParentRunner.runChildren(ParentRunner.java:288)
at org.junit.runners.ParentRunner.access$000(ParentRunner.java:58)
at org.junit.runners.ParentRunner$2.evaluate(ParentRunner.java:268)
at org.junit.runners.ParentRunner.run(ParentRunner.java:363)
at org.junit.runner.JUnitCore.run(JUnitCore.java:137)
at org.junit.runner.JUnitCore.run(JUnitCore.java:115)
at org.apache.maven.surefire.junitcore.JUnitCoreWrapper.createRequestAndRun(JUnitCoreWrapper.java:108)
at org.apache.maven.surefire.junitcore.JUnitCoreWrapper.executeEager(JUnitCoreWrapper.java:78)
at org.apache.maven.surefire.junitcore.JUnitCoreWrapper.execute(JUnitCoreWrapper.java:54)
at org.apache.maven.surefire.junitcore.JUnitCoreProvider.invoke(JUnitCoreProvider.java:144)
at org.apache.maven.surefire.booter.ForkedBooter.invokeProviderInSameClassLoader(ForkedBooter.java:203)
at org.apache.maven.surefire.booter.ForkedBooter.runSuitesInProcess(ForkedBooter.java:155)
at org.apache.maven.surefire.booter.ForkedBooter.main(ForkedBooter.java:103)
"VM Thread" os_prio=0 tid=0x00007f9ff4271800 nid=0x7b92 runnable
"GC task thread#0 (ParallelGC)" os_prio=0 tid=0x00007f9ff401f800 nid=0x7b81 runnable
"GC task thread#1 (ParallelGC)" os_prio=0 tid=0x00007f9ff4021800 nid=0x7b82 runnable
"GC task thread#2 (ParallelGC)" os_prio=0 tid=0x00007f9ff4023000 nid=0x7b83 runnable
"GC task thread#3 (ParallelGC)" os_prio=0 tid=0x00007f9ff4025000 nid=0x7b84 runnable
"GC task thread#4 (ParallelGC)" os_prio=0 tid=0x00007f9ff4026800 nid=0x7b85 runnable
"GC task thread#5 (ParallelGC)" os_prio=0 tid=0x00007f9ff4028800 nid=0x7b86 runnable
"GC task thread#6 (ParallelGC)" os_prio=0 tid=0x00007f9ff402a000 nid=0x7b87 runnable
"GC task thread#7 (ParallelGC)" os_prio=0 tid=0x00007f9ff402c000 nid=0x7b88 runnable
"GC task thread#8 (ParallelGC)" os_prio=0 tid=0x00007f9ff402d800 nid=0x7b89 runnable
"GC task thread#9 (ParallelGC)" os_prio=0 tid=0x00007f9ff402f800 nid=0x7b8a runnable
"GC task thread#10 (ParallelGC)" os_prio=0 tid=0x00007f9ff4031000 nid=0x7b8b runnable
"GC task thread#11 (ParallelGC)" os_prio=0 tid=0x00007f9ff4033000 nid=0x7b8c runnable
"GC task thread#12 (ParallelGC)" os_prio=0 tid=0x00007f9ff4034800 nid=0x7b8d runnable
"VM Periodic Task Thread" os_prio=0 tid=0x00007f9ff42d9800 nid=0x7ba7 waiting on condition
JNI global references: 295
POST BUILD TASK : FAILURE
END OF POST BUILD TASK : 0
Archiving artifacts
Build failed in Jenkins: HBase-1.2 » latest1.8,Hadoop #239
Posted by Apache Jenkins Server <je...@builds.apache.org>.
See <https://builds.apache.org/job/HBase-1.2/jdk=latest1.8,label=Hadoop/239/changes>
Changes:
[tedyu] HBASE-14578 URISyntaxException during snapshot restore for table with
------------------------------------------
[...truncated 53421 lines...]
at java.util.concurrent.locks.LockSupport.parkNanos(LockSupport.java:226)
at java.util.concurrent.locks.AbstractQueuedSynchronizer$ConditionObject.awaitNanos(AbstractQueuedSynchronizer.java:2082)
at java.util.concurrent.LinkedBlockingQueue.poll(LinkedBlockingQueue.java:467)
at org.apache.hadoop.ipc.CallQueueManager.take(CallQueueManager.java:109)
at org.apache.hadoop.ipc.Server$Handler.run(Server.java:1985)
"IPC Server listener on 44325" daemon prio=10 tid=0x00007fdab1d39000 nid=0x557d runnable [0x00007fdaa208f000]
java.lang.Thread.State: RUNNABLE
at sun.nio.ch.EPollArrayWrapper.epollWait(Native Method)
at sun.nio.ch.EPollArrayWrapper.poll(EPollArrayWrapper.java:269)
at sun.nio.ch.EPollSelectorImpl.doSelect(EPollSelectorImpl.java:79)
at sun.nio.ch.SelectorImpl.lockAndDoSelect(SelectorImpl.java:87)
- locked <0x00000007d90b1d20> (a sun.nio.ch.Util$2)
- locked <0x00000007d90b1d10> (a java.util.Collections$UnmodifiableSet)
- locked <0x00000007d90b18e0> (a sun.nio.ch.EPollSelectorImpl)
at sun.nio.ch.SelectorImpl.select(SelectorImpl.java:98)
at sun.nio.ch.SelectorImpl.select(SelectorImpl.java:102)
at org.apache.hadoop.ipc.Server$Listener.run(Server.java:668)
"IPC Server Responder" daemon prio=10 tid=0x00007fdab1ce8000 nid=0x557c runnable [0x00007fdaa2594000]
java.lang.Thread.State: RUNNABLE
at sun.nio.ch.EPollArrayWrapper.epollWait(Native Method)
at sun.nio.ch.EPollArrayWrapper.poll(EPollArrayWrapper.java:269)
at sun.nio.ch.EPollSelectorImpl.doSelect(EPollSelectorImpl.java:79)
at sun.nio.ch.SelectorImpl.lockAndDoSelect(SelectorImpl.java:87)
- locked <0x00000007d91061d0> (a sun.nio.ch.Util$2)
- locked <0x00000007d91061c0> (a java.util.Collections$UnmodifiableSet)
- locked <0x00000007d91060a8> (a sun.nio.ch.EPollSelectorImpl)
at sun.nio.ch.SelectorImpl.select(SelectorImpl.java:98)
at org.apache.hadoop.ipc.Server$Responder.doRunLoop(Server.java:835)
at org.apache.hadoop.ipc.Server$Responder.run(Server.java:818)
"org.apache.hadoop.hdfs.server.blockmanagement.BlockManager$ReplicationMonitor@6caa873c" daemon prio=10 tid=0x00007fdab1cde800 nid=0x557a waiting on condition [0x00007fdaa2190000]
java.lang.Thread.State: TIMED_WAITING (sleeping)
at java.lang.Thread.sleep(Native Method)
at org.apache.hadoop.hdfs.server.blockmanagement.BlockManager$ReplicationMonitor.run(BlockManager.java:3397)
at java.lang.Thread.run(Thread.java:745)
"org.apache.hadoop.hdfs.server.blockmanagement.HeartbeatManager$Monitor@2f94abe0" daemon prio=10 tid=0x00007fdab1cdc800 nid=0x5579 waiting on condition [0x00007fdaa2291000]
java.lang.Thread.State: TIMED_WAITING (sleeping)
at java.lang.Thread.sleep(Native Method)
at org.apache.hadoop.hdfs.server.blockmanagement.HeartbeatManager$Monitor.run(HeartbeatManager.java:319)
at java.lang.Thread.run(Thread.java:745)
"org.apache.hadoop.hdfs.server.blockmanagement.DecommissionManager$Monitor@49908839" daemon prio=10 tid=0x00007fdab1cdb800 nid=0x5578 waiting on condition [0x00007fdaa2392000]
java.lang.Thread.State: TIMED_WAITING (sleeping)
at java.lang.Thread.sleep(Native Method)
at org.apache.hadoop.hdfs.server.blockmanagement.DecommissionManager$Monitor.run(DecommissionManager.java:76)
at java.lang.Thread.run(Thread.java:745)
"org.apache.hadoop.hdfs.server.blockmanagement.PendingReplicationBlocks$PendingReplicationMonitor@44b35022" daemon prio=10 tid=0x00007fdab1cd9800 nid=0x5577 waiting on condition [0x00007fdaa2493000]
java.lang.Thread.State: TIMED_WAITING (sleeping)
at java.lang.Thread.sleep(Native Method)
at org.apache.hadoop.hdfs.server.blockmanagement.PendingReplicationBlocks$PendingReplicationMonitor.run(PendingReplicationBlocks.java:221)
at java.lang.Thread.run(Thread.java:745)
"org.apache.hadoop.util.JvmPauseMonitor$Monitor@45b5f7e0" daemon prio=10 tid=0x00007fdab1ac9800 nid=0x5571 waiting on condition [0x00007fdaa2695000]
java.lang.Thread.State: TIMED_WAITING (sleeping)
at java.lang.Thread.sleep(Native Method)
at org.apache.hadoop.util.JvmPauseMonitor$Monitor.run(JvmPauseMonitor.java:180)
at java.lang.Thread.run(Thread.java:745)
"IPC Server idle connection scanner for port 44325" daemon prio=10 tid=0x00007fdab1aa8800 nid=0x5570 in Object.wait() [0x00007fdaa2796000]
java.lang.Thread.State: TIMED_WAITING (on object monitor)
at java.lang.Object.wait(Native Method)
- waiting on <0x00000007d90b11d0> (a java.util.TaskQueue)
at java.util.TimerThread.mainLoop(Timer.java:552)
- locked <0x00000007d90b11d0> (a java.util.TaskQueue)
at java.util.TimerThread.run(Timer.java:505)
"Socket Reader #1 for port 44325" prio=10 tid=0x00007fdab1a6a800 nid=0x556f runnable [0x00007fdaa2897000]
java.lang.Thread.State: RUNNABLE
at sun.nio.ch.EPollArrayWrapper.epollWait(Native Method)
at sun.nio.ch.EPollArrayWrapper.poll(EPollArrayWrapper.java:269)
at sun.nio.ch.EPollSelectorImpl.doSelect(EPollSelectorImpl.java:79)
at sun.nio.ch.SelectorImpl.lockAndDoSelect(SelectorImpl.java:87)
- locked <0x00000007d90affa0> (a sun.nio.ch.Util$2)
- locked <0x00000007d90aff90> (a java.util.Collections$UnmodifiableSet)
- locked <0x00000007d90aeeb8> (a sun.nio.ch.EPollSelectorImpl)
at sun.nio.ch.SelectorImpl.select(SelectorImpl.java:98)
at sun.nio.ch.SelectorImpl.select(SelectorImpl.java:102)
at org.apache.hadoop.ipc.Server$Listener$Reader.doRunLoop(Server.java:616)
- locked <0x00000007d90b1fe0> (a org.apache.hadoop.ipc.Server$Listener$Reader)
at org.apache.hadoop.ipc.Server$Listener$Reader.run(Server.java:595)
"Timer-0" daemon prio=10 tid=0x00007fdab19f2000 nid=0x556e in Object.wait() [0x00007fdaa2998000]
java.lang.Thread.State: TIMED_WAITING (on object monitor)
at java.lang.Object.wait(Native Method)
- waiting on <0x00000007d9139bc0> (a java.util.TaskQueue)
at java.util.TimerThread.mainLoop(Timer.java:552)
- locked <0x00000007d9139bc0> (a java.util.TaskQueue)
at java.util.TimerThread.run(Timer.java:505)
"806474454@qtp-868912029-1 - Acceptor0 HttpServer2$SelectChannelConnectorWithSafeStartup@localhost:51506" daemon prio=10 tid=0x00007fdab19da800 nid=0x556d runnable [0x00007fdaa2a99000]
java.lang.Thread.State: RUNNABLE
at sun.nio.ch.EPollArrayWrapper.epollWait(Native Method)
at sun.nio.ch.EPollArrayWrapper.poll(EPollArrayWrapper.java:269)
at sun.nio.ch.EPollSelectorImpl.doSelect(EPollSelectorImpl.java:79)
at sun.nio.ch.SelectorImpl.lockAndDoSelect(SelectorImpl.java:87)
- locked <0x00000007d913a310> (a sun.nio.ch.Util$2)
- locked <0x00000007d913a300> (a java.util.Collections$UnmodifiableSet)
- locked <0x00000007d9139f30> (a sun.nio.ch.EPollSelectorImpl)
at sun.nio.ch.SelectorImpl.select(SelectorImpl.java:98)
at org.mortbay.io.nio.SelectorManager$SelectSet.doSelect(SelectorManager.java:498)
at org.mortbay.io.nio.SelectorManager.doSelect(SelectorManager.java:192)
at org.mortbay.jetty.nio.SelectChannelConnector.accept(SelectChannelConnector.java:124)
at org.mortbay.jetty.AbstractConnector$Acceptor.run(AbstractConnector.java:708)
at org.mortbay.thread.QueuedThreadPool$PoolThread.run(QueuedThreadPool.java:582)
"2086078170@qtp-868912029-0" daemon prio=10 tid=0x00007fdab19dc000 nid=0x556c in Object.wait() [0x00007fdaa2b9a000]
java.lang.Thread.State: TIMED_WAITING (on object monitor)
at java.lang.Object.wait(Native Method)
- waiting on <0x00000007d913a768> (a org.mortbay.thread.QueuedThreadPool$PoolThread)
at org.mortbay.thread.QueuedThreadPool$PoolThread.run(QueuedThreadPool.java:626)
- locked <0x00000007d913a768> (a org.mortbay.thread.QueuedThreadPool$PoolThread)
"Timer for 'NameNode' metrics system" daemon prio=10 tid=0x00007fdab196e000 nid=0x556b in Object.wait() [0x00007fdaa330d000]
java.lang.Thread.State: TIMED_WAITING (on object monitor)
at java.lang.Object.wait(Native Method)
- waiting on <0x0000000742685290> (a java.util.TaskQueue)
at java.util.TimerThread.mainLoop(Timer.java:552)
- locked <0x0000000742685290> (a java.util.TaskQueue)
at java.util.TimerThread.run(Timer.java:505)
"process reaper" daemon prio=10 tid=0x00007fdab10f3800 nid=0x555b waiting on condition [0x00007fdaa3346000]
java.lang.Thread.State: TIMED_WAITING (parking)
at sun.misc.Unsafe.park(Native Method)
- parking to wait for <0x00000007d9051790> (a java.util.concurrent.SynchronousQueue$TransferStack)
at java.util.concurrent.locks.LockSupport.parkNanos(LockSupport.java:226)
at java.util.concurrent.SynchronousQueue$TransferStack.awaitFulfill(SynchronousQueue.java:460)
at java.util.concurrent.SynchronousQueue$TransferStack.transfer(SynchronousQueue.java:359)
at java.util.concurrent.SynchronousQueue.poll(SynchronousQueue.java:942)
at java.util.concurrent.ThreadPoolExecutor.getTask(ThreadPoolExecutor.java:1068)
at java.util.concurrent.ThreadPoolExecutor.runWorker(ThreadPoolExecutor.java:1130)
at java.util.concurrent.ThreadPoolExecutor$Worker.run(ThreadPoolExecutor.java:615)
at java.lang.Thread.run(Thread.java:745)
"Service Thread" daemon prio=10 tid=0x00007fdab02a1000 nid=0x5510 runnable [0x0000000000000000]
java.lang.Thread.State: RUNNABLE
"C2 CompilerThread1" daemon prio=10 tid=0x00007fdab029f000 nid=0x550f waiting on condition [0x0000000000000000]
java.lang.Thread.State: RUNNABLE
"C2 CompilerThread0" daemon prio=10 tid=0x00007fdab029c000 nid=0x550e waiting on condition [0x0000000000000000]
java.lang.Thread.State: RUNNABLE
"Signal Dispatcher" daemon prio=10 tid=0x00007fdab0299800 nid=0x550d runnable [0x0000000000000000]
java.lang.Thread.State: RUNNABLE
"Finalizer" daemon prio=10 tid=0x00007fdab0271000 nid=0x550c in Object.wait() [0x00007fdaa8ac1000]
java.lang.Thread.State: WAITING (on object monitor)
at java.lang.Object.wait(Native Method)
- waiting on <0x0000000745ce8b50> (a java.lang.ref.ReferenceQueue$Lock)
at java.lang.ref.ReferenceQueue.remove(ReferenceQueue.java:135)
- locked <0x0000000745ce8b50> (a java.lang.ref.ReferenceQueue$Lock)
at java.lang.ref.ReferenceQueue.remove(ReferenceQueue.java:151)
at java.lang.ref.Finalizer$FinalizerThread.run(Finalizer.java:209)
"Reference Handler" daemon prio=10 tid=0x00007fdab0269000 nid=0x550b in Object.wait() [0x00007fdaa8bc2000]
java.lang.Thread.State: WAITING (on object monitor)
at java.lang.Object.wait(Native Method)
- waiting on <0x0000000745ce8808> (a java.lang.ref.Reference$Lock)
at java.lang.Object.wait(Object.java:503)
at java.lang.ref.Reference$ReferenceHandler.run(Reference.java:133)
- locked <0x0000000745ce8808> (a java.lang.ref.Reference$Lock)
"main" prio=10 tid=0x00007fdab000a800 nid=0x54fc waiting on condition [0x00007fdab75de000]
java.lang.Thread.State: TIMED_WAITING (sleeping)
at java.lang.Thread.sleep(Native Method)
at org.apache.hadoop.mapreduce.Job.monitorAndPrintJob(Job.java:1348)
at org.apache.hadoop.mapreduce.Job.waitForCompletion(Job.java:1306)
at org.apache.hadoop.hbase.mapreduce.ImportTsv.run(ImportTsv.java:721)
at org.apache.hadoop.util.ToolRunner.run(ToolRunner.java:70)
at org.apache.hadoop.hbase.mapreduce.TestImportTsv.doMROnTableTest(TestImportTsv.java:343)
at org.apache.hadoop.hbase.mapreduce.TestImportTsv.doMROnTableTest(TestImportTsv.java:305)
at org.apache.hadoop.hbase.mapreduce.TestImportTsv.doMROnTableTest(TestImportTsv.java:300)
at org.apache.hadoop.hbase.mapreduce.IntegrationTestImportTsv.testGenerateAndLoad(IntegrationTestImportTsv.java:202)
at sun.reflect.NativeMethodAccessorImpl.invoke0(Native Method)
at sun.reflect.NativeMethodAccessorImpl.invoke(NativeMethodAccessorImpl.java:57)
at sun.reflect.DelegatingMethodAccessorImpl.invoke(DelegatingMethodAccessorImpl.java:43)
at java.lang.reflect.Method.invoke(Method.java:606)
at org.junit.runners.model.FrameworkMethod$1.runReflectiveCall(FrameworkMethod.java:50)
at org.junit.internal.runners.model.ReflectiveCallable.run(ReflectiveCallable.java:12)
at org.junit.runners.model.FrameworkMethod.invokeExplosively(FrameworkMethod.java:47)
at org.junit.internal.runners.statements.InvokeMethod.evaluate(InvokeMethod.java:17)
at org.junit.runners.ParentRunner.runLeaf(ParentRunner.java:325)
at org.junit.runners.BlockJUnit4ClassRunner.runChild(BlockJUnit4ClassRunner.java:78)
at org.junit.runners.BlockJUnit4ClassRunner.runChild(BlockJUnit4ClassRunner.java:57)
at org.junit.runners.ParentRunner$3.run(ParentRunner.java:290)
at org.junit.runners.ParentRunner$1.schedule(ParentRunner.java:71)
at org.junit.runners.ParentRunner.runChildren(ParentRunner.java:288)
at org.junit.runners.ParentRunner.access$000(ParentRunner.java:58)
at org.junit.runners.ParentRunner$2.evaluate(ParentRunner.java:268)
at org.junit.internal.runners.statements.RunBefores.evaluate(RunBefores.java:26)
at org.junit.internal.runners.statements.RunAfters.evaluate(RunAfters.java:27)
at org.junit.runners.ParentRunner.run(ParentRunner.java:363)
at org.apache.maven.surefire.junit4.JUnit4Provider.execute(JUnit4Provider.java:283)
at org.apache.maven.surefire.junit4.JUnit4Provider.executeWithRerun(JUnit4Provider.java:173)
at org.apache.maven.surefire.junit4.JUnit4Provider.executeTestSet(JUnit4Provider.java:153)
at org.apache.maven.surefire.junit4.JUnit4Provider.invoke(JUnit4Provider.java:128)
at org.apache.maven.surefire.booter.ForkedBooter.invokeProviderInSameClassLoader(ForkedBooter.java:203)
at org.apache.maven.surefire.booter.ForkedBooter.runSuitesInProcess(ForkedBooter.java:155)
at org.apache.maven.surefire.booter.ForkedBooter.main(ForkedBooter.java:103)
"VM Thread" prio=10 tid=0x00007fdab0265000 nid=0x550a runnable
"GC task thread#0 (ParallelGC)" prio=10 tid=0x00007fdab0020800 nid=0x54fd runnable
"GC task thread#1 (ParallelGC)" prio=10 tid=0x00007fdab0022000 nid=0x54fe runnable
"GC task thread#2 (ParallelGC)" prio=10 tid=0x00007fdab0024000 nid=0x54ff runnable
"GC task thread#3 (ParallelGC)" prio=10 tid=0x00007fdab0026000 nid=0x5500 runnable
"GC task thread#4 (ParallelGC)" prio=10 tid=0x00007fdab0028000 nid=0x5501 runnable
"GC task thread#5 (ParallelGC)" prio=10 tid=0x00007fdab0029800 nid=0x5502 runnable
"GC task thread#6 (ParallelGC)" prio=10 tid=0x00007fdab002b800 nid=0x5503 runnable
"GC task thread#7 (ParallelGC)" prio=10 tid=0x00007fdab002d800 nid=0x5504 runnable
"GC task thread#8 (ParallelGC)" prio=10 tid=0x00007fdab002f000 nid=0x5505 runnable
"GC task thread#9 (ParallelGC)" prio=10 tid=0x00007fdab0031000 nid=0x5506 runnable
"GC task thread#10 (ParallelGC)" prio=10 tid=0x00007fdab0033000 nid=0x5507 runnable
"GC task thread#11 (ParallelGC)" prio=10 tid=0x00007fdab0035000 nid=0x5508 runnable
"GC task thread#12 (ParallelGC)" prio=10 tid=0x00007fdab0036800 nid=0x5509 runnable
"VM Periodic Task Thread" prio=10 tid=0x00007fdab02ac000 nid=0x5511 waiting on condition
JNI global references: 152
+ echo '************ END zombies jstack extract'
************ END zombies jstack extract
+ JIRA_COMMENT='
{color:red}-1 core zombie tests{color}. There are 1 zombie test(s): at org.apache.hadoop.hbase.mapreduce.IntegrationTestImportTsv.testGenerateAndLoad(IntegrationTestImportTsv.java:202)'
+ BAD=1
+ jps
+ grep surefirebooter
+ xargs kill -9
+ cut -d ' ' -f 1
POST BUILD TASK : SUCCESS
END OF POST BUILD TASK : 0
Archiving artifacts
Build failed in Jenkins: HBase-1.2 » latest1.8,Hadoop #238
Posted by Apache Jenkins Server <je...@builds.apache.org>.
See <https://builds.apache.org/job/HBase-1.2/jdk=latest1.8,label=Hadoop/238/changes>
Changes:
[tedyu] HBASE-14581 Znode cleanup throws auth exception in secure mode
------------------------------------------
[...truncated 46931 lines...]
240/340 KB 224/345 KB
240/340 KB 228/345 KB
240/340 KB 232/345 KB
240/340 KB 232/345 KB
240/340 KB 232/345 KB
244/340 KB 232/345 KB
248/340 KB 232/345 KB
248/340 KB 236/345 KB
248/340 KB 240/345 KB
248/340 KB 240/345 KB
248/340 KB 240/345 KB
252/340 KB 240/345 KB
256/340 KB 240/345 KB
256/340 KB 244/345 KB
256/340 KB 248/345 KB
256/340 KB 248/345 KB
256/340 KB 248/345 KB
260/340 KB 248/345 KB
264/340 KB 248/345 KB
264/340 KB 252/345 KB
264/340 KB 256/345 KB
264/340 KB 256/345 KB
264/340 KB 256/345 KB
268/340 KB 256/345 KB
271/340 KB 256/345 KB
271/340 KB 260/345 KB
271/340 KB 264/345 KB
272/340 KB 264/345 KB
272/340 KB 264/345 KB
276/340 KB 264/345 KB
276/340 KB 268/345 KB
279/340 KB 268/345 KB
279/340 KB 271/345 KB
280/340 KB 271/345 KB
280/340 KB 272/345 KB
284/340 KB 272/345 KB
284/340 KB 276/345 KB
287/340 KB 276/345 KB
287/340 KB 279/345 KB
288/340 KB 279/345 KB
288/340 KB 280/345 KB
292/340 KB 280/345 KB
292/340 KB 284/345 KB
295/340 KB 284/345 KB
295/340 KB 287/345 KB
296/340 KB 287/345 KB
296/340 KB 288/345 KB
300/340 KB 288/345 KB
300/340 KB 292/345 KB
303/340 KB 292/345 KB
303/340 KB 295/345 KB
304/340 KB 295/345 KB
304/340 KB 296/345 KB
308/340 KB 296/345 KB
308/340 KB 300/345 KB
310/340 KB 300/345 KB
310/340 KB 303/345 KB
310/340 KB 304/345 KB
312/340 KB 304/345 KB
316/340 KB 304/345 KB
316/340 KB 308/345 KB
318/340 KB 308/345 KB
318/340 KB 310/345 KB
318/340 KB 312/345 KB
320/340 KB 312/345 KB
324/340 KB 316/345 KB
324/340 KB 316/345 KB
324/340 KB 318/345 KB
326/340 KB 318/345 KB
326/340 KB 320/345 KB
328/340 KB 320/345 KB
328/340 KB 324/345 KB
332/340 KB 324/345 KB
332/340 KB 326/345 KB
334/340 KB 326/345 KB
334/340 KB 328/345 KB
336/340 KB 328/345 KB
340/340 KB 328/345 KB
340/340 KB 332/345 KB
340/340 KB 334/345 KB
340/340 KB 336/345 KB
340/340 KB 340/345 KB
340/340 KB 342/345 KB
340/340 KB 344/345 KB
340/340 KB 345/345 KB
Downloaded: https://repository.apache.org/content/repositories/releases/org/apache/thrift/libthrift/0.9.0/libthrift-0.9.0.jar (340 KB at 337.0 KB/sec)
Downloaded: https://repository.apache.org/content/repositories/releases/org/apache/httpcomponents/httpclient/4.1.3/httpclient-4.1.3.jar (345 KB at 325.1 KB/sec)
[INFO]
[INFO] --- maven-enforcer-plugin:1.0.1:enforce (enforce) @ hbase-thrift ---
[INFO]
[INFO] --- buildnumber-maven-plugin:1.3:create-timestamp (default) @ hbase-thrift ---
[INFO]
[INFO] --- jacoco-maven-plugin:0.7.5.201505241946:prepare-agent (prepare-agent) @ hbase-thrift ---
[INFO] Skipping JaCoCo execution because property jacoco.skip is set.
[INFO] argLine set to empty
[INFO]
[INFO] --- maven-antrun-plugin:1.6:run (generate) @ hbase-thrift ---
[INFO] Executing tasks
main:
[mkdir] Created dir: <https://builds.apache.org/job/HBase-1.2/jdk=latest1.8,label=Hadoop/ws/hbase-thrift/target/hbase-webapps>
[copy] Copying 17 files to <https://builds.apache.org/job/HBase-1.2/jdk=latest1.8,label=Hadoop/ws/hbase-thrift/target/hbase-webapps>
log4j:WARN No appenders could be found for logger (org.mortbay.log).
log4j:WARN Please initialize the log4j system properly.
log4j:WARN See http://logging.apache.org/log4j/1.2/faq.html#noconfig for more info.
[mkdir] Created dir: <https://builds.apache.org/job/HBase-1.2/jdk=latest1.8,label=Hadoop/ws/hbase-thrift/target/hbase-webapps/thrift/WEB-INF>
[INFO] Executed tasks
[INFO]
[INFO] --- build-helper-maven-plugin:1.9.1:add-source (jspcSource-packageInfo-source) @ hbase-thrift ---
[INFO] Source directory: <https://builds.apache.org/job/HBase-1.2/jdk=latest1.8,label=Hadoop/ws/hbase-thrift/target/generated-sources/java> added.
[INFO]
[INFO] --- maven-remote-resources-plugin:1.5:process (default) @ hbase-thrift ---
[INFO]
[INFO] --- maven-resources-plugin:2.6:resources (default-resources) @ hbase-thrift ---
[INFO] Using 'UTF-8' encoding to copy filtered resources.
[INFO] Copying 18 resources
[INFO] Copying 3 resources
[INFO]
[INFO] --- maven-compiler-plugin:2.5.1:compile (default-compile) @ hbase-thrift ---
[INFO] Compiling 53 source files to <https://builds.apache.org/job/HBase-1.2/jdk=latest1.8,label=Hadoop/ws/hbase-thrift/target/classes>
[INFO]
[INFO] --- maven-dependency-plugin:2.1:build-classpath (create-mrapp-generated-classpath) @ hbase-thrift ---
[INFO] Wrote classpath file '<https://builds.apache.org/job/HBase-1.2/jdk=latest1.8,label=Hadoop/ws/hbase-thrift/target/test-classes/mrapp-generated-classpath'.>
[INFO]
[INFO] --- maven-resources-plugin:2.6:testResources (default-testResources) @ hbase-thrift ---
[INFO] Using 'UTF-8' encoding to copy filtered resources.
[INFO] Copying 2 resources to META-INF/
[INFO] Copying 3 resources
[INFO] Copying 3 resources
[INFO]
[INFO] --- maven-compiler-plugin:2.5.1:testCompile (default-testCompile) @ hbase-thrift ---
[INFO] Compiling 6 source files to <https://builds.apache.org/job/HBase-1.2/jdk=latest1.8,label=Hadoop/ws/hbase-thrift/target/test-classes>
[INFO]
[INFO] --- maven-surefire-plugin:2.18.1:test (default-test) @ hbase-thrift ---
[INFO] Surefire report directory: <https://builds.apache.org/job/HBase-1.2/jdk=latest1.8,label=Hadoop/ws/hbase-thrift/target/surefire-reports>
[INFO] Using configured provider org.apache.maven.surefire.junitcore.JUnitCoreProvider
[INFO] parallel='none', perCoreThreadCount=true, threadCount=0, useUnlimitedThreads=false, threadCountSuites=0, threadCountClasses=0, threadCountMethods=0, parallelOptimized=true
-------------------------------------------------------
T E S T S
-------------------------------------------------------
Java HotSpot(TM) 64-Bit Server VM warning: ignoring option MaxPermSize=256m; support was removed in 8.0
Running org.apache.hadoop.hbase.thrift.TestThriftHttpServer
Tests run: 2, Failures: 0, Errors: 0, Skipped: 0, Time elapsed: 5.053 sec - in org.apache.hadoop.hbase.thrift.TestThriftHttpServer
Java HotSpot(TM) 64-Bit Server VM warning: ignoring option MaxPermSize=256m; support was removed in 8.0
Running org.apache.hadoop.hbase.thrift.TestThriftServerCmdLine
Tests run: 32, Failures: 0, Errors: 0, Skipped: 0, Time elapsed: 51.585 sec - in org.apache.hadoop.hbase.thrift.TestThriftServerCmdLine
Java HotSpot(TM) 64-Bit Server VM warning: ignoring option MaxPermSize=256m; support was removed in 8.0
Running org.apache.hadoop.hbase.thrift.TestThriftServer
Killed
Java HotSpot(TM) 64-Bit Server VM warning: ignoring option MaxPermSize=256m; support was removed in 8.0
Running org.apache.hadoop.hbase.thrift.TestCallQueue
Tests run: 18, Failures: 0, Errors: 0, Skipped: 0, Time elapsed: 0.271 sec - in org.apache.hadoop.hbase.thrift.TestCallQueue
Java HotSpot(TM) 64-Bit Server VM warning: ignoring option MaxPermSize=256m; support was removed in 8.0
Running org.apache.hadoop.hbase.thrift2.TestThriftHBaseServiceHandler
Tests run: 21, Failures: 0, Errors: 0, Skipped: 0, Time elapsed: 2.119 sec - in org.apache.hadoop.hbase.thrift2.TestThriftHBaseServiceHandler
Java HotSpot(TM) 64-Bit Server VM warning: ignoring option MaxPermSize=256m; support was removed in 8.0
Running org.apache.hadoop.hbase.thrift2.TestThriftHBaseServiceHandlerWithLabels
Tests run: 6, Failures: 0, Errors: 0, Skipped: 0, Time elapsed: 1.613 sec - in org.apache.hadoop.hbase.thrift2.TestThriftHBaseServiceHandlerWithLabels
Results :
Tests run: 79, Failures: 0, Errors: 0, Skipped: 0
[INFO] ------------------------------------------------------------------------
[INFO] Reactor Summary:
[INFO]
[INFO] Apache HBase ...................................... SUCCESS [1:24.960s]
[INFO] Apache HBase - Checkstyle ......................... SUCCESS [8.490s]
[INFO] Apache HBase - Resource Bundle .................... SUCCESS [0.165s]
[INFO] Apache HBase - Annotations ........................ SUCCESS [0.975s]
[INFO] Apache HBase - Protocol ........................... SUCCESS [18.163s]
[INFO] Apache HBase - Common ............................. SUCCESS [3:20.752s]
[INFO] Apache HBase - Procedure .......................... SUCCESS [1:56.127s]
[INFO] Apache HBase - Client ............................. SUCCESS [1:50.822s]
[INFO] Apache HBase - Hadoop Compatibility ............... SUCCESS [14.094s]
[INFO] Apache HBase - Hadoop Two Compatibility ........... SUCCESS [8.271s]
[INFO] Apache HBase - Prefix Tree ........................ SUCCESS [7.847s]
[INFO] Apache HBase - Server ............................. SUCCESS [1:34:02.812s]
[INFO] Apache HBase - Testing Util ....................... SUCCESS [4.237s]
[INFO] Apache HBase - Thrift ............................. FAILURE [2:57.494s]
[INFO] Apache HBase - Rest ............................... SKIPPED
[INFO] Apache HBase - Shell .............................. SKIPPED
[INFO] Apache HBase - Integration Tests .................. SKIPPED
[INFO] Apache HBase - Examples ........................... SKIPPED
[INFO] Apache HBase - External Block Cache ............... SKIPPED
[INFO] Apache HBase - Assembly ........................... SKIPPED
[INFO] Apache HBase - Shaded ............................. SKIPPED
[INFO] Apache HBase - Shaded - Client .................... SKIPPED
[INFO] Apache HBase - Shaded - Server .................... SKIPPED
[INFO] ------------------------------------------------------------------------
[INFO] BUILD FAILURE
[INFO] ------------------------------------------------------------------------
[INFO] Total time: 1:46:58.307s
[INFO] Finished at: Sat Oct 10 16:38:23 UTC 2015
[INFO] Final Memory: 109M/600M
[INFO] ------------------------------------------------------------------------
[ERROR] Failed to execute goal org.apache.maven.plugins:maven-surefire-plugin:2.18.1:test (default-test) on project hbase-thrift: ExecutionException: java.lang.RuntimeException: The forked VM terminated without properly saying goodbye. VM crash or System.exit called?
[ERROR] Command was /bin/sh -c cd <https://builds.apache.org/job/HBase-1.2/jdk=latest1.8,label=Hadoop/ws/hbase-thrift> && /home/jenkins/jenkins-slave/tools/hudson.model.JDK/latest1.8/jre/bin/java -enableassertions -XX:MaxDirectMemorySize=1G -Xmx2800m -XX:MaxPermSize=256m -Djava.security.egd=file:/dev/./urandom -Djava.net.preferIPv4Stack=true -Djava.awt.headless=true -jar <https://builds.apache.org/job/HBase-1.2/jdk=latest1.8,label=Hadoop/ws/hbase-thrift/target/surefire/surefirebooter4076304904863685583.jar> <https://builds.apache.org/job/HBase-1.2/jdk=latest1.8,label=Hadoop/ws/hbase-thrift/target/surefire/surefire5743905653839620207tmp> <https://builds.apache.org/job/HBase-1.2/jdk=latest1.8,label=Hadoop/ws/hbase-thrift/target/surefire/surefire_13426830046125316790547tmp>
[ERROR] -> [Help 1]
[ERROR]
[ERROR] To see the full stack trace of the errors, re-run Maven with the -e switch.
[ERROR] Re-run Maven using the -X switch to enable full debug logging.
[ERROR]
[ERROR] For more information about the errors and possible solutions, please read the following articles:
[ERROR] [Help 1] http://cwiki.apache.org/confluence/display/MAVEN/MojoFailureException
[ERROR]
[ERROR] After correcting the problems, you can resume the build with the command
[ERROR] mvn <goals> -rf :hbase-thrift
Build step 'Invoke top-level Maven targets' marked build as failure
Performing Post build task...
Match found for :.* : True
Logical operation result is TRUE
Running script : ZOMBIE_TESTS_COUNT=`jps | grep surefirebooter | wc -l`
if [[ $ZOMBIE_TESTS_COUNT != 0 ]] ; then
#It seems sometimes the tests are not dying immediately. Let's give them 10s
echo "Suspicious java process found - waiting 10s to see if there are just slow to stop"
sleep 10
ZOMBIE_TESTS_COUNT=`jps | grep surefirebooter | wc -l`
if [[ $ZOMBIE_TESTS_COUNT != 0 ]] ; then
echo "There are $ZOMBIE_TESTS_COUNT zombie tests, they should have been killed by surefire but survived"
echo "************ BEGIN zombies jstack extract"
ZB_STACK=`jps | grep surefirebooter | cut -d ' ' -f 1 | xargs -n 1 jstack | grep ".test" | grep "\.java"`
jps | grep surefirebooter | cut -d ' ' -f 1 | xargs -n 1 jstack
echo "************ END zombies jstack extract"
JIRA_COMMENT="$JIRA_COMMENT
{color:red}-1 core zombie tests{color}. There are ${ZOMBIE_TESTS_COUNT} zombie test(s): ${ZB_STACK}"
BAD=1
jps | grep surefirebooter | cut -d ' ' -f 1 | xargs kill -9
else
echo "We're ok: there is no zombie test, but some tests took some time to stop"
fi
else
echo "We're ok: there is no zombie test"
fi
[Hadoop] $ /bin/bash -xe /tmp/hudson3167085814181703278.sh
++ jps
++ grep surefirebooter
++ wc -l
+ ZOMBIE_TESTS_COUNT=0
+ [[ 0 != 0 ]]
+ echo 'We'\''re ok: there is no zombie test'
We're ok: there is no zombie test
POST BUILD TASK : SUCCESS
END OF POST BUILD TASK : 0
Archiving artifacts
Build failed in Jenkins: HBase-1.2 » latest1.8,Hadoop #237
Posted by Apache Jenkins Server <je...@builds.apache.org>.
See <https://builds.apache.org/job/HBase-1.2/jdk=latest1.8,label=Hadoop/237/changes>
Changes:
[stack] HBASE-14517 Show regionserver's version in master status page (Liu
[stack] HBASE-13858 RS/MasterDumpServlet dumps threads before its âStacksâ
------------------------------------------
[...truncated 47079 lines...]
[INFO] --- maven-jar-plugin:2.4:jar (default-jar) @ hbase-thrift ---
[INFO] Building jar: <https://builds.apache.org/job/HBase-1.2/jdk=latest1.8,label=Hadoop/ws/hbase-thrift/target/hbase-thrift-1.2.0-SNAPSHOT.jar>
[INFO]
[INFO] --- maven-install-plugin:2.3.1:install (default-install) @ hbase-thrift ---
[INFO] Installing <https://builds.apache.org/job/HBase-1.2/jdk=latest1.8,label=Hadoop/ws/hbase-thrift/target/hbase-thrift-1.2.0-SNAPSHOT.jar> to <https://builds.apache.org/job/HBase-1.2/jdk=latest1.8,label=Hadoop/ws/.repository/org/apache/hbase/hbase-thrift/1.2.0-SNAPSHOT/hbase-thrift-1.2.0-SNAPSHOT.jar>
[INFO] Installing <https://builds.apache.org/job/HBase-1.2/jdk=latest1.8,label=Hadoop/ws/hbase-thrift/pom.xml> to <https://builds.apache.org/job/HBase-1.2/jdk=latest1.8,label=Hadoop/ws/.repository/org/apache/hbase/hbase-thrift/1.2.0-SNAPSHOT/hbase-thrift-1.2.0-SNAPSHOT.pom>
[INFO] Installing <https://builds.apache.org/job/HBase-1.2/jdk=latest1.8,label=Hadoop/ws/hbase-thrift/target/hbase-thrift-1.2.0-SNAPSHOT-sources.jar> to <https://builds.apache.org/job/HBase-1.2/jdk=latest1.8,label=Hadoop/ws/.repository/org/apache/hbase/hbase-thrift/1.2.0-SNAPSHOT/hbase-thrift-1.2.0-SNAPSHOT-sources.jar>
[INFO] Installing <https://builds.apache.org/job/HBase-1.2/jdk=latest1.8,label=Hadoop/ws/hbase-thrift/target/hbase-thrift-1.2.0-SNAPSHOT-tests.jar> to <https://builds.apache.org/job/HBase-1.2/jdk=latest1.8,label=Hadoop/ws/.repository/org/apache/hbase/hbase-thrift/1.2.0-SNAPSHOT/hbase-thrift-1.2.0-SNAPSHOT-tests.jar>
[INFO]
[INFO] ------------------------------------------------------------------------
[INFO] Building Apache HBase - Rest 1.2.0-SNAPSHOT
[INFO] ------------------------------------------------------------------------
[INFO]
[INFO] --- maven-enforcer-plugin:1.0.1:enforce (enforce) @ hbase-rest ---
[INFO]
[INFO] --- buildnumber-maven-plugin:1.3:create-timestamp (default) @ hbase-rest ---
[INFO]
[INFO] --- jacoco-maven-plugin:0.7.5.201505241946:prepare-agent (prepare-agent) @ hbase-rest ---
[INFO] Skipping JaCoCo execution because property jacoco.skip is set.
[INFO] argLine set to empty
[INFO]
[INFO] --- maven-antrun-plugin:1.6:run (generate) @ hbase-rest ---
[INFO] Executing tasks
main:
[mkdir] Created dir: <https://builds.apache.org/job/HBase-1.2/jdk=latest1.8,label=Hadoop/ws/hbase-rest/target/hbase-webapps>
[copy] Copying 1 file to <https://builds.apache.org/job/HBase-1.2/jdk=latest1.8,label=Hadoop/ws/hbase-rest/target/hbase-webapps>
log4j:WARN No appenders could be found for logger (org.mortbay.log).
log4j:WARN Please initialize the log4j system properly.
log4j:WARN See http://logging.apache.org/log4j/1.2/faq.html#noconfig for more info.
[mkdir] Created dir: <https://builds.apache.org/job/HBase-1.2/jdk=latest1.8,label=Hadoop/ws/hbase-rest/target/hbase-webapps/rest/WEB-INF>
[INFO] Executed tasks
[INFO]
[INFO] --- build-helper-maven-plugin:1.9.1:add-source (jspcSource-packageInfo-source) @ hbase-rest ---
[INFO] Source directory: <https://builds.apache.org/job/HBase-1.2/jdk=latest1.8,label=Hadoop/ws/hbase-rest/target/generated-sources/java> added.
[INFO]
[INFO] --- maven-remote-resources-plugin:1.5:process (default) @ hbase-rest ---
[INFO]
[INFO] --- maven-resources-plugin:2.6:resources (default-resources) @ hbase-rest ---
[INFO] Using 'UTF-8' encoding to copy filtered resources.
[INFO] Copying 2 resources
[INFO] Copying 3 resources
[INFO]
[INFO] --- maven-compiler-plugin:2.5.1:compile (default-compile) @ hbase-rest ---
[INFO] Compiling 71 source files to <https://builds.apache.org/job/HBase-1.2/jdk=latest1.8,label=Hadoop/ws/hbase-rest/target/classes>
[INFO]
[INFO] --- maven-resources-plugin:2.6:testResources (default-testResources) @ hbase-rest ---
[INFO] Using 'UTF-8' encoding to copy filtered resources.
[INFO] Copying 6 resources
[INFO] Copying 3 resources
[INFO]
[INFO] --- maven-compiler-plugin:2.5.1:testCompile (default-testCompile) @ hbase-rest ---
[INFO] Compiling 38 source files to <https://builds.apache.org/job/HBase-1.2/jdk=latest1.8,label=Hadoop/ws/hbase-rest/target/test-classes>
[INFO]
[INFO] --- maven-surefire-plugin:2.18.1:test (default-test) @ hbase-rest ---
[INFO] Surefire report directory: <https://builds.apache.org/job/HBase-1.2/jdk=latest1.8,label=Hadoop/ws/hbase-rest/target/surefire-reports>
[INFO] Using configured provider org.apache.maven.surefire.junitcore.JUnitCoreProvider
[INFO] parallel='none', perCoreThreadCount=true, threadCount=0, useUnlimitedThreads=false, threadCountSuites=0, threadCountClasses=0, threadCountMethods=0, parallelOptimized=true
-------------------------------------------------------
T E S T S
-------------------------------------------------------
Java HotSpot(TM) 64-Bit Server VM warning: ignoring option MaxPermSize=256m; support was removed in 8.0
Running org.apache.hadoop.hbase.rest.TestDeleteRow
Tests run: 2, Failures: 0, Errors: 0, Skipped: 0, Time elapsed: 11.909 sec - in org.apache.hadoop.hbase.rest.TestDeleteRow
Java HotSpot(TM) 64-Bit Server VM warning: ignoring option MaxPermSize=256m; support was removed in 8.0
Running org.apache.hadoop.hbase.rest.TestResourceFilter
Tests run: 1, Failures: 0, Errors: 0, Skipped: 0, Time elapsed: 2.295 sec - in org.apache.hadoop.hbase.rest.TestResourceFilter
Java HotSpot(TM) 64-Bit Server VM warning: ignoring option MaxPermSize=256m; support was removed in 8.0
Running org.apache.hadoop.hbase.rest.TestTableResource
Tests run: 8, Failures: 0, Errors: 0, Skipped: 0, Time elapsed: 3.89 sec - in org.apache.hadoop.hbase.rest.TestTableResource
Java HotSpot(TM) 64-Bit Server VM warning: ignoring option MaxPermSize=256m; support was removed in 8.0
Running org.apache.hadoop.hbase.rest.TestGZIPResponseWrapper
Tests run: 4, Failures: 0, Errors: 0, Skipped: 0, Time elapsed: 0.539 sec - in org.apache.hadoop.hbase.rest.TestGZIPResponseWrapper
Java HotSpot(TM) 64-Bit Server VM warning: ignoring option MaxPermSize=256m; support was removed in 8.0
Running org.apache.hadoop.hbase.rest.TestVersionResource
Tests run: 7, Failures: 0, Errors: 0, Skipped: 0, Time elapsed: 3.31 sec - in org.apache.hadoop.hbase.rest.TestVersionResource
Java HotSpot(TM) 64-Bit Server VM warning: ignoring option MaxPermSize=256m; support was removed in 8.0
Running org.apache.hadoop.hbase.rest.TestStatusResource
Tests run: 2, Failures: 0, Errors: 0, Skipped: 0, Time elapsed: 3.201 sec - in org.apache.hadoop.hbase.rest.TestStatusResource
Java HotSpot(TM) 64-Bit Server VM warning: ignoring option MaxPermSize=256m; support was removed in 8.0
Running org.apache.hadoop.hbase.rest.TestScannersWithFilters
Tests run: 10, Failures: 0, Errors: 0, Skipped: 0, Time elapsed: 5.671 sec - in org.apache.hadoop.hbase.rest.TestScannersWithFilters
Java HotSpot(TM) 64-Bit Server VM warning: ignoring option MaxPermSize=256m; support was removed in 8.0
Running org.apache.hadoop.hbase.rest.TestScannerResource
Tests run: 5, Failures: 0, Errors: 0, Skipped: 0, Time elapsed: 5.309 sec - in org.apache.hadoop.hbase.rest.TestScannerResource
Java HotSpot(TM) 64-Bit Server VM warning: ignoring option MaxPermSize=256m; support was removed in 8.0
Running org.apache.hadoop.hbase.rest.TestMultiRowResource
Tests run: 3, Failures: 0, Errors: 0, Skipped: 0, Time elapsed: 3.443 sec - in org.apache.hadoop.hbase.rest.TestMultiRowResource
Java HotSpot(TM) 64-Bit Server VM warning: ignoring option MaxPermSize=256m; support was removed in 8.0
Running org.apache.hadoop.hbase.rest.client.TestRemoteTable
Tests run: 9, Failures: 0, Errors: 0, Skipped: 0, Time elapsed: 38.104 sec - in org.apache.hadoop.hbase.rest.client.TestRemoteTable
Java HotSpot(TM) 64-Bit Server VM warning: ignoring option MaxPermSize=256m; support was removed in 8.0
Running org.apache.hadoop.hbase.rest.client.TestRemoteHTableRetries
Tests run: 7, Failures: 0, Errors: 0, Skipped: 0, Time elapsed: 1.705 sec - in org.apache.hadoop.hbase.rest.client.TestRemoteHTableRetries
Java HotSpot(TM) 64-Bit Server VM warning: ignoring option MaxPermSize=256m; support was removed in 8.0
Running org.apache.hadoop.hbase.rest.client.TestRemoteAdminRetries
Tests run: 7, Failures: 0, Errors: 0, Skipped: 0, Time elapsed: 1.706 sec - in org.apache.hadoop.hbase.rest.client.TestRemoteAdminRetries
Java HotSpot(TM) 64-Bit Server VM warning: ignoring option MaxPermSize=256m; support was removed in 8.0
Running org.apache.hadoop.hbase.rest.model.TestCellModel
Tests run: 5, Failures: 0, Errors: 0, Skipped: 0, Time elapsed: 0.921 sec - in org.apache.hadoop.hbase.rest.model.TestCellModel
Java HotSpot(TM) 64-Bit Server VM warning: ignoring option MaxPermSize=256m; support was removed in 8.0
Running org.apache.hadoop.hbase.rest.model.TestTableListModel
Tests run: 5, Failures: 0, Errors: 0, Skipped: 0, Time elapsed: 0.994 sec - in org.apache.hadoop.hbase.rest.model.TestTableListModel
Java HotSpot(TM) 64-Bit Server VM warning: ignoring option MaxPermSize=256m; support was removed in 8.0
Running org.apache.hadoop.hbase.rest.model.TestVersionModel
Tests run: 5, Failures: 0, Errors: 0, Skipped: 0, Time elapsed: 1.027 sec - in org.apache.hadoop.hbase.rest.model.TestVersionModel
Java HotSpot(TM) 64-Bit Server VM warning: ignoring option MaxPermSize=256m; support was removed in 8.0
Running org.apache.hadoop.hbase.rest.model.TestRowModel
Tests run: 5, Failures: 0, Errors: 0, Skipped: 0, Time elapsed: 0.533 sec - in org.apache.hadoop.hbase.rest.model.TestRowModel
Java HotSpot(TM) 64-Bit Server VM warning: ignoring option MaxPermSize=256m; support was removed in 8.0
Running org.apache.hadoop.hbase.rest.model.TestColumnSchemaModel
Tests run: 5, Failures: 0, Errors: 0, Skipped: 0, Time elapsed: 0.563 sec - in org.apache.hadoop.hbase.rest.model.TestColumnSchemaModel
Java HotSpot(TM) 64-Bit Server VM warning: ignoring option MaxPermSize=256m; support was removed in 8.0
Running org.apache.hadoop.hbase.rest.model.TestTableInfoModel
Tests run: 5, Failures: 0, Errors: 0, Skipped: 0, Time elapsed: 0.99 sec - in org.apache.hadoop.hbase.rest.model.TestTableInfoModel
Java HotSpot(TM) 64-Bit Server VM warning: ignoring option MaxPermSize=256m; support was removed in 8.0
Running org.apache.hadoop.hbase.rest.model.TestNamespacesModel
Tests run: 5, Failures: 0, Errors: 0, Skipped: 0, Time elapsed: 0.584 sec - in org.apache.hadoop.hbase.rest.model.TestNamespacesModel
Java HotSpot(TM) 64-Bit Server VM warning: ignoring option MaxPermSize=256m; support was removed in 8.0
Running org.apache.hadoop.hbase.rest.model.TestStorageClusterVersionModel
Tests run: 5, Failures: 0, Errors: 0, Skipped: 0, Time elapsed: 0.537 sec - in org.apache.hadoop.hbase.rest.model.TestStorageClusterVersionModel
Java HotSpot(TM) 64-Bit Server VM warning: ignoring option MaxPermSize=256m; support was removed in 8.0
Running org.apache.hadoop.hbase.rest.model.TestStorageClusterStatusModel
Tests run: 5, Failures: 0, Errors: 0, Skipped: 0, Time elapsed: 1.065 sec - in org.apache.hadoop.hbase.rest.model.TestStorageClusterStatusModel
Java HotSpot(TM) 64-Bit Server VM warning: ignoring option MaxPermSize=256m; support was removed in 8.0
Running org.apache.hadoop.hbase.rest.model.TestCellSetModel
Tests run: 5, Failures: 0, Errors: 0, Skipped: 0, Time elapsed: 0.98 sec - in org.apache.hadoop.hbase.rest.model.TestCellSetModel
Java HotSpot(TM) 64-Bit Server VM warning: ignoring option MaxPermSize=256m; support was removed in 8.0
Running org.apache.hadoop.hbase.rest.model.TestTableSchemaModel
Tests run: 5, Failures: 0, Errors: 0, Skipped: 0, Time elapsed: 1.023 sec - in org.apache.hadoop.hbase.rest.model.TestTableSchemaModel
Java HotSpot(TM) 64-Bit Server VM warning: ignoring option MaxPermSize=256m; support was removed in 8.0
Running org.apache.hadoop.hbase.rest.model.TestNamespacesInstanceModel
Tests run: 5, Failures: 0, Errors: 0, Skipped: 0, Time elapsed: 0.612 sec - in org.apache.hadoop.hbase.rest.model.TestNamespacesInstanceModel
Java HotSpot(TM) 64-Bit Server VM warning: ignoring option MaxPermSize=256m; support was removed in 8.0
Running org.apache.hadoop.hbase.rest.model.TestScannerModel
Tests run: 5, Failures: 0, Errors: 0, Skipped: 0, Time elapsed: 1.026 sec - in org.apache.hadoop.hbase.rest.model.TestScannerModel
Java HotSpot(TM) 64-Bit Server VM warning: ignoring option MaxPermSize=256m; support was removed in 8.0
Running org.apache.hadoop.hbase.rest.model.TestTableRegionModel
Tests run: 7, Failures: 0, Errors: 0, Skipped: 0, Time elapsed: 0.607 sec - in org.apache.hadoop.hbase.rest.model.TestTableRegionModel
Java HotSpot(TM) 64-Bit Server VM warning: ignoring option MaxPermSize=256m; support was removed in 8.0
Running org.apache.hadoop.hbase.rest.TestScannersWithLabels
Tests run: 2, Failures: 0, Errors: 0, Skipped: 0, Time elapsed: 2.403 sec - in org.apache.hadoop.hbase.rest.TestScannersWithLabels
Java HotSpot(TM) 64-Bit Server VM warning: ignoring option MaxPermSize=256m; support was removed in 8.0
Running org.apache.hadoop.hbase.rest.TestTableScan
Tests run: 10, Failures: 0, Errors: 0, Skipped: 0, Time elapsed: 10.807 sec - in org.apache.hadoop.hbase.rest.TestTableScan
Java HotSpot(TM) 64-Bit Server VM warning: ignoring option MaxPermSize=256m; support was removed in 8.0
Running org.apache.hadoop.hbase.rest.TestNamespacesResource
Tests run: 2, Failures: 0, Errors: 0, Skipped: 0, Time elapsed: 2.881 sec - in org.apache.hadoop.hbase.rest.TestNamespacesResource
Java HotSpot(TM) 64-Bit Server VM warning: ignoring option MaxPermSize=256m; support was removed in 8.0
Running org.apache.hadoop.hbase.rest.TestGzipFilter
Tests run: 2, Failures: 0, Errors: 0, Skipped: 0, Time elapsed: 3.481 sec - in org.apache.hadoop.hbase.rest.TestGzipFilter
Java HotSpot(TM) 64-Bit Server VM warning: ignoring option MaxPermSize=256m; support was removed in 8.0
Running org.apache.hadoop.hbase.rest.TestGetAndPutResource
Killed
Java HotSpot(TM) 64-Bit Server VM warning: ignoring option MaxPermSize=256m; support was removed in 8.0
Running org.apache.hadoop.hbase.rest.TestNamespacesInstanceResource
Tests run: 5, Failures: 0, Errors: 0, Skipped: 0, Time elapsed: 5.96 sec - in org.apache.hadoop.hbase.rest.TestNamespacesInstanceResource
Java HotSpot(TM) 64-Bit Server VM warning: ignoring option MaxPermSize=256m; support was removed in 8.0
Running org.apache.hadoop.hbase.rest.TestSchemaResource
Tests run: 2, Failures: 0, Errors: 0, Skipped: 0, Time elapsed: 12.258 sec - in org.apache.hadoop.hbase.rest.TestSchemaResource
Results :
Tests run: 160, Failures: 0, Errors: 0, Skipped: 0
[INFO] ------------------------------------------------------------------------
[INFO] Reactor Summary:
[INFO]
[INFO] Apache HBase ...................................... SUCCESS [1:03.214s]
[INFO] Apache HBase - Checkstyle ......................... SUCCESS [5.024s]
[INFO] Apache HBase - Resource Bundle .................... SUCCESS [0.149s]
[INFO] Apache HBase - Annotations ........................ SUCCESS [0.912s]
[INFO] Apache HBase - Protocol ........................... SUCCESS [16.433s]
[INFO] Apache HBase - Common ............................. SUCCESS [2:21.177s]
[INFO] Apache HBase - Procedure .......................... SUCCESS [1:52.904s]
[INFO] Apache HBase - Client ............................. SUCCESS [1:27.386s]
[INFO] Apache HBase - Hadoop Compatibility ............... SUCCESS [8.040s]
[INFO] Apache HBase - Hadoop Two Compatibility ........... SUCCESS [7.546s]
[INFO] Apache HBase - Prefix Tree ........................ SUCCESS [7.437s]
[INFO] Apache HBase - Server ............................. SUCCESS [1:36:46.145s]
[INFO] Apache HBase - Testing Util ....................... SUCCESS [3.989s]
[INFO] Apache HBase - Thrift ............................. SUCCESS [3:18.921s]
[INFO] Apache HBase - Rest ............................... FAILURE [5:26.612s]
[INFO] Apache HBase - Shell .............................. SKIPPED
[INFO] Apache HBase - Integration Tests .................. SKIPPED
[INFO] Apache HBase - Examples ........................... SKIPPED
[INFO] Apache HBase - External Block Cache ............... SKIPPED
[INFO] Apache HBase - Assembly ........................... SKIPPED
[INFO] Apache HBase - Shaded ............................. SKIPPED
[INFO] Apache HBase - Shaded - Client .................... SKIPPED
[INFO] Apache HBase - Shaded - Server .................... SKIPPED
[INFO] ------------------------------------------------------------------------
[INFO] BUILD FAILURE
[INFO] ------------------------------------------------------------------------
[INFO] Total time: 1:53:23.006s
[INFO] Finished at: Sat Oct 10 04:29:11 UTC 2015
[INFO] Final Memory: 113M/692M
[INFO] ------------------------------------------------------------------------
[ERROR] Failed to execute goal org.apache.maven.plugins:maven-surefire-plugin:2.18.1:test (default-test) on project hbase-rest: ExecutionException: java.lang.RuntimeException: The forked VM terminated without properly saying goodbye. VM crash or System.exit called?
[ERROR] Command was /bin/sh -c cd <https://builds.apache.org/job/HBase-1.2/jdk=latest1.8,label=Hadoop/ws/hbase-rest> && /home/jenkins/jenkins-slave/tools/hudson.model.JDK/latest1.8/jre/bin/java -enableassertions -XX:MaxDirectMemorySize=1G -Xmx2800m -XX:MaxPermSize=256m -Djava.security.egd=file:/dev/./urandom -Djava.net.preferIPv4Stack=true -Djava.awt.headless=true -jar <https://builds.apache.org/job/HBase-1.2/jdk=latest1.8,label=Hadoop/ws/hbase-rest/target/surefire/surefirebooter1466156098079555028.jar> <https://builds.apache.org/job/HBase-1.2/jdk=latest1.8,label=Hadoop/ws/hbase-rest/target/surefire/surefire7068779319125633046tmp> <https://builds.apache.org/job/HBase-1.2/jdk=latest1.8,label=Hadoop/ws/hbase-rest/target/surefire/surefire_13744312968171300551202tmp>
[ERROR] -> [Help 1]
[ERROR]
[ERROR] To see the full stack trace of the errors, re-run Maven with the -e switch.
[ERROR] Re-run Maven using the -X switch to enable full debug logging.
[ERROR]
[ERROR] For more information about the errors and possible solutions, please read the following articles:
[ERROR] [Help 1] http://cwiki.apache.org/confluence/display/MAVEN/MojoFailureException
[ERROR]
[ERROR] After correcting the problems, you can resume the build with the command
[ERROR] mvn <goals> -rf :hbase-rest
Build step 'Invoke top-level Maven targets' marked build as failure
Performing Post build task...
Match found for :.* : True
Logical operation result is TRUE
Running script : ZOMBIE_TESTS_COUNT=`jps | grep surefirebooter | wc -l`
if [[ $ZOMBIE_TESTS_COUNT != 0 ]] ; then
#It seems sometimes the tests are not dying immediately. Let's give them 10s
echo "Suspicious java process found - waiting 10s to see if there are just slow to stop"
sleep 10
ZOMBIE_TESTS_COUNT=`jps | grep surefirebooter | wc -l`
if [[ $ZOMBIE_TESTS_COUNT != 0 ]] ; then
echo "There are $ZOMBIE_TESTS_COUNT zombie tests, they should have been killed by surefire but survived"
echo "************ BEGIN zombies jstack extract"
ZB_STACK=`jps | grep surefirebooter | cut -d ' ' -f 1 | xargs -n 1 jstack | grep ".test" | grep "\.java"`
jps | grep surefirebooter | cut -d ' ' -f 1 | xargs -n 1 jstack
echo "************ END zombies jstack extract"
JIRA_COMMENT="$JIRA_COMMENT
{color:red}-1 core zombie tests{color}. There are ${ZOMBIE_TESTS_COUNT} zombie test(s): ${ZB_STACK}"
BAD=1
jps | grep surefirebooter | cut -d ' ' -f 1 | xargs kill -9
else
echo "We're ok: there is no zombie test, but some tests took some time to stop"
fi
else
echo "We're ok: there is no zombie test"
fi
[Hadoop] $ /bin/bash -xe /tmp/hudson8316662697358041040.sh
++ jps
++ grep surefirebooter
++ wc -l
+ ZOMBIE_TESTS_COUNT=0
+ [[ 0 != 0 ]]
+ echo 'We'\''re ok: there is no zombie test'
We're ok: there is no zombie test
POST BUILD TASK : SUCCESS
END OF POST BUILD TASK : 0
Archiving artifacts
Build failed in Jenkins: HBase-1.2 » latest1.8,Hadoop #236
Posted by Apache Jenkins Server <je...@builds.apache.org>.
See <https://builds.apache.org/job/HBase-1.2/jdk=latest1.8,label=Hadoop/236/changes>
Changes:
[stack] HBASE-14584 TestNamespacesInstanceModel fails on jdk8; DISABLE TEST
------------------------------------------
[...truncated 53041 lines...]
"org.apache.hadoop.hdfs.server.blockmanagement.DecommissionManager$Monitor@7a7471ce" #42 daemon prio=5 os_prio=0 tid=0x00007fc0592b9000 nid=0x265 waiting on condition [0x00007fc00842f000]
java.lang.Thread.State: TIMED_WAITING (sleeping)
at java.lang.Thread.sleep(Native Method)
at org.apache.hadoop.hdfs.server.blockmanagement.DecommissionManager$Monitor.run(DecommissionManager.java:76)
at java.lang.Thread.run(Thread.java:745)
"org.apache.hadoop.hdfs.server.blockmanagement.PendingReplicationBlocks$PendingReplicationMonitor@132ddbab" #41 daemon prio=5 os_prio=0 tid=0x00007fc0592b7000 nid=0x264 waiting on condition [0x00007fc008530000]
java.lang.Thread.State: TIMED_WAITING (sleeping)
at java.lang.Thread.sleep(Native Method)
at org.apache.hadoop.hdfs.server.blockmanagement.PendingReplicationBlocks$PendingReplicationMonitor.run(PendingReplicationBlocks.java:221)
at java.lang.Thread.run(Thread.java:745)
"org.apache.hadoop.util.JvmPauseMonitor$Monitor@48c35007" #37 daemon prio=5 os_prio=0 tid=0x00007fc0592ab800 nid=0x25b waiting on condition [0x00007fc008732000]
java.lang.Thread.State: TIMED_WAITING (sleeping)
at java.lang.Thread.sleep(Native Method)
at org.apache.hadoop.util.JvmPauseMonitor$Monitor.run(JvmPauseMonitor.java:180)
at java.lang.Thread.run(Thread.java:745)
"IPC Server idle connection scanner for port 34313" #35 daemon prio=5 os_prio=0 tid=0x00007fc059257800 nid=0x244 in Object.wait() [0x00007fc008833000]
java.lang.Thread.State: TIMED_WAITING (on object monitor)
at java.lang.Object.wait(Native Method)
at java.util.TimerThread.mainLoop(Timer.java:552)
- locked <0x0000000715318f18> (a java.util.TaskQueue)
at java.util.TimerThread.run(Timer.java:505)
"Socket Reader #1 for port 34313" #34 prio=5 os_prio=0 tid=0x00007fc059259000 nid=0x243 runnable [0x00007fc008934000]
java.lang.Thread.State: RUNNABLE
at sun.nio.ch.EPollArrayWrapper.epollWait(Native Method)
at sun.nio.ch.EPollArrayWrapper.poll(EPollArrayWrapper.java:269)
at sun.nio.ch.EPollSelectorImpl.doSelect(EPollSelectorImpl.java:79)
at sun.nio.ch.SelectorImpl.lockAndDoSelect(SelectorImpl.java:86)
- locked <0x000000071531b930> (a sun.nio.ch.Util$2)
- locked <0x000000071531b920> (a java.util.Collections$UnmodifiableSet)
- locked <0x000000071531afd8> (a sun.nio.ch.EPollSelectorImpl)
at sun.nio.ch.SelectorImpl.select(SelectorImpl.java:97)
at sun.nio.ch.SelectorImpl.select(SelectorImpl.java:101)
at org.apache.hadoop.ipc.Server$Listener$Reader.doRunLoop(Server.java:616)
- locked <0x000000071531bf58> (a org.apache.hadoop.ipc.Server$Listener$Reader)
at org.apache.hadoop.ipc.Server$Listener$Reader.run(Server.java:595)
"Timer-0" #30 daemon prio=5 os_prio=0 tid=0x00007fc059141800 nid=0x237 in Object.wait() [0x00007fc008e35000]
java.lang.Thread.State: TIMED_WAITING (on object monitor)
at java.lang.Object.wait(Native Method)
at java.util.TimerThread.mainLoop(Timer.java:552)
- locked <0x000000071531d660> (a java.util.TaskQueue)
at java.util.TimerThread.run(Timer.java:505)
"1811922029@qtp-2024415090-1 - Acceptor0 HttpServer2$SelectChannelConnectorWithSafeStartup@localhost:43941" #29 daemon prio=5 os_prio=0 tid=0x00007fc05912f800 nid=0x233 runnable [0x00007fc008f36000]
java.lang.Thread.State: RUNNABLE
at sun.nio.ch.EPollArrayWrapper.epollWait(Native Method)
at sun.nio.ch.EPollArrayWrapper.poll(EPollArrayWrapper.java:269)
at sun.nio.ch.EPollSelectorImpl.doSelect(EPollSelectorImpl.java:79)
at sun.nio.ch.SelectorImpl.lockAndDoSelect(SelectorImpl.java:86)
- locked <0x000000071531e120> (a sun.nio.ch.Util$2)
- locked <0x000000071531e130> (a java.util.Collections$UnmodifiableSet)
- locked <0x000000071531e0d8> (a sun.nio.ch.EPollSelectorImpl)
at sun.nio.ch.SelectorImpl.select(SelectorImpl.java:97)
at org.mortbay.io.nio.SelectorManager$SelectSet.doSelect(SelectorManager.java:498)
at org.mortbay.io.nio.SelectorManager.doSelect(SelectorManager.java:192)
at org.mortbay.jetty.nio.SelectChannelConnector.accept(SelectChannelConnector.java:124)
at org.mortbay.jetty.AbstractConnector$Acceptor.run(AbstractConnector.java:708)
at org.mortbay.thread.QueuedThreadPool$PoolThread.run(QueuedThreadPool.java:582)
"1408695561@qtp-2024415090-0" #28 daemon prio=5 os_prio=0 tid=0x00007fc05912f000 nid=0x232 in Object.wait() [0x00007fc009f96000]
java.lang.Thread.State: TIMED_WAITING (on object monitor)
at java.lang.Object.wait(Native Method)
at org.mortbay.thread.QueuedThreadPool$PoolThread.run(QueuedThreadPool.java:626)
- locked <0x00000007154be4e0> (a org.mortbay.thread.QueuedThreadPool$PoolThread)
"Timer for 'NameNode' metrics system" #26 daemon prio=5 os_prio=0 tid=0x00007fc0590c5800 nid=0x21f in Object.wait() [0x00007fc009437000]
java.lang.Thread.State: TIMED_WAITING (on object monitor)
at java.lang.Object.wait(Native Method)
at java.util.TimerThread.mainLoop(Timer.java:552)
- locked <0x000000071102ef70> (a java.util.TaskQueue)
at java.util.TimerThread.run(Timer.java:505)
"Service Thread" #17 daemon prio=9 os_prio=0 tid=0x00007fc0582d7000 nid=0x7f8a runnable [0x0000000000000000]
java.lang.Thread.State: RUNNABLE
"C1 CompilerThread11" #16 daemon prio=9 os_prio=0 tid=0x00007fc0582d2000 nid=0x7f89 waiting on condition [0x0000000000000000]
java.lang.Thread.State: RUNNABLE
"C1 CompilerThread10" #15 daemon prio=9 os_prio=0 tid=0x00007fc0582d0000 nid=0x7f88 waiting on condition [0x0000000000000000]
java.lang.Thread.State: RUNNABLE
"C1 CompilerThread9" #14 daemon prio=9 os_prio=0 tid=0x00007fc0582cd800 nid=0x7f87 waiting on condition [0x0000000000000000]
java.lang.Thread.State: RUNNABLE
"C1 CompilerThread8" #13 daemon prio=9 os_prio=0 tid=0x00007fc0582cb800 nid=0x7f86 waiting on condition [0x0000000000000000]
java.lang.Thread.State: RUNNABLE
"C2 CompilerThread7" #12 daemon prio=9 os_prio=0 tid=0x00007fc0582c9800 nid=0x7f85 waiting on condition [0x0000000000000000]
java.lang.Thread.State: RUNNABLE
"C2 CompilerThread6" #11 daemon prio=9 os_prio=0 tid=0x00007fc0582c7800 nid=0x7f84 waiting on condition [0x0000000000000000]
java.lang.Thread.State: RUNNABLE
"C2 CompilerThread5" #10 daemon prio=9 os_prio=0 tid=0x00007fc0582c5000 nid=0x7f83 waiting on condition [0x0000000000000000]
java.lang.Thread.State: RUNNABLE
"C2 CompilerThread4" #9 daemon prio=9 os_prio=0 tid=0x00007fc0582bb000 nid=0x7f82 waiting on condition [0x0000000000000000]
java.lang.Thread.State: RUNNABLE
"C2 CompilerThread3" #8 daemon prio=9 os_prio=0 tid=0x00007fc0582b9000 nid=0x7f81 waiting on condition [0x0000000000000000]
java.lang.Thread.State: RUNNABLE
"C2 CompilerThread2" #7 daemon prio=9 os_prio=0 tid=0x00007fc0582b6800 nid=0x7f80 waiting on condition [0x0000000000000000]
java.lang.Thread.State: RUNNABLE
"C2 CompilerThread1" #6 daemon prio=9 os_prio=0 tid=0x00007fc0582b5000 nid=0x7f7f waiting on condition [0x0000000000000000]
java.lang.Thread.State: RUNNABLE
"C2 CompilerThread0" #5 daemon prio=9 os_prio=0 tid=0x00007fc0582b2000 nid=0x7f7e waiting on condition [0x0000000000000000]
java.lang.Thread.State: RUNNABLE
"Signal Dispatcher" #4 daemon prio=9 os_prio=0 tid=0x00007fc0582b0800 nid=0x7f7d runnable [0x0000000000000000]
java.lang.Thread.State: RUNNABLE
"Finalizer" #3 daemon prio=8 os_prio=0 tid=0x00007fc058279000 nid=0x7f7c in Object.wait() [0x00007fc015cdb000]
java.lang.Thread.State: WAITING (on object monitor)
at java.lang.Object.wait(Native Method)
at java.lang.ref.ReferenceQueue.remove(ReferenceQueue.java:143)
- locked <0x0000000711025e58> (a java.lang.ref.ReferenceQueue$Lock)
at java.lang.ref.ReferenceQueue.remove(ReferenceQueue.java:164)
at java.lang.ref.Finalizer$FinalizerThread.run(Finalizer.java:209)
"Reference Handler" #2 daemon prio=10 os_prio=0 tid=0x00007fc058276800 nid=0x7f7b in Object.wait() [0x00007fc015ddc000]
java.lang.Thread.State: WAITING (on object monitor)
at java.lang.Object.wait(Native Method)
at java.lang.Object.wait(Object.java:502)
at java.lang.ref.Reference$ReferenceHandler.run(Reference.java:157)
- locked <0x000000071102f138> (a java.lang.ref.Reference$Lock)
"main" #1 prio=5 os_prio=0 tid=0x00007fc05800a800 nid=0x7f6c in Object.wait() [0x00007fc061372000]
java.lang.Thread.State: WAITING (on object monitor)
at java.lang.Object.wait(Native Method)
at java.lang.Object.wait(Object.java:502)
at org.apache.hadoop.hbase.client.ResultBoundedCompletionService.take(ResultBoundedCompletionService.java:148)
- locked <0x0000000789b6d018> (a [Lorg.apache.hadoop.hbase.client.ResultBoundedCompletionService$QueueingFuture;)
at org.apache.hadoop.hbase.client.ScannerCallableWithReplicas.call(ScannerCallableWithReplicas.java:188)
at org.apache.hadoop.hbase.client.ScannerCallableWithReplicas.call(ScannerCallableWithReplicas.java:59)
at org.apache.hadoop.hbase.client.RpcRetryingCaller.callWithoutRetries(RpcRetryingCaller.java:200)
at org.apache.hadoop.hbase.client.ClientSmallReversedScanner.loadCache(ClientSmallReversedScanner.java:212)
at org.apache.hadoop.hbase.client.ClientSmallReversedScanner.next(ClientSmallReversedScanner.java:186)
at org.apache.hadoop.hbase.client.ConnectionManager$HConnectionImplementation.locateRegionInMeta(ConnectionManager.java:1272)
at org.apache.hadoop.hbase.client.ConnectionManager$HConnectionImplementation.locateRegion(ConnectionManager.java:1178)
at org.apache.hadoop.hbase.client.ConnectionManager$HConnectionImplementation.relocateRegion(ConnectionManager.java:1149)
at org.apache.hadoop.hbase.client.ConnectionManager$HConnectionImplementation.relocateRegion(ConnectionManager.java:1133)
at org.apache.hadoop.hbase.client.ConnectionManager$HConnectionImplementation.getRegionLocation(ConnectionManager.java:954)
at org.apache.hadoop.hbase.client.HRegionLocator.getRegionLocation(HRegionLocator.java:83)
at org.apache.hadoop.hbase.client.RegionServerCallable.prepare(RegionServerCallable.java:79)
at org.apache.hadoop.hbase.client.RpcRetryingCaller.callWithRetries(RpcRetryingCaller.java:124)
at org.apache.hadoop.hbase.ipc.RegionCoprocessorRpcChannel.callExecService(RegionCoprocessorRpcChannel.java:96)
at org.apache.hadoop.hbase.ipc.CoprocessorRpcChannel.callBlockingMethod(CoprocessorRpcChannel.java:73)
at org.apache.hadoop.hbase.protobuf.generated.AccessControlProtos$AccessControlService$BlockingStub.grant(AccessControlProtos.java:10280)
at org.apache.hadoop.hbase.protobuf.ProtobufUtil.grant(ProtobufUtil.java:2209)
at org.apache.hadoop.hbase.security.access.SecureTestUtil$8.call(SecureTestUtil.java:502)
at org.apache.hadoop.hbase.security.access.SecureTestUtil$8.call(SecureTestUtil.java:494)
at org.apache.hadoop.hbase.security.access.SecureTestUtil.updateACLs(SecureTestUtil.java:324)
at org.apache.hadoop.hbase.security.access.SecureTestUtil.grantOnTable(SecureTestUtil.java:494)
at org.apache.hadoop.hbase.security.access.TestCellACLs.testCoveringCheck(TestCellACLs.java:402)
at sun.reflect.NativeMethodAccessorImpl.invoke0(Native Method)
at sun.reflect.NativeMethodAccessorImpl.invoke(NativeMethodAccessorImpl.java:62)
at sun.reflect.DelegatingMethodAccessorImpl.invoke(DelegatingMethodAccessorImpl.java:43)
at java.lang.reflect.Method.invoke(Method.java:497)
at org.junit.runners.model.FrameworkMethod$1.runReflectiveCall(FrameworkMethod.java:50)
at org.junit.internal.runners.model.ReflectiveCallable.run(ReflectiveCallable.java:12)
at org.junit.runners.model.FrameworkMethod.invokeExplosively(FrameworkMethod.java:47)
at org.junit.internal.runners.statements.InvokeMethod.evaluate(InvokeMethod.java:17)
at org.junit.internal.runners.statements.RunBefores.evaluate(RunBefores.java:26)
at org.junit.internal.runners.statements.RunAfters.evaluate(RunAfters.java:27)
at org.junit.rules.TestWatcher$1.evaluate(TestWatcher.java:55)
at org.junit.rules.RunRules.evaluate(RunRules.java:20)
at org.junit.runners.ParentRunner.runLeaf(ParentRunner.java:325)
at org.junit.runners.BlockJUnit4ClassRunner.runChild(BlockJUnit4ClassRunner.java:78)
at org.junit.runners.BlockJUnit4ClassRunner.runChild(BlockJUnit4ClassRunner.java:57)
at org.junit.runners.ParentRunner$3.run(ParentRunner.java:290)
at org.junit.runners.ParentRunner$1.schedule(ParentRunner.java:71)
at org.junit.runners.ParentRunner.runChildren(ParentRunner.java:288)
at org.junit.runners.ParentRunner.access$000(ParentRunner.java:58)
at org.junit.runners.ParentRunner$2.evaluate(ParentRunner.java:268)
at org.junit.internal.runners.statements.RunBefores.evaluate(RunBefores.java:26)
at org.junit.internal.runners.statements.RunAfters.evaluate(RunAfters.java:27)
at org.junit.runners.ParentRunner.run(ParentRunner.java:363)
at org.junit.runners.Suite.runChild(Suite.java:128)
at org.junit.runners.Suite.runChild(Suite.java:27)
at org.junit.runners.ParentRunner$3.run(ParentRunner.java:290)
at org.junit.runners.ParentRunner$1.schedule(ParentRunner.java:71)
at org.junit.runners.ParentRunner.runChildren(ParentRunner.java:288)
at org.junit.runners.ParentRunner.access$000(ParentRunner.java:58)
at org.junit.runners.ParentRunner$2.evaluate(ParentRunner.java:268)
at org.junit.runners.ParentRunner.run(ParentRunner.java:363)
at org.junit.runner.JUnitCore.run(JUnitCore.java:137)
at org.junit.runner.JUnitCore.run(JUnitCore.java:115)
at org.apache.maven.surefire.junitcore.JUnitCoreWrapper.createRequestAndRun(JUnitCoreWrapper.java:108)
at org.apache.maven.surefire.junitcore.JUnitCoreWrapper.executeEager(JUnitCoreWrapper.java:78)
at org.apache.maven.surefire.junitcore.JUnitCoreWrapper.execute(JUnitCoreWrapper.java:54)
at org.apache.maven.surefire.junitcore.JUnitCoreProvider.invoke(JUnitCoreProvider.java:144)
at org.apache.maven.surefire.booter.ForkedBooter.invokeProviderInSameClassLoader(ForkedBooter.java:203)
at org.apache.maven.surefire.booter.ForkedBooter.runSuitesInProcess(ForkedBooter.java:155)
at org.apache.maven.surefire.booter.ForkedBooter.main(ForkedBooter.java:103)
"VM Thread" os_prio=0 tid=0x00007fc058271800 nid=0x7f7a runnable
"GC task thread#0 (ParallelGC)" os_prio=0 tid=0x00007fc05801f800 nid=0x7f6d runnable
"GC task thread#1 (ParallelGC)" os_prio=0 tid=0x00007fc058021800 nid=0x7f6e runnable
"GC task thread#2 (ParallelGC)" os_prio=0 tid=0x00007fc058023000 nid=0x7f6f runnable
"GC task thread#3 (ParallelGC)" os_prio=0 tid=0x00007fc058025000 nid=0x7f70 runnable
"GC task thread#4 (ParallelGC)" os_prio=0 tid=0x00007fc058026800 nid=0x7f71 runnable
"GC task thread#5 (ParallelGC)" os_prio=0 tid=0x00007fc058028800 nid=0x7f72 runnable
"GC task thread#6 (ParallelGC)" os_prio=0 tid=0x00007fc05802a000 nid=0x7f73 runnable
"GC task thread#7 (ParallelGC)" os_prio=0 tid=0x00007fc05802c000 nid=0x7f74 runnable
"GC task thread#8 (ParallelGC)" os_prio=0 tid=0x00007fc05802d800 nid=0x7f75 runnable
"GC task thread#9 (ParallelGC)" os_prio=0 tid=0x00007fc05802f800 nid=0x7f76 runnable
"GC task thread#10 (ParallelGC)" os_prio=0 tid=0x00007fc058031000 nid=0x7f77 runnable
"GC task thread#11 (ParallelGC)" os_prio=0 tid=0x00007fc058033000 nid=0x7f78 runnable
"GC task thread#12 (ParallelGC)" os_prio=0 tid=0x00007fc058034800 nid=0x7f79 runnable
"VM Periodic Task Thread" os_prio=0 tid=0x00007fc0582d9800 nid=0x7f8b waiting on condition
JNI global references: 293
+ echo '************ END zombies jstack extract'
************ END zombies jstack extract
+ JIRA_COMMENT='
{color:red}-1 core zombie tests{color}. There are 2 zombie test(s): at org.apache.hadoop.mapreduce.v2.TestMRAMWithNonNormalizedCapabilities.testJobWithNonNormalizedCapabilities(TestMRAMWithNonNormalizedCapabilities.java:103)
at org.apache.hadoop.hbase.security.access.TestCellACLs.testCoveringCheck(TestCellACLs.java:402)'
+ BAD=1
+ jps
+ grep surefirebooter
+ cut -d ' ' -f 1
+ xargs kill -9
POST BUILD TASK : SUCCESS
END OF POST BUILD TASK : 0
Archiving artifacts
Build failed in Jenkins: HBase-1.2 » latest1.8,Hadoop #235
Posted by Apache Jenkins Server <je...@builds.apache.org>.
See <https://builds.apache.org/job/HBase-1.2/jdk=latest1.8,label=Hadoop/235/changes>
Changes:
[eclark] HBASE-14529 Respond to SIGHUP to reload config
------------------------------------------
[...truncated 48965 lines...]
at java.util.concurrent.ThreadPoolExecutor.getTask(ThreadPoolExecutor.java:1067)
at java.util.concurrent.ThreadPoolExecutor.runWorker(ThreadPoolExecutor.java:1127)
at java.util.concurrent.ThreadPoolExecutor$Worker.run(ThreadPoolExecutor.java:617)
at java.lang.Thread.run(Thread.java:744)
"IPC Parameter Sending Thread #2" #1103 daemon prio=5 os_prio=0 tid=0x0000000000f60800 nid=0x623b waiting on condition [0x00007f9cdef60000]
java.lang.Thread.State: TIMED_WAITING (parking)
at sun.misc.Unsafe.park(Native Method)
- parking to wait for <0x00000000805b1620> (a java.util.concurrent.SynchronousQueue$TransferStack)
at java.util.concurrent.locks.LockSupport.parkNanos(LockSupport.java:215)
at java.util.concurrent.SynchronousQueue$TransferStack.awaitFulfill(SynchronousQueue.java:460)
at java.util.concurrent.SynchronousQueue$TransferStack.transfer(SynchronousQueue.java:362)
at java.util.concurrent.SynchronousQueue.poll(SynchronousQueue.java:941)
at java.util.concurrent.ThreadPoolExecutor.getTask(ThreadPoolExecutor.java:1066)
at java.util.concurrent.ThreadPoolExecutor.runWorker(ThreadPoolExecutor.java:1127)
at java.util.concurrent.ThreadPoolExecutor$Worker.run(ThreadPoolExecutor.java:617)
at java.lang.Thread.run(Thread.java:744)
"IPC Parameter Sending Thread #1" #1102 daemon prio=5 os_prio=0 tid=0x0000000001644800 nid=0x623a waiting on condition [0x00007f9cdf061000]
java.lang.Thread.State: TIMED_WAITING (parking)
at sun.misc.Unsafe.park(Native Method)
- parking to wait for <0x00000000805b1620> (a java.util.concurrent.SynchronousQueue$TransferStack)
at java.util.concurrent.locks.LockSupport.parkNanos(LockSupport.java:215)
at java.util.concurrent.SynchronousQueue$TransferStack.awaitFulfill(SynchronousQueue.java:460)
at java.util.concurrent.SynchronousQueue$TransferStack.transfer(SynchronousQueue.java:362)
at java.util.concurrent.SynchronousQueue.poll(SynchronousQueue.java:941)
at java.util.concurrent.ThreadPoolExecutor.getTask(ThreadPoolExecutor.java:1066)
at java.util.concurrent.ThreadPoolExecutor.runWorker(ThreadPoolExecutor.java:1127)
at java.util.concurrent.ThreadPoolExecutor$Worker.run(ThreadPoolExecutor.java:617)
at java.lang.Thread.run(Thread.java:744)
"Readahead Thread #0" #580 daemon prio=5 os_prio=0 tid=0x00007f9d0c176000 nid=0x5f7b waiting on condition [0x00007f9cf384b000]
java.lang.Thread.State: WAITING (parking)
at sun.misc.Unsafe.park(Native Method)
- parking to wait for <0x00000000805d78b0> (a java.util.concurrent.locks.AbstractQueuedSynchronizer$ConditionObject)
at java.util.concurrent.locks.LockSupport.park(LockSupport.java:175)
at java.util.concurrent.locks.AbstractQueuedSynchronizer$ConditionObject.await(AbstractQueuedSynchronizer.java:2039)
at java.util.concurrent.ArrayBlockingQueue.take(ArrayBlockingQueue.java:403)
at java.util.concurrent.ThreadPoolExecutor.getTask(ThreadPoolExecutor.java:1067)
at java.util.concurrent.ThreadPoolExecutor.runWorker(ThreadPoolExecutor.java:1127)
at java.util.concurrent.ThreadPoolExecutor$Worker.run(ThreadPoolExecutor.java:617)
at java.lang.Thread.run(Thread.java:744)
"Readahead Thread #1" #581 daemon prio=5 os_prio=0 tid=0x00007f9d0c175800 nid=0x5f7a waiting on condition [0x00007f9cf3b4e000]
java.lang.Thread.State: WAITING (parking)
at sun.misc.Unsafe.park(Native Method)
- parking to wait for <0x00000000805d78b0> (a java.util.concurrent.locks.AbstractQueuedSynchronizer$ConditionObject)
at java.util.concurrent.locks.LockSupport.park(LockSupport.java:175)
at java.util.concurrent.locks.AbstractQueuedSynchronizer$ConditionObject.await(AbstractQueuedSynchronizer.java:2039)
at java.util.concurrent.ArrayBlockingQueue.take(ArrayBlockingQueue.java:403)
at java.util.concurrent.ThreadPoolExecutor.getTask(ThreadPoolExecutor.java:1067)
at java.util.concurrent.ThreadPoolExecutor.runWorker(ThreadPoolExecutor.java:1127)
at java.util.concurrent.ThreadPoolExecutor$Worker.run(ThreadPoolExecutor.java:617)
at java.lang.Thread.run(Thread.java:744)
"org.apache.hadoop.hdfs.PeerCache@3bc4acb0" #575 daemon prio=5 os_prio=0 tid=0x00007f9d060d6800 nid=0x5f60 waiting on condition [0x00007f9cf374a000]
java.lang.Thread.State: TIMED_WAITING (sleeping)
at java.lang.Thread.sleep(Native Method)
at org.apache.hadoop.hdfs.PeerCache.run(PeerCache.java:253)
at org.apache.hadoop.hdfs.PeerCache.access$000(PeerCache.java:46)
at org.apache.hadoop.hdfs.PeerCache$1.run(PeerCache.java:124)
at java.lang.Thread.run(Thread.java:744)
"process reaper" #377 daemon prio=10 os_prio=0 tid=0x00007f9d25b9a000 nid=0x5e40 waiting on condition [0x00007f9cfbd54000]
java.lang.Thread.State: TIMED_WAITING (parking)
at sun.misc.Unsafe.park(Native Method)
- parking to wait for <0x00000000801e58e8> (a java.util.concurrent.SynchronousQueue$TransferStack)
at java.util.concurrent.locks.LockSupport.parkNanos(LockSupport.java:215)
at java.util.concurrent.SynchronousQueue$TransferStack.awaitFulfill(SynchronousQueue.java:460)
at java.util.concurrent.SynchronousQueue$TransferStack.transfer(SynchronousQueue.java:362)
at java.util.concurrent.SynchronousQueue.poll(SynchronousQueue.java:941)
at java.util.concurrent.ThreadPoolExecutor.getTask(ThreadPoolExecutor.java:1066)
at java.util.concurrent.ThreadPoolExecutor.runWorker(ThreadPoolExecutor.java:1127)
at java.util.concurrent.ThreadPoolExecutor$Worker.run(ThreadPoolExecutor.java:617)
at java.lang.Thread.run(Thread.java:744)
"client DomainSocketWatcher" #124 daemon prio=5 os_prio=0 tid=0x00007f9d269ce000 nid=0x5c4f runnable [0x00007f9cfa1b0000]
java.lang.Thread.State: RUNNABLE
at org.apache.hadoop.net.unix.DomainSocketWatcher.doPoll0(Native Method)
at org.apache.hadoop.net.unix.DomainSocketWatcher.access$900(DomainSocketWatcher.java:52)
at org.apache.hadoop.net.unix.DomainSocketWatcher$2.run(DomainSocketWatcher.java:511)
at java.lang.Thread.run(Thread.java:744)
"AsyncAppender-Dispatcher-Thread-51" #82 daemon prio=5 os_prio=0 tid=0x00007f9d25b48800 nid=0x5c1e in Object.wait() [0x00007f9cfd168000]
java.lang.Thread.State: WAITING (on object monitor)
at java.lang.Object.wait(Native Method)
at java.lang.Object.wait(Object.java:502)
at org.apache.log4j.AsyncAppender$Dispatcher.run(AsyncAppender.java:548)
- locked <0x0000000080568068> (a java.util.ArrayList)
at java.lang.Thread.run(Thread.java:744)
"AsyncAppender-Dispatcher-Thread-32" #56 daemon prio=5 os_prio=0 tid=0x00007f9d25323800 nid=0x5bf9 in Object.wait() [0x00007f9cfe479000]
java.lang.Thread.State: WAITING (on object monitor)
at java.lang.Object.wait(Native Method)
at java.lang.Object.wait(Object.java:502)
at org.apache.log4j.AsyncAppender$Dispatcher.run(AsyncAppender.java:548)
- locked <0x00000000804ba128> (a java.util.ArrayList)
at java.lang.Thread.run(Thread.java:744)
"org.apache.hadoop.fs.FileSystem$Statistics$StatisticsDataReferenceCleaner" #22 daemon prio=5 os_prio=0 tid=0x00007f9d24ad3800 nid=0x5b7c in Object.wait() [0x00007f9d01d19000]
java.lang.Thread.State: WAITING (on object monitor)
at java.lang.Object.wait(Native Method)
at java.lang.ref.ReferenceQueue.remove(ReferenceQueue.java:142)
- locked <0x0000000080229fb0> (a java.lang.ref.ReferenceQueue$Lock)
at java.lang.ref.ReferenceQueue.remove(ReferenceQueue.java:158)
at org.apache.hadoop.fs.FileSystem$Statistics$StatisticsDataReferenceCleaner.run(FileSystem.java:3116)
at java.lang.Thread.run(Thread.java:744)
"process reaper" #19 daemon prio=10 os_prio=0 tid=0x00007f9d24a7f000 nid=0x5b6a waiting on condition [0x00007f9d01d52000]
java.lang.Thread.State: TIMED_WAITING (parking)
at sun.misc.Unsafe.park(Native Method)
- parking to wait for <0x00000000801e58e8> (a java.util.concurrent.SynchronousQueue$TransferStack)
at java.util.concurrent.locks.LockSupport.parkNanos(LockSupport.java:215)
at java.util.concurrent.SynchronousQueue$TransferStack.awaitFulfill(SynchronousQueue.java:460)
at java.util.concurrent.SynchronousQueue$TransferStack.transfer(SynchronousQueue.java:362)
at java.util.concurrent.SynchronousQueue.poll(SynchronousQueue.java:941)
at java.util.concurrent.ThreadPoolExecutor.getTask(ThreadPoolExecutor.java:1066)
at java.util.concurrent.ThreadPoolExecutor.runWorker(ThreadPoolExecutor.java:1127)
at java.util.concurrent.ThreadPoolExecutor$Worker.run(ThreadPoolExecutor.java:617)
at java.lang.Thread.run(Thread.java:744)
"Service Thread" #17 daemon prio=9 os_prio=0 tid=0x00007f9d242cc000 nid=0x5b45 runnable [0x0000000000000000]
java.lang.Thread.State: RUNNABLE
"C1 CompilerThread11" #16 daemon prio=9 os_prio=0 tid=0x00007f9d242c6800 nid=0x5b43 waiting on condition [0x0000000000000000]
java.lang.Thread.State: RUNNABLE
"C1 CompilerThread10" #15 daemon prio=9 os_prio=0 tid=0x00007f9d242c5000 nid=0x5b41 waiting on condition [0x0000000000000000]
java.lang.Thread.State: RUNNABLE
"C1 CompilerThread9" #14 daemon prio=9 os_prio=0 tid=0x00007f9d242c2800 nid=0x5b3e waiting on condition [0x0000000000000000]
java.lang.Thread.State: RUNNABLE
"C1 CompilerThread8" #13 daemon prio=9 os_prio=0 tid=0x00007f9d242c0800 nid=0x5b3c waiting on condition [0x0000000000000000]
java.lang.Thread.State: RUNNABLE
"C2 CompilerThread7" #12 daemon prio=9 os_prio=0 tid=0x00007f9d242be000 nid=0x5b39 waiting on condition [0x0000000000000000]
java.lang.Thread.State: RUNNABLE
"C2 CompilerThread6" #11 daemon prio=9 os_prio=0 tid=0x00007f9d242bc000 nid=0x5b37 waiting on condition [0x0000000000000000]
java.lang.Thread.State: RUNNABLE
"C2 CompilerThread5" #10 daemon prio=9 os_prio=0 tid=0x00007f9d242ba000 nid=0x5b34 waiting on condition [0x0000000000000000]
java.lang.Thread.State: RUNNABLE
"C2 CompilerThread4" #9 daemon prio=9 os_prio=0 tid=0x00007f9d242b0000 nid=0x5b31 waiting on condition [0x0000000000000000]
java.lang.Thread.State: RUNNABLE
"C2 CompilerThread3" #8 daemon prio=9 os_prio=0 tid=0x00007f9d242ad800 nid=0x5b30 waiting on condition [0x0000000000000000]
java.lang.Thread.State: RUNNABLE
"C2 CompilerThread2" #7 daemon prio=9 os_prio=0 tid=0x00007f9d242a9800 nid=0x5b2e waiting on condition [0x0000000000000000]
java.lang.Thread.State: RUNNABLE
"C2 CompilerThread1" #6 daemon prio=9 os_prio=0 tid=0x00007f9d242a7800 nid=0x5b2c waiting on condition [0x0000000000000000]
java.lang.Thread.State: RUNNABLE
"C2 CompilerThread0" #5 daemon prio=9 os_prio=0 tid=0x00007f9d242a5000 nid=0x5b29 waiting on condition [0x0000000000000000]
java.lang.Thread.State: RUNNABLE
"Signal Dispatcher" #4 daemon prio=9 os_prio=0 tid=0x00007f9d242a2800 nid=0x5b26 runnable [0x0000000000000000]
java.lang.Thread.State: RUNNABLE
"Finalizer" #3 daemon prio=8 os_prio=0 tid=0x00007f9d24276000 nid=0x5b24 in Object.wait() [0x00007f9d034f3000]
java.lang.Thread.State: WAITING (on object monitor)
at java.lang.Object.wait(Native Method)
at java.lang.ref.ReferenceQueue.remove(ReferenceQueue.java:142)
- locked <0x000000008003cc08> (a java.lang.ref.ReferenceQueue$Lock)
at java.lang.ref.ReferenceQueue.remove(ReferenceQueue.java:158)
at java.lang.ref.Finalizer$FinalizerThread.run(Finalizer.java:209)
"Reference Handler" #2 daemon prio=10 os_prio=0 tid=0x00007f9d24271800 nid=0x5b23 in Object.wait() [0x00007f9d035f4000]
java.lang.Thread.State: WAITING (on object monitor)
at java.lang.Object.wait(Native Method)
at java.lang.Object.wait(Object.java:502)
at java.lang.ref.Reference$ReferenceHandler.run(Reference.java:157)
- locked <0x0000000080035518> (a java.lang.ref.Reference$Lock)
"main" #1 prio=5 os_prio=0 tid=0x00007f9d2400a000 nid=0x5b0e in Object.wait() [0x00007f9d2a62b000]
java.lang.Thread.State: TIMED_WAITING (on object monitor)
at java.lang.Object.wait(Native Method)
at java.lang.Thread.join(Thread.java:1252)
- locked <0x00000000e05d3e28> (a org.junit.internal.runners.statements.FailOnTimeout$StatementThread)
at org.junit.internal.runners.statements.FailOnTimeout.evaluateStatement(FailOnTimeout.java:26)
at org.junit.internal.runners.statements.FailOnTimeout.evaluate(FailOnTimeout.java:17)
at org.junit.internal.runners.statements.RunBefores.evaluate(RunBefores.java:26)
at org.junit.internal.runners.statements.RunAfters.evaluate(RunAfters.java:27)
at org.junit.runners.ParentRunner.runLeaf(ParentRunner.java:271)
at org.junit.runners.BlockJUnit4ClassRunner.runChild(BlockJUnit4ClassRunner.java:70)
at org.junit.runners.BlockJUnit4ClassRunner.runChild(BlockJUnit4ClassRunner.java:50)
at org.junit.runners.ParentRunner$3.run(ParentRunner.java:238)
at org.junit.runners.ParentRunner$1.schedule(ParentRunner.java:63)
at org.junit.runners.ParentRunner.runChildren(ParentRunner.java:236)
at org.junit.runners.ParentRunner.access$000(ParentRunner.java:53)
at org.junit.runners.ParentRunner$2.evaluate(ParentRunner.java:229)
at org.junit.runners.ParentRunner.run(ParentRunner.java:309)
at org.apache.maven.surefire.junit4.JUnit4Provider.execute(JUnit4Provider.java:264)
at org.apache.maven.surefire.junit4.JUnit4Provider.executeTestSet(JUnit4Provider.java:153)
at org.apache.maven.surefire.junit4.JUnit4Provider.invoke(JUnit4Provider.java:124)
at org.apache.maven.surefire.booter.ForkedBooter.invokeProviderInSameClassLoader(ForkedBooter.java:200)
at org.apache.maven.surefire.booter.ForkedBooter.runSuitesInProcess(ForkedBooter.java:153)
at org.apache.maven.surefire.booter.ForkedBooter.main(ForkedBooter.java:103)
"VM Thread" os_prio=0 tid=0x00007f9d2426c800 nid=0x5b22 runnable
"GC task thread#0 (ParallelGC)" os_prio=0 tid=0x00007f9d2401f800 nid=0x5b12 runnable
"GC task thread#1 (ParallelGC)" os_prio=0 tid=0x00007f9d24021800 nid=0x5b13 runnable
"GC task thread#2 (ParallelGC)" os_prio=0 tid=0x00007f9d24023000 nid=0x5b14 runnable
"GC task thread#3 (ParallelGC)" os_prio=0 tid=0x00007f9d24024800 nid=0x5b15 runnable
"GC task thread#4 (ParallelGC)" os_prio=0 tid=0x00007f9d24026800 nid=0x5b16 runnable
"GC task thread#5 (ParallelGC)" os_prio=0 tid=0x00007f9d24028000 nid=0x5b17 runnable
"GC task thread#6 (ParallelGC)" os_prio=0 tid=0x00007f9d2402a000 nid=0x5b18 runnable
"GC task thread#7 (ParallelGC)" os_prio=0 tid=0x00007f9d2402b800 nid=0x5b19 runnable
"GC task thread#8 (ParallelGC)" os_prio=0 tid=0x00007f9d2402d800 nid=0x5b1a runnable
"GC task thread#9 (ParallelGC)" os_prio=0 tid=0x00007f9d2402f000 nid=0x5b1b runnable
"GC task thread#10 (ParallelGC)" os_prio=0 tid=0x00007f9d24031000 nid=0x5b1c runnable
"GC task thread#11 (ParallelGC)" os_prio=0 tid=0x00007f9d24032800 nid=0x5b1d runnable
"GC task thread#12 (ParallelGC)" os_prio=0 tid=0x00007f9d24034800 nid=0x5b1e runnable
"VM Periodic Task Thread" os_prio=0 tid=0x00007f9d242ce800 nid=0x5b46 waiting on condition
JNI global references: 68
+ echo '************ END zombies jstack extract'
************ END zombies jstack extract
+ JIRA_COMMENT='
{color:red}-1 core zombie tests{color}. There are 1 zombie test(s): at org.apache.hadoop.hdfs.TestDecommission.testDecommission(TestDecommission.java:588)
at org.apache.hadoop.hdfs.TestDecommission.testDecommissionFederation(TestDecommission.java:436)'
+ BAD=1
+ jps
+ grep surefirebooter
+ xargs kill -9
+ cut -d ' ' -f 1
POST BUILD TASK : SUCCESS
END OF POST BUILD TASK : 0
Archiving artifacts
Build failed in Jenkins: HBase-1.2 » latest1.8,Hadoop #234
Posted by Apache Jenkins Server <je...@builds.apache.org>.
See <https://builds.apache.org/job/HBase-1.2/jdk=latest1.8,label=Hadoop/234/changes>
Changes:
[ndimiduk] HBASE-12911 Client-side metrics
------------------------------------------
[...truncated 50432 lines...]
- locked <0x00000007d31a1d58> (a java.util.Collections$UnmodifiableSet)
- locked <0x00000007d31a1d00> (a sun.nio.ch.EPollSelectorImpl)
at sun.nio.ch.SelectorImpl.select(SelectorImpl.java:98)
at sun.nio.ch.SelectorImpl.select(SelectorImpl.java:102)
at org.apache.hadoop.ipc.Server$Listener.run(Server.java:668)
"IPC Server Responder" daemon prio=10 tid=0x00007fbbb0fb0000 nid=0x7bd5 runnable [0x00007fbb7db34000]
java.lang.Thread.State: RUNNABLE
at sun.nio.ch.EPollArrayWrapper.epollWait(Native Method)
at sun.nio.ch.EPollArrayWrapper.poll(EPollArrayWrapper.java:269)
at sun.nio.ch.EPollSelectorImpl.doSelect(EPollSelectorImpl.java:79)
at sun.nio.ch.SelectorImpl.lockAndDoSelect(SelectorImpl.java:87)
- locked <0x00000007d316f588> (a sun.nio.ch.Util$2)
- locked <0x00000007d316f598> (a java.util.Collections$UnmodifiableSet)
- locked <0x00000007d316f540> (a sun.nio.ch.EPollSelectorImpl)
at sun.nio.ch.SelectorImpl.select(SelectorImpl.java:98)
at org.apache.hadoop.ipc.Server$Responder.doRunLoop(Server.java:835)
at org.apache.hadoop.ipc.Server$Responder.run(Server.java:818)
"org.apache.hadoop.hdfs.server.blockmanagement.BlockManager$ReplicationMonitor@40cc0191" daemon prio=10 tid=0x00007fbbb0fa1800 nid=0x7bd4 waiting on condition [0x00007fbb7d730000]
java.lang.Thread.State: TIMED_WAITING (sleeping)
at java.lang.Thread.sleep(Native Method)
at org.apache.hadoop.hdfs.server.blockmanagement.BlockManager$ReplicationMonitor.run(BlockManager.java:3397)
at java.lang.Thread.run(Thread.java:745)
"org.apache.hadoop.hdfs.server.blockmanagement.HeartbeatManager$Monitor@117af7d3" daemon prio=10 tid=0x00007fbbb0fa0000 nid=0x7bd3 waiting on condition [0x00007fbb7d831000]
java.lang.Thread.State: TIMED_WAITING (sleeping)
at java.lang.Thread.sleep(Native Method)
at org.apache.hadoop.hdfs.server.blockmanagement.HeartbeatManager$Monitor.run(HeartbeatManager.java:319)
at java.lang.Thread.run(Thread.java:745)
"org.apache.hadoop.hdfs.server.blockmanagement.DecommissionManager$Monitor@2f42d259" daemon prio=10 tid=0x00007fbbb0f9e800 nid=0x7bd2 waiting on condition [0x00007fbb7d932000]
java.lang.Thread.State: TIMED_WAITING (sleeping)
at java.lang.Thread.sleep(Native Method)
at org.apache.hadoop.hdfs.server.blockmanagement.DecommissionManager$Monitor.run(DecommissionManager.java:76)
at java.lang.Thread.run(Thread.java:745)
"org.apache.hadoop.hdfs.server.blockmanagement.PendingReplicationBlocks$PendingReplicationMonitor@311377b9" daemon prio=10 tid=0x00007fbbb0f9c800 nid=0x7bd1 waiting on condition [0x00007fbb7da33000]
java.lang.Thread.State: TIMED_WAITING (sleeping)
at java.lang.Thread.sleep(Native Method)
at org.apache.hadoop.hdfs.server.blockmanagement.PendingReplicationBlocks$PendingReplicationMonitor.run(PendingReplicationBlocks.java:221)
at java.lang.Thread.run(Thread.java:745)
"org.apache.hadoop.util.JvmPauseMonitor$Monitor@10cfc2e3" daemon prio=10 tid=0x00007fbbb0f94000 nid=0x7bcb waiting on condition [0x00007fbb7dc35000]
java.lang.Thread.State: TIMED_WAITING (sleeping)
at java.lang.Thread.sleep(Native Method)
at org.apache.hadoop.util.JvmPauseMonitor$Monitor.run(JvmPauseMonitor.java:180)
at java.lang.Thread.run(Thread.java:745)
"IPC Server idle connection scanner for port 35688" daemon prio=10 tid=0x00007fbbb0f72800 nid=0x7bca in Object.wait() [0x00007fbb7dd36000]
java.lang.Thread.State: TIMED_WAITING (on object monitor)
at java.lang.Object.wait(Native Method)
- waiting on <0x00000007d316fb58> (a java.util.TaskQueue)
at java.util.TimerThread.mainLoop(Timer.java:552)
- locked <0x00000007d316fb58> (a java.util.TaskQueue)
at java.util.TimerThread.run(Timer.java:505)
"Socket Reader #1 for port 35688" prio=10 tid=0x00007fbbb0f33800 nid=0x7bc9 runnable [0x00007fbb7de37000]
java.lang.Thread.State: RUNNABLE
at sun.nio.ch.EPollArrayWrapper.epollWait(Native Method)
at sun.nio.ch.EPollArrayWrapper.poll(EPollArrayWrapper.java:269)
at sun.nio.ch.EPollSelectorImpl.doSelect(EPollSelectorImpl.java:79)
at sun.nio.ch.SelectorImpl.lockAndDoSelect(SelectorImpl.java:87)
- locked <0x00000007d3170988> (a sun.nio.ch.Util$2)
- locked <0x00000007d3170998> (a java.util.Collections$UnmodifiableSet)
- locked <0x00000007d31a1fa0> (a sun.nio.ch.EPollSelectorImpl)
at sun.nio.ch.SelectorImpl.select(SelectorImpl.java:98)
at sun.nio.ch.SelectorImpl.select(SelectorImpl.java:102)
at org.apache.hadoop.ipc.Server$Listener$Reader.doRunLoop(Server.java:616)
- locked <0x00000007d31708c8> (a org.apache.hadoop.ipc.Server$Listener$Reader)
at org.apache.hadoop.ipc.Server$Listener$Reader.run(Server.java:595)
"Timer-0" daemon prio=10 tid=0x00007fbbb0dac800 nid=0x7bc3 in Object.wait() [0x00007fbb7df38000]
java.lang.Thread.State: TIMED_WAITING (on object monitor)
at java.lang.Object.wait(Native Method)
- waiting on <0x00000007d2b913d8> (a java.util.TaskQueue)
at java.util.TimerThread.mainLoop(Timer.java:552)
- locked <0x00000007d2b913d8> (a java.util.TaskQueue)
at java.util.TimerThread.run(Timer.java:505)
"1132182742@qtp-1854596836-1 - Acceptor0 HttpServer2$SelectChannelConnectorWithSafeStartup@localhost:51188" daemon prio=10 tid=0x00007fbbb0e24800 nid=0x7bbe runnable [0x00007fbb7e4aa000]
java.lang.Thread.State: RUNNABLE
at sun.nio.ch.EPollArrayWrapper.epollWait(Native Method)
at sun.nio.ch.EPollArrayWrapper.poll(EPollArrayWrapper.java:269)
at sun.nio.ch.EPollSelectorImpl.doSelect(EPollSelectorImpl.java:79)
at sun.nio.ch.SelectorImpl.lockAndDoSelect(SelectorImpl.java:87)
- locked <0x00000007d32553b8> (a sun.nio.ch.Util$2)
- locked <0x00000007d32553a8> (a java.util.Collections$UnmodifiableSet)
- locked <0x00000007d3254fd8> (a sun.nio.ch.EPollSelectorImpl)
at sun.nio.ch.SelectorImpl.select(SelectorImpl.java:98)
at org.mortbay.io.nio.SelectorManager$SelectSet.doSelect(SelectorManager.java:498)
at org.mortbay.io.nio.SelectorManager.doSelect(SelectorManager.java:192)
at org.mortbay.jetty.nio.SelectChannelConnector.accept(SelectChannelConnector.java:124)
at org.mortbay.jetty.AbstractConnector$Acceptor.run(AbstractConnector.java:708)
at org.mortbay.thread.QueuedThreadPool$PoolThread.run(QueuedThreadPool.java:582)
"1053625764@qtp-1854596836-0" daemon prio=10 tid=0x00007fbbb0e2b000 nid=0x7bbd in Object.wait() [0x00007fbb7e5ab000]
java.lang.Thread.State: TIMED_WAITING (on object monitor)
at java.lang.Object.wait(Native Method)
- waiting on <0x00000007d3254ad0> (a org.mortbay.thread.QueuedThreadPool$PoolThread)
at org.mortbay.thread.QueuedThreadPool$PoolThread.run(QueuedThreadPool.java:626)
- locked <0x00000007d3254ad0> (a org.mortbay.thread.QueuedThreadPool$PoolThread)
"Timer for 'NameNode' metrics system" daemon prio=10 tid=0x00007fbbb0db3000 nid=0x7bb7 in Object.wait() [0x00007fbb7e8b2000]
java.lang.Thread.State: TIMED_WAITING (on object monitor)
at java.lang.Object.wait(Native Method)
- waiting on <0x00000007d3172060> (a java.util.TaskQueue)
at java.util.TimerThread.mainLoop(Timer.java:552)
- locked <0x00000007d3172060> (a java.util.TaskQueue)
at java.util.TimerThread.run(Timer.java:505)
"process reaper" daemon prio=10 tid=0x00007fbbb0a1c000 nid=0x7b66 waiting on condition [0x00007fbb7e8eb000]
java.lang.Thread.State: TIMED_WAITING (parking)
at sun.misc.Unsafe.park(Native Method)
- parking to wait for <0x00000007d2b84760> (a java.util.concurrent.SynchronousQueue$TransferStack)
at java.util.concurrent.locks.LockSupport.parkNanos(LockSupport.java:226)
at java.util.concurrent.SynchronousQueue$TransferStack.awaitFulfill(SynchronousQueue.java:460)
at java.util.concurrent.SynchronousQueue$TransferStack.transfer(SynchronousQueue.java:359)
at java.util.concurrent.SynchronousQueue.poll(SynchronousQueue.java:942)
at java.util.concurrent.ThreadPoolExecutor.getTask(ThreadPoolExecutor.java:1068)
at java.util.concurrent.ThreadPoolExecutor.runWorker(ThreadPoolExecutor.java:1130)
at java.util.concurrent.ThreadPoolExecutor$Worker.run(ThreadPoolExecutor.java:615)
at java.lang.Thread.run(Thread.java:745)
"Service Thread" daemon prio=10 tid=0x00007fbbb029b800 nid=0x7b19 runnable [0x0000000000000000]
java.lang.Thread.State: RUNNABLE
"C2 CompilerThread1" daemon prio=10 tid=0x00007fbbb0299000 nid=0x7b18 waiting on condition [0x0000000000000000]
java.lang.Thread.State: RUNNABLE
"C2 CompilerThread0" daemon prio=10 tid=0x00007fbbb0296000 nid=0x7b17 waiting on condition [0x0000000000000000]
java.lang.Thread.State: RUNNABLE
"Signal Dispatcher" daemon prio=10 tid=0x00007fbbb0294000 nid=0x7b16 runnable [0x0000000000000000]
java.lang.Thread.State: RUNNABLE
"Finalizer" daemon prio=10 tid=0x00007fbbb026b800 nid=0x7b15 in Object.wait() [0x00007fbb7fefd000]
java.lang.Thread.State: WAITING (on object monitor)
at java.lang.Object.wait(Native Method)
- waiting on <0x00000007d189db18> (a java.lang.ref.ReferenceQueue$Lock)
at java.lang.ref.ReferenceQueue.remove(ReferenceQueue.java:135)
- locked <0x00000007d189db18> (a java.lang.ref.ReferenceQueue$Lock)
at java.lang.ref.ReferenceQueue.remove(ReferenceQueue.java:151)
at java.lang.ref.Finalizer$FinalizerThread.run(Finalizer.java:209)
"Reference Handler" daemon prio=10 tid=0x00007fbbb0269000 nid=0x7b14 in Object.wait() [0x00007fbb7fffe000]
java.lang.Thread.State: WAITING (on object monitor)
at java.lang.Object.wait(Native Method)
- waiting on <0x00000007d189d680> (a java.lang.ref.Reference$Lock)
at java.lang.Object.wait(Object.java:503)
at java.lang.ref.Reference$ReferenceHandler.run(Reference.java:133)
- locked <0x00000007d189d680> (a java.lang.ref.Reference$Lock)
"main" prio=10 tid=0x00007fbbb000a800 nid=0x7b05 waiting on condition [0x00007fbbb6a30000]
java.lang.Thread.State: TIMED_WAITING (sleeping)
at java.lang.Thread.sleep(Native Method)
at org.apache.hadoop.hbase.util.Threads.sleepWithoutInterrupt(Threads.java:164)
at org.apache.hadoop.hbase.thrift.TestThriftServer$MySlowHBaseHandler.getTableNames(TestThriftServer.java:161)
at sun.reflect.NativeMethodAccessorImpl.invoke0(Native Method)
at sun.reflect.NativeMethodAccessorImpl.invoke(NativeMethodAccessorImpl.java:57)
at sun.reflect.DelegatingMethodAccessorImpl.invoke(DelegatingMethodAccessorImpl.java:43)
at java.lang.reflect.Method.invoke(Method.java:606)
at org.apache.hadoop.hbase.thrift.HbaseHandlerMetricsProxy.invoke(HbaseHandlerMetricsProxy.java:67)
at com.sun.proxy.$Proxy30.getTableNames(Unknown Source)
at org.apache.hadoop.hbase.thrift.TestThriftServer.createTestTables(TestThriftServer.java:230)
at org.apache.hadoop.hbase.thrift.TestThriftServer.doTestThriftMetrics(TestThriftServer.java:198)
at org.apache.hadoop.hbase.thrift.TestThriftServer.testAll(TestThriftServer.java:120)
at sun.reflect.NativeMethodAccessorImpl.invoke0(Native Method)
at sun.reflect.NativeMethodAccessorImpl.invoke(NativeMethodAccessorImpl.java:57)
at sun.reflect.DelegatingMethodAccessorImpl.invoke(DelegatingMethodAccessorImpl.java:43)
at java.lang.reflect.Method.invoke(Method.java:606)
at org.junit.runners.model.FrameworkMethod$1.runReflectiveCall(FrameworkMethod.java:50)
at org.junit.internal.runners.model.ReflectiveCallable.run(ReflectiveCallable.java:12)
at org.junit.runners.model.FrameworkMethod.invokeExplosively(FrameworkMethod.java:47)
at org.junit.internal.runners.statements.InvokeMethod.evaluate(InvokeMethod.java:17)
at org.junit.runners.ParentRunner.runLeaf(ParentRunner.java:325)
at org.junit.runners.BlockJUnit4ClassRunner.runChild(BlockJUnit4ClassRunner.java:78)
at org.junit.runners.BlockJUnit4ClassRunner.runChild(BlockJUnit4ClassRunner.java:57)
at org.junit.runners.ParentRunner$3.run(ParentRunner.java:290)
at org.junit.runners.ParentRunner$1.schedule(ParentRunner.java:71)
at org.junit.runners.ParentRunner.runChildren(ParentRunner.java:288)
at org.junit.runners.ParentRunner.access$000(ParentRunner.java:58)
at org.junit.runners.ParentRunner$2.evaluate(ParentRunner.java:268)
at org.junit.internal.runners.statements.RunBefores.evaluate(RunBefores.java:26)
at org.junit.internal.runners.statements.RunAfters.evaluate(RunAfters.java:27)
at org.junit.runners.ParentRunner.run(ParentRunner.java:363)
at org.junit.runners.Suite.runChild(Suite.java:128)
at org.junit.runners.Suite.runChild(Suite.java:27)
at org.junit.runners.ParentRunner$3.run(ParentRunner.java:290)
at org.junit.runners.ParentRunner$1.schedule(ParentRunner.java:71)
at org.junit.runners.ParentRunner.runChildren(ParentRunner.java:288)
at org.junit.runners.ParentRunner.access$000(ParentRunner.java:58)
at org.junit.runners.ParentRunner$2.evaluate(ParentRunner.java:268)
at org.junit.runners.ParentRunner.run(ParentRunner.java:363)
at org.junit.runner.JUnitCore.run(JUnitCore.java:137)
at org.junit.runner.JUnitCore.run(JUnitCore.java:115)
at org.apache.maven.surefire.junitcore.JUnitCoreWrapper.createRequestAndRun(JUnitCoreWrapper.java:108)
at org.apache.maven.surefire.junitcore.JUnitCoreWrapper.executeEager(JUnitCoreWrapper.java:78)
at org.apache.maven.surefire.junitcore.JUnitCoreWrapper.execute(JUnitCoreWrapper.java:54)
at org.apache.maven.surefire.junitcore.JUnitCoreProvider.invoke(JUnitCoreProvider.java:144)
at org.apache.maven.surefire.booter.ForkedBooter.invokeProviderInSameClassLoader(ForkedBooter.java:203)
at org.apache.maven.surefire.booter.ForkedBooter.runSuitesInProcess(ForkedBooter.java:155)
at org.apache.maven.surefire.booter.ForkedBooter.main(ForkedBooter.java:103)
"VM Thread" prio=10 tid=0x00007fbbb0265000 nid=0x7b13 runnable
"GC task thread#0 (ParallelGC)" prio=10 tid=0x00007fbbb0020800 nid=0x7b06 runnable
"GC task thread#1 (ParallelGC)" prio=10 tid=0x00007fbbb0022000 nid=0x7b07 runnable
"GC task thread#2 (ParallelGC)" prio=10 tid=0x00007fbbb0024000 nid=0x7b08 runnable
"GC task thread#3 (ParallelGC)" prio=10 tid=0x00007fbbb0026000 nid=0x7b09 runnable
"GC task thread#4 (ParallelGC)" prio=10 tid=0x00007fbbb0028000 nid=0x7b0a runnable
"GC task thread#5 (ParallelGC)" prio=10 tid=0x00007fbbb0029800 nid=0x7b0b runnable
"GC task thread#6 (ParallelGC)" prio=10 tid=0x00007fbbb002b800 nid=0x7b0c runnable
"GC task thread#7 (ParallelGC)" prio=10 tid=0x00007fbbb002d800 nid=0x7b0d runnable
"GC task thread#8 (ParallelGC)" prio=10 tid=0x00007fbbb002f000 nid=0x7b0e runnable
"GC task thread#9 (ParallelGC)" prio=10 tid=0x00007fbbb0031000 nid=0x7b0f runnable
"GC task thread#10 (ParallelGC)" prio=10 tid=0x00007fbbb0033000 nid=0x7b10 runnable
"GC task thread#11 (ParallelGC)" prio=10 tid=0x00007fbbb0035000 nid=0x7b11 runnable
"GC task thread#12 (ParallelGC)" prio=10 tid=0x00007fbbb0036800 nid=0x7b12 runnable
"VM Periodic Task Thread" prio=10 tid=0x00007fbbb02a6000 nid=0x7b1a waiting on condition
JNI global references: 192
+ echo '************ END zombies jstack extract'
************ END zombies jstack extract
+ JIRA_COMMENT='
{color:red}-1 core zombie tests{color}. There are 1 zombie test(s): at org.apache.hadoop.hbase.thrift.TestThriftServer.testAll(TestThriftServer.java:120)'
+ BAD=1
+ jps
+ grep surefirebooter
+ xargs kill -9
+ cut -d ' ' -f 1
POST BUILD TASK : SUCCESS
END OF POST BUILD TASK : 0
Archiving artifacts
Build failed in Jenkins: HBase-1.2 » latest1.8,Hadoop #233
Posted by Apache Jenkins Server <je...@builds.apache.org>.
See <https://builds.apache.org/job/HBase-1.2/jdk=latest1.8,label=Hadoop/233/changes>
Changes:
[stack] HBASE-14572 TestImportExport#testImport94Table can't find its src data
------------------------------------------
[...truncated 46447 lines...]
Java HotSpot(TM) 64-Bit Server VM warning: ignoring option MaxPermSize=256m; support was removed in 8.0
Java HotSpot(TM) 64-Bit Server VM warning: ignoring option MaxPermSize=256m; support was removed in 8.0
Running org.apache.hadoop.hbase.master.cleaner.TestSnapshotFromMaster
Running org.apache.hadoop.hbase.master.TestMasterOperationsForRegionReplicas
Tests run: 1, Failures: 0, Errors: 0, Skipped: 0, Time elapsed: 10.956 sec - in org.apache.hadoop.hbase.master.cleaner.TestLogsCleaner
Java HotSpot(TM) 64-Bit Server VM warning: ignoring option MaxPermSize=256m; support was removed in 8.0
Java HotSpot(TM) 64-Bit Server VM warning: ignoring option MaxPermSize=256m; support was removed in 8.0
Running org.apache.hadoop.hbase.master.TestGetInfoPort
Running org.apache.hadoop.hbase.master.TestWarmupRegion
Tests run: 1, Failures: 0, Errors: 0, Skipped: 0, Time elapsed: 10.614 sec - in org.apache.hadoop.hbase.master.TestGetInfoPort
Java HotSpot(TM) 64-Bit Server VM warning: ignoring option MaxPermSize=256m; support was removed in 8.0
Running org.apache.hadoop.hbase.master.TestMasterStatusServlet
Tests run: 4, Failures: 0, Errors: 0, Skipped: 0, Time elapsed: 1.961 sec - in org.apache.hadoop.hbase.master.TestMasterStatusServlet
Java HotSpot(TM) 64-Bit Server VM warning: ignoring option MaxPermSize=256m; support was removed in 8.0
Java HotSpot(TM) 64-Bit Server VM warning: ignoring option MaxPermSize=256m; support was removed in 8.0
Running org.apache.hadoop.hbase.master.balancer.TestStochasticLoadBalancer
Tests run: 1, Failures: 0, Errors: 0, Skipped: 0, Time elapsed: 20.03 sec - in org.apache.hadoop.hbase.master.TestWarmupRegion
Java HotSpot(TM) 64-Bit Server VM warning: ignoring option MaxPermSize=256m; support was removed in 8.0
Running org.apache.hadoop.hbase.master.balancer.TestStochasticLoadBalancer2
Tests run: 4, Failures: 0, Errors: 0, Skipped: 0, Time elapsed: 29.408 sec - in org.apache.hadoop.hbase.master.cleaner.TestSnapshotFromMaster
Java HotSpot(TM) 64-Bit Server VM warning: ignoring option MaxPermSize=256m; support was removed in 8.0
Java HotSpot(TM) 64-Bit Server VM warning: ignoring option MaxPermSize=256m; support was removed in 8.0
Tests run: 2, Failures: 0, Errors: 0, Skipped: 0, Time elapsed: 25.043 sec - in org.apache.hadoop.hbase.master.TestMasterOperationsForRegionReplicas
Java HotSpot(TM) 64-Bit Server VM warning: ignoring option MaxPermSize=256m; support was removed in 8.0
Running org.apache.hadoop.hbase.master.balancer.TestDefaultLoadBalancer
Running org.apache.hadoop.hbase.master.balancer.TestBaseLoadBalancer
Tests run: 7, Failures: 0, Errors: 0, Skipped: 0, Time elapsed: 0.888 sec - in org.apache.hadoop.hbase.master.balancer.TestBaseLoadBalancer
Java HotSpot(TM) 64-Bit Server VM warning: ignoring option MaxPermSize=256m; support was removed in 8.0
Running org.apache.hadoop.hbase.master.TestMasterFailover
Tests run: 1, Failures: 0, Errors: 0, Skipped: 0, Time elapsed: 3.159 sec - in org.apache.hadoop.hbase.master.balancer.TestDefaultLoadBalancer
Java HotSpot(TM) 64-Bit Server VM warning: ignoring option MaxPermSize=256m; support was removed in 8.0
Running org.apache.hadoop.hbase.master.TestDistributedLogSplitting
Tests run: 18, Failures: 0, Errors: 0, Skipped: 15, Time elapsed: 40.765 sec - in org.apache.hadoop.hbase.master.TestDistributedLogSplitting
Java HotSpot(TM) 64-Bit Server VM warning: ignoring option MaxPermSize=256m; support was removed in 8.0
Running org.apache.hadoop.hbase.master.TestMasterNoCluster
Tests run: 3, Failures: 0, Errors: 0, Skipped: 0, Time elapsed: 12.988 sec - in org.apache.hadoop.hbase.master.TestMasterNoCluster
Java HotSpot(TM) 64-Bit Server VM warning: ignoring option MaxPermSize=256m; support was removed in 8.0
Running org.apache.hadoop.hbase.master.TestGetLastFlushedSequenceId
Tests run: 7, Failures: 0, Errors: 0, Skipped: 0, Time elapsed: 72.481 sec - in org.apache.hadoop.hbase.master.TestMasterFailover
Java HotSpot(TM) 64-Bit Server VM warning: ignoring option MaxPermSize=256m; support was removed in 8.0
Running org.apache.hadoop.hbase.master.TestRollingRestart
Tests run: 1, Failures: 0, Errors: 0, Skipped: 0, Time elapsed: 16.128 sec - in org.apache.hadoop.hbase.master.TestGetLastFlushedSequenceId
Java HotSpot(TM) 64-Bit Server VM warning: ignoring option MaxPermSize=256m; support was removed in 8.0
Tests run: 8, Failures: 0, Errors: 0, Skipped: 0, Time elapsed: 172.855 sec - in org.apache.hadoop.hbase.master.procedure.TestMasterFailoverWithProcedures
Java HotSpot(TM) 64-Bit Server VM warning: ignoring option MaxPermSize=256m; support was removed in 8.0
Running org.apache.hadoop.hbase.master.TestMetaShutdownHandler
Running org.apache.hadoop.hbase.master.TestRegionPlacement2
Tests run: 2, Failures: 0, Errors: 0, Skipped: 0, Time elapsed: 2.299 sec - in org.apache.hadoop.hbase.master.TestRegionPlacement2
Java HotSpot(TM) 64-Bit Server VM warning: ignoring option MaxPermSize=256m; support was removed in 8.0
Tests run: 1, Failures: 0, Errors: 0, Skipped: 0, Time elapsed: 27.421 sec - in org.apache.hadoop.hbase.master.TestRollingRestart
Java HotSpot(TM) 64-Bit Server VM warning: ignoring option MaxPermSize=256m; support was removed in 8.0
Running org.apache.hadoop.hbase.master.TestMaster
Running org.apache.hadoop.hbase.master.TestMasterMetricsWrapper
Tests run: 1, Failures: 0, Errors: 0, Skipped: 0, Time elapsed: 2.503 sec - in org.apache.hadoop.hbase.master.TestMasterMetricsWrapper
Java HotSpot(TM) 64-Bit Server VM warning: ignoring option MaxPermSize=256m; support was removed in 8.0
Running org.apache.hadoop.hbase.master.TestActiveMasterManager
Tests run: 2, Failures: 0, Errors: 0, Skipped: 0, Time elapsed: 1.009 sec - in org.apache.hadoop.hbase.master.TestActiveMasterManager
Java HotSpot(TM) 64-Bit Server VM warning: ignoring option MaxPermSize=256m; support was removed in 8.0
Java HotSpot(TM) 64-Bit Server VM warning: ignoring option MaxPermSize=256m; support was removed in 8.0
Tests run: 1, Failures: 0, Errors: 0, Skipped: 0, Time elapsed: 31.797 sec - in org.apache.hadoop.hbase.master.TestMetaShutdownHandler
Java HotSpot(TM) 64-Bit Server VM warning: ignoring option MaxPermSize=256m; support was removed in 8.0
Running org.apache.hadoop.hbase.master.TestMasterTransitions
Tests run: 3, Failures: 0, Errors: 0, Skipped: 3, Time elapsed: 0.001 sec - in org.apache.hadoop.hbase.master.TestMasterTransitions
Java HotSpot(TM) 64-Bit Server VM warning: ignoring option MaxPermSize=256m; support was removed in 8.0
Tests run: 4, Failures: 0, Errors: 0, Skipped: 0, Time elapsed: 13.239 sec - in org.apache.hadoop.hbase.master.TestMaster
Java HotSpot(TM) 64-Bit Server VM warning: ignoring option MaxPermSize=256m; support was removed in 8.0
Java HotSpot(TM) 64-Bit Server VM warning: ignoring option MaxPermSize=256m; support was removed in 8.0
Running org.apache.hadoop.hbase.master.TestOpenedRegionHandler
Running org.apache.hadoop.hbase.master.TestRestartCluster
Running org.apache.hadoop.hbase.master.normalizer.TestSimpleRegionNormalizerOnCluster
Tests run: 2, Failures: 0, Errors: 0, Skipped: 0, Time elapsed: 15.295 sec - in org.apache.hadoop.hbase.master.TestOpenedRegionHandler
Java HotSpot(TM) 64-Bit Server VM warning: ignoring option MaxPermSize=256m; support was removed in 8.0
Running org.apache.hadoop.hbase.master.handler.TestTableDescriptorModification
Tests run: 2, Failures: 0, Errors: 0, Skipped: 0, Time elapsed: 27.99 sec - in org.apache.hadoop.hbase.master.normalizer.TestSimpleRegionNormalizerOnCluster
Java HotSpot(TM) 64-Bit Server VM warning: ignoring option MaxPermSize=256m; support was removed in 8.0
Running org.apache.hadoop.hbase.master.handler.TestCreateTableHandler
Tests run: 3, Failures: 0, Errors: 0, Skipped: 0, Time elapsed: 44.072 sec - in org.apache.hadoop.hbase.master.TestRestartCluster
Java HotSpot(TM) 64-Bit Server VM warning: ignoring option MaxPermSize=256m; support was removed in 8.0
Running org.apache.hadoop.hbase.master.handler.TestEnableTableHandler
Tests run: 3, Failures: 0, Errors: 0, Skipped: 0, Time elapsed: 23.261 sec - in org.apache.hadoop.hbase.master.handler.TestCreateTableHandler
Java HotSpot(TM) 64-Bit Server VM warning: ignoring option MaxPermSize=256m; support was removed in 8.0
Tests run: 7, Failures: 0, Errors: 0, Skipped: 0, Time elapsed: 36.932 sec - in org.apache.hadoop.hbase.master.handler.TestTableDescriptorModification
Java HotSpot(TM) 64-Bit Server VM warning: ignoring option MaxPermSize=256m; support was removed in 8.0
Running org.apache.hadoop.hbase.master.TestMasterPriorityRpc
Tests run: 3, Failures: 0, Errors: 0, Skipped: 0, Time elapsed: 2.378 sec - in org.apache.hadoop.hbase.master.TestMasterPriorityRpc
Java HotSpot(TM) 64-Bit Server VM warning: ignoring option MaxPermSize=256m; support was removed in 8.0
Running org.apache.hadoop.hbase.master.TestSplitLogManager
Running org.apache.hadoop.hbase.master.handler.TestTableDeleteFamilyHandler
Tests run: 2, Failures: 0, Errors: 0, Skipped: 0, Time elapsed: 15.396 sec - in org.apache.hadoop.hbase.master.handler.TestTableDeleteFamilyHandler
Java HotSpot(TM) 64-Bit Server VM warning: ignoring option MaxPermSize=256m; support was removed in 8.0
Java HotSpot(TM) 64-Bit Server VM warning: ignoring option MaxPermSize=256m; support was removed in 8.0
Tests run: 3, Failures: 0, Errors: 0, Skipped: 0, Time elapsed: 40.591 sec - in org.apache.hadoop.hbase.master.handler.TestEnableTableHandler
Java HotSpot(TM) 64-Bit Server VM warning: ignoring option MaxPermSize=256m; support was removed in 8.0
Running org.apache.hadoop.hbase.master.TestRegionPlacement
Tests run: 2, Failures: 0, Errors: 0, Skipped: 2, Time elapsed: 0.001 sec - in org.apache.hadoop.hbase.master.TestRegionPlacement
Java HotSpot(TM) 64-Bit Server VM warning: ignoring option MaxPermSize=256m; support was removed in 8.0
Running org.apache.hadoop.hbase.master.TestClusterStatusPublisher
Tests run: 3, Failures: 0, Errors: 0, Skipped: 0, Time elapsed: 0.584 sec - in org.apache.hadoop.hbase.master.TestClusterStatusPublisher
Java HotSpot(TM) 64-Bit Server VM warning: ignoring option MaxPermSize=256m; support was removed in 8.0
Running org.apache.hadoop.hbase.master.TestTableLockManager
Running org.apache.hadoop.hbase.master.TestAssignmentManagerOnCluster
Tests run: 4, Failures: 0, Errors: 1, Skipped: 0, Time elapsed: 77.669 sec <<< FAILURE! - in org.apache.hadoop.hbase.master.TestTableLockManager
testReapAllTableLocks(org.apache.hadoop.hbase.master.TestTableLockManager) Time elapsed: 0.068 sec <<< ERROR!
org.apache.hadoop.hbase.exceptions.LockTimeoutException: Timed out acquiring writelock for table:table4for:zero timeout after 0 ms.
at org.apache.hadoop.hbase.master.TableLockManager$ZKTableLockManager$TableLockImpl.acquire(TableLockManager.java:282)
at org.apache.hadoop.hbase.master.TestTableLockManager.testReapAllTableLocks(TestTableLockManager.java:283)
Tests run: 1, Failures: 0, Errors: 0, Skipped: 0, Time elapsed: 77.767 sec - in org.apache.hadoop.hbase.master.TestTableLockManager
Java HotSpot(TM) 64-Bit Server VM warning: ignoring option MaxPermSize=256m; support was removed in 8.0
Running org.apache.hadoop.hbase.master.TestMasterMetrics
Tests run: 2, Failures: 0, Errors: 0, Skipped: 0, Time elapsed: 1.385 sec - in org.apache.hadoop.hbase.master.TestMasterMetrics
Java HotSpot(TM) 64-Bit Server VM warning: ignoring option MaxPermSize=256m; support was removed in 8.0
Running org.apache.hadoop.hbase.master.TestZKLessAMOnCluster
Tests run: 15, Failures: 0, Errors: 0, Skipped: 1, Time elapsed: 133.511 sec - in org.apache.hadoop.hbase.master.TestSplitLogManager
Java HotSpot(TM) 64-Bit Server VM warning: ignoring option MaxPermSize=256m; support was removed in 8.0
Running org.apache.hadoop.hbase.master.TestMasterFileSystem
Tests run: 21, Failures: 0, Errors: 0, Skipped: 0, Time elapsed: 115.673 sec - in org.apache.hadoop.hbase.master.TestAssignmentManagerOnCluster
Java HotSpot(TM) 64-Bit Server VM warning: ignoring option MaxPermSize=256m; support was removed in 8.0
Tests run: 2, Failures: 0, Errors: 0, Skipped: 0, Time elapsed: 1.292 sec - in org.apache.hadoop.hbase.master.TestMasterFileSystem
Java HotSpot(TM) 64-Bit Server VM warning: ignoring option MaxPermSize=256m; support was removed in 8.0
Running org.apache.hadoop.hbase.master.TestAssignmentManager
Tests run: 19, Failures: 0, Errors: 0, Skipped: 0, Time elapsed: 348.339 sec - in org.apache.hadoop.hbase.master.balancer.TestStochasticLoadBalancer
Tests run: 24, Failures: 0, Errors: 0, Skipped: 0, Time elapsed: 10.88 sec - in org.apache.hadoop.hbase.master.TestAssignmentManager
Tests run: 21, Failures: 0, Errors: 0, Skipped: 0, Time elapsed: 110.319 sec - in org.apache.hadoop.hbase.master.TestZKLessAMOnCluster
Tests run: 4, Failures: 0, Errors: 0, Skipped: 0, Time elapsed: 489.702 sec - in org.apache.hadoop.hbase.master.balancer.TestStochasticLoadBalancer2
Results :
Tests in error:
org.apache.hadoop.hbase.procedure.TestZKProcedureControllers.testZKCoordinatorControllerMultipleCohort(org.apache.hadoop.hbase.procedure.TestZKProcedureControllers)
Run 1: TestZKProcedureControllers.testZKCoordinatorControllerMultipleCohort:168->runMockCommitWithOrchestratedControllers:235->verifyCohort:364
procedureMember.submitSubprocedure(<any>);
Wanted 3 times:
-> at org.apache.hadoop.hbase.procedure.TestZKProcedureControllers.verifyCohort(TestZKProcedureControllers.java:364)
But was 5 times. Undesired invocation:
-> at org.apache.hadoop.hbase.procedure.ZKProcedureMemberRpcs.startNewSubprocedure(ZKProcedureMemberRpcs.java:214)
Run 2: TestZKProcedureControllers.testZKCoordinatorControllerMultipleCohort:166->runMockCommitWithOrchestratedControllers:191 » ConnectionLoss
Run 3: TestZKProcedureControllers.testZKCoordinatorControllerMultipleCohort:166->runMockCommitWithOrchestratedControllers:191 » ConnectionLoss
Flaked tests:
org.apache.hadoop.hbase.master.TestTableLockManager.testReapAllTableLocks(org.apache.hadoop.hbase.master.TestTableLockManager)
Run 1: TestTableLockManager.testReapAllTableLocks:283 » LockTimeout Timed out acquiri...
Run 2: PASS
Tests run: 2531, Failures: 0, Errors: 1, Skipped: 53, Flakes: 1
[INFO] ------------------------------------------------------------------------
[INFO] Reactor Summary:
[INFO]
[INFO] Apache HBase ...................................... SUCCESS [2:05.152s]
[INFO] Apache HBase - Checkstyle ......................... SUCCESS [9.010s]
[INFO] Apache HBase - Resource Bundle .................... SUCCESS [0.172s]
[INFO] Apache HBase - Annotations ........................ SUCCESS [0.922s]
[INFO] Apache HBase - Protocol ........................... SUCCESS [15.752s]
[INFO] Apache HBase - Common ............................. SUCCESS [4:31.381s]
[INFO] Apache HBase - Procedure .......................... SUCCESS [1:53.399s]
[INFO] Apache HBase - Client ............................. SUCCESS [3:30.903s]
[INFO] Apache HBase - Hadoop Compatibility ............... SUCCESS [8.186s]
[INFO] Apache HBase - Hadoop Two Compatibility ........... SUCCESS [12.141s]
[INFO] Apache HBase - Prefix Tree ........................ SUCCESS [7.588s]
[INFO] Apache HBase - Server ............................. FAILURE [1:27:36.614s]
[INFO] Apache HBase - Testing Util ....................... SKIPPED
[INFO] Apache HBase - Thrift ............................. SKIPPED
[INFO] Apache HBase - Rest ............................... SKIPPED
[INFO] Apache HBase - Shell .............................. SKIPPED
[INFO] Apache HBase - Integration Tests .................. SKIPPED
[INFO] Apache HBase - Examples ........................... SKIPPED
[INFO] Apache HBase - External Block Cache ............... SKIPPED
[INFO] Apache HBase - Assembly ........................... SKIPPED
[INFO] Apache HBase - Shaded ............................. SKIPPED
[INFO] Apache HBase - Shaded - Client .................... SKIPPED
[INFO] Apache HBase - Shaded - Server .................... SKIPPED
[INFO] ------------------------------------------------------------------------
[INFO] BUILD FAILURE
[INFO] ------------------------------------------------------------------------
[INFO] Total time: 1:41:02.236s
[INFO] Finished at: Wed Oct 07 18:19:57 UTC 2015
[INFO] Final Memory: 97M/698M
[INFO] ------------------------------------------------------------------------
[ERROR] Failed to execute goal org.apache.maven.plugins:maven-surefire-plugin:2.18.1:test (secondPartTestsExecution) on project hbase-server: There are test failures.
[ERROR]
[ERROR] Please refer to <https://builds.apache.org/job/HBase-1.2/jdk=latest1.8,label=Hadoop/ws/hbase-server/target/surefire-reports> for the individual test results.
[ERROR] -> [Help 1]
[ERROR]
[ERROR] To see the full stack trace of the errors, re-run Maven with the -e switch.
[ERROR] Re-run Maven using the -X switch to enable full debug logging.
[ERROR]
[ERROR] For more information about the errors and possible solutions, please read the following articles:
[ERROR] [Help 1] http://cwiki.apache.org/confluence/display/MAVEN/MojoFailureException
[ERROR]
[ERROR] After correcting the problems, you can resume the build with the command
[ERROR] mvn <goals> -rf :hbase-server
Build step 'Invoke top-level Maven targets' marked build as failure
Performing Post build task...
Match found for :.* : True
Logical operation result is TRUE
Running script : ZOMBIE_TESTS_COUNT=`jps | grep surefirebooter | wc -l`
if [[ $ZOMBIE_TESTS_COUNT != 0 ]] ; then
#It seems sometimes the tests are not dying immediately. Let's give them 10s
echo "Suspicious java process found - waiting 10s to see if there are just slow to stop"
sleep 10
ZOMBIE_TESTS_COUNT=`jps | grep surefirebooter | wc -l`
if [[ $ZOMBIE_TESTS_COUNT != 0 ]] ; then
echo "There are $ZOMBIE_TESTS_COUNT zombie tests, they should have been killed by surefire but survived"
echo "************ BEGIN zombies jstack extract"
ZB_STACK=`jps | grep surefirebooter | cut -d ' ' -f 1 | xargs -n 1 jstack | grep ".test" | grep "\.java"`
jps | grep surefirebooter | cut -d ' ' -f 1 | xargs -n 1 jstack
echo "************ END zombies jstack extract"
JIRA_COMMENT="$JIRA_COMMENT
{color:red}-1 core zombie tests{color}. There are ${ZOMBIE_TESTS_COUNT} zombie test(s): ${ZB_STACK}"
BAD=1
jps | grep surefirebooter | cut -d ' ' -f 1 | xargs kill -9
else
echo "We're ok: there is no zombie test, but some tests took some time to stop"
fi
else
echo "We're ok: there is no zombie test"
fi
[Hadoop] $ /bin/bash -xe /tmp/hudson3936073580169384604.sh
++ jps
++ grep surefirebooter
++ wc -l
+ ZOMBIE_TESTS_COUNT=1
+ [[ 1 != 0 ]]
+ echo 'Suspicious java process found - waiting 10s to see if there are just slow to stop'
Suspicious java process found - waiting 10s to see if there are just slow to stop
+ sleep 10
++ jps
++ grep surefirebooter
++ wc -l
+ ZOMBIE_TESTS_COUNT=1
+ [[ 1 != 0 ]]
+ echo 'There are 1 zombie tests, they should have been killed by surefire but survived'
There are 1 zombie tests, they should have been killed by surefire but survived
+ echo '************ BEGIN zombies jstack extract'
************ BEGIN zombies jstack extract
++ jps
++ grep surefirebooter
++ cut -d ' ' -f 1
++ grep .test
++ xargs -n 1 jstack
++ grep '\.java'
+ ZB_STACK=
POST BUILD TASK : FAILURE
END OF POST BUILD TASK : 0
Archiving artifacts
Build failed in Jenkins: HBase-1.2 » latest1.8,Hadoop #232
Posted by Apache Jenkins Server <je...@builds.apache.org>.
See <https://builds.apache.org/job/HBase-1.2/jdk=latest1.8,label=Hadoop/232/changes>
Changes:
[stack] HBASE-14571 Purge TestProcessBasedCluster; it does nothing and then
[stack] HBASE-14502 Purge use of jmock and remove as dependency (Gabor Liptak)
[stack] HBASE-14572 TestImportExport#testImport94Table can't find its src data
------------------------------------------
[...truncated 44201 lines...]
[INFO] Reactor Summary:
[INFO]
[INFO] Apache HBase ...................................... SUCCESS [1:27.207s]
[INFO] Apache HBase - Checkstyle ......................... SUCCESS [7.125s]
[INFO] Apache HBase - Resource Bundle .................... SUCCESS [0.207s]
[INFO] Apache HBase - Annotations ........................ SUCCESS [1.088s]
[INFO] Apache HBase - Protocol ........................... SUCCESS [20.054s]
[INFO] Apache HBase - Common ............................. SUCCESS [3:07.815s]
[INFO] Apache HBase - Procedure .......................... SUCCESS [1:56.917s]
[INFO] Apache HBase - Client ............................. SUCCESS [1:28.809s]
[INFO] Apache HBase - Hadoop Compatibility ............... SUCCESS [9.521s]
[INFO] Apache HBase - Hadoop Two Compatibility ........... SUCCESS [11.777s]
[INFO] Apache HBase - Prefix Tree ........................ SUCCESS [8.807s]
[INFO] Apache HBase - Server ............................. FAILURE [47.401s]
[INFO] Apache HBase - Testing Util ....................... SKIPPED
[INFO] Apache HBase - Thrift ............................. SKIPPED
[INFO] Apache HBase - Rest ............................... SKIPPED
[INFO] Apache HBase - Shell .............................. SKIPPED
[INFO] Apache HBase - Integration Tests .................. SKIPPED
[INFO] Apache HBase - Examples ........................... SKIPPED
[INFO] Apache HBase - External Block Cache ............... SKIPPED
[INFO] Apache HBase - Assembly ........................... SKIPPED
[INFO] Apache HBase - Shaded ............................. SKIPPED
[INFO] Apache HBase - Shaded - Client .................... SKIPPED
[INFO] Apache HBase - Shaded - Server .................... SKIPPED
[INFO] ------------------------------------------------------------------------
[INFO] BUILD FAILURE
[INFO] ------------------------------------------------------------------------
[INFO] Total time: 10:12.821s
[INFO] Finished at: Wed Oct 07 07:29:34 UTC 2015
[INFO] Final Memory: 113M/1539M
[INFO] ------------------------------------------------------------------------
[ERROR] Failed to execute goal org.apache.maven.plugins:maven-compiler-plugin:2.5.1:testCompile (default-testCompile) on project hbase-server: Compilation failure: Compilation failure:
[ERROR] <https://builds.apache.org/job/HBase-1.2/jdk=latest1.8,label=Hadoop/ws/hbase-server/src/test/java/org/apache/hadoop/hbase/mapreduce/TestImportExport.java>:[228,6] error: cannot find symbol
[ERROR] symbol: variable LOG
[ERROR] location: class TestImportExport
[ERROR] <https://builds.apache.org/job/HBase-1.2/jdk=latest1.8,label=Hadoop/ws/hbase-server/src/test/java/org/apache/hadoop/hbase/mapreduce/TestImportExport.java>:[232,4] error: cannot find symbol
[ERROR] -> [Help 1]
[ERROR]
[ERROR] To see the full stack trace of the errors, re-run Maven with the -e switch.
[ERROR] Re-run Maven using the -X switch to enable full debug logging.
[ERROR]
[ERROR] For more information about the errors and possible solutions, please read the following articles:
[ERROR] [Help 1] http://cwiki.apache.org/confluence/display/MAVEN/MojoFailureException
[ERROR]
[ERROR] After correcting the problems, you can resume the build with the command
[ERROR] mvn <goals> -rf :hbase-server
Build step 'Invoke top-level Maven targets' marked build as failure
Performing Post build task...
Match found for :.* : True
Logical operation result is TRUE
Running script : ZOMBIE_TESTS_COUNT=`jps | grep surefirebooter | wc -l`
if [[ $ZOMBIE_TESTS_COUNT != 0 ]] ; then
#It seems sometimes the tests are not dying immediately. Let's give them 10s
echo "Suspicious java process found - waiting 10s to see if there are just slow to stop"
sleep 10
ZOMBIE_TESTS_COUNT=`jps | grep surefirebooter | wc -l`
if [[ $ZOMBIE_TESTS_COUNT != 0 ]] ; then
echo "There are $ZOMBIE_TESTS_COUNT zombie tests, they should have been killed by surefire but survived"
echo "************ BEGIN zombies jstack extract"
ZB_STACK=`jps | grep surefirebooter | cut -d ' ' -f 1 | xargs -n 1 jstack | grep ".test" | grep "\.java"`
jps | grep surefirebooter | cut -d ' ' -f 1 | xargs -n 1 jstack
echo "************ END zombies jstack extract"
JIRA_COMMENT="$JIRA_COMMENT
{color:red}-1 core zombie tests{color}. There are ${ZOMBIE_TESTS_COUNT} zombie test(s): ${ZB_STACK}"
BAD=1
jps | grep surefirebooter | cut -d ' ' -f 1 | xargs kill -9
else
echo "We're ok: there is no zombie test, but some tests took some time to stop"
fi
else
echo "We're ok: there is no zombie test"
fi
[Hadoop] $ /bin/bash -xe /tmp/hudson2835829504872387061.sh
++ jps
++ grep surefirebooter
++ wc -l
+ ZOMBIE_TESTS_COUNT=1
+ [[ 1 != 0 ]]
+ echo 'Suspicious java process found - waiting 10s to see if there are just slow to stop'
Suspicious java process found - waiting 10s to see if there are just slow to stop
+ sleep 10
++ jps
++ grep surefirebooter
++ wc -l
+ ZOMBIE_TESTS_COUNT=1
+ [[ 1 != 0 ]]
+ echo 'There are 1 zombie tests, they should have been killed by surefire but survived'
There are 1 zombie tests, they should have been killed by surefire but survived
+ echo '************ BEGIN zombies jstack extract'
************ BEGIN zombies jstack extract
++ jps
++ grep surefirebooter
++ cut -d ' ' -f 1
++ grep .test
++ xargs -n 1 jstack
++ grep '\.java'
+ ZB_STACK=' at org.apache.hadoop.hbase.io.TestHeapSize.testSizes(TestHeapSize.java:299)'
+ jps
+ grep surefirebooter
+ cut -d ' ' -f 1
+ xargs -n 1 jstack
2015-10-07 07:29:47
Full thread dump Java HotSpot(TM) 64-Bit Server VM (24.72-b04 mixed mode):
"Attach Listener" daemon prio=10 tid=0x00007f9b68001000 nid=0x5146 waiting on condition [0x0000000000000000]
java.lang.Thread.State: RUNNABLE
"process reaper" daemon prio=10 tid=0x00007f9bbcaa6800 nid=0x5145 runnable [0x00007f9b87622000]
java.lang.Thread.State: RUNNABLE
at java.lang.UNIXProcess.waitForProcessExit(Native Method)
at java.lang.UNIXProcess.access$500(UNIXProcess.java:54)
at java.lang.UNIXProcess$4.run(UNIXProcess.java:227)
at java.util.concurrent.ThreadPoolExecutor.runWorker(ThreadPoolExecutor.java:1145)
at java.util.concurrent.ThreadPoolExecutor$Worker.run(ThreadPoolExecutor.java:615)
at java.lang.Thread.run(Thread.java:745)
"Service Thread" daemon prio=10 tid=0x00007f9bbc93e800 nid=0x50cf runnable [0x0000000000000000]
java.lang.Thread.State: RUNNABLE
"C2 CompilerThread1" daemon prio=10 tid=0x00007f9bbc879800 nid=0x50ce runnable [0x0000000000000000]
java.lang.Thread.State: RUNNABLE
"C2 CompilerThread0" daemon prio=10 tid=0x00007f9bbc941000 nid=0x50cd runnable [0x0000000000000000]
java.lang.Thread.State: RUNNABLE
"Signal Dispatcher" daemon prio=10 tid=0x00007f9bbc295000 nid=0x50c5 runnable [0x0000000000000000]
java.lang.Thread.State: RUNNABLE
"Finalizer" daemon prio=10 tid=0x00007f9bbc26c800 nid=0x50c4 in Object.wait() [0x00007f9b8cdda000]
java.lang.Thread.State: WAITING (on object monitor)
at java.lang.Object.wait(Native Method)
- waiting on <0x00000007c5a847f8> (a java.lang.ref.ReferenceQueue$Lock)
at java.lang.ref.ReferenceQueue.remove(ReferenceQueue.java:135)
- locked <0x00000007c5a847f8> (a java.lang.ref.ReferenceQueue$Lock)
at java.lang.ref.ReferenceQueue.remove(ReferenceQueue.java:151)
at java.lang.ref.Finalizer$FinalizerThread.run(Finalizer.java:209)
"Reference Handler" daemon prio=10 tid=0x00007f9bbc26a800 nid=0x50c3 in Object.wait() [0x00007f9b8cedb000]
java.lang.Thread.State: WAITING (on object monitor)
at java.lang.Object.wait(Native Method)
- waiting on <0x00000007c5a84410> (a java.lang.ref.Reference$Lock)
at java.lang.Object.wait(Object.java:503)
at java.lang.ref.Reference$ReferenceHandler.run(Reference.java:133)
- locked <0x00000007c5a84410> (a java.lang.ref.Reference$Lock)
"main" prio=10 tid=0x00007f9bbc00b800 nid=0x50b4 runnable [0x00007f9bc3ad9000]
java.lang.Thread.State: RUNNABLE
at java.io.FileInputStream.readBytes(Native Method)
at java.io.FileInputStream.read(FileInputStream.java:272)
at java.io.BufferedInputStream.read1(BufferedInputStream.java:273)
at java.io.BufferedInputStream.read(BufferedInputStream.java:334)
- locked <0x00000007cd3ad850> (a java.lang.UNIXProcess$ProcessPipeInputStream)
at sun.nio.cs.StreamDecoder.readBytes(StreamDecoder.java:283)
at sun.nio.cs.StreamDecoder.implRead(StreamDecoder.java:325)
at sun.nio.cs.StreamDecoder.read(StreamDecoder.java:177)
- locked <0x00000007cd3b1a40> (a java.io.InputStreamReader)
at java.io.InputStreamReader.read(InputStreamReader.java:184)
at java.io.BufferedReader.fill(BufferedReader.java:154)
at java.io.BufferedReader.readLine(BufferedReader.java:317)
- locked <0x00000007cd3b1a40> (a java.io.InputStreamReader)
at java.io.BufferedReader.readLine(BufferedReader.java:382)
at org.apache.hadoop.hbase.util.JVM.getNumberOfRunningProcess(JVM.java:218)
at org.apache.hadoop.hbase.ResourceCheckerJUnitListener$ProcessCountResourceAnalyzer.getVal(ResourceCheckerJUnitListener.java:122)
at org.apache.hadoop.hbase.ResourceChecker.fill(ResourceChecker.java:115)
at org.apache.hadoop.hbase.ResourceChecker.fillInit(ResourceChecker.java:104)
at org.apache.hadoop.hbase.ResourceChecker.start(ResourceChecker.java:187)
at org.apache.hadoop.hbase.ResourceCheckerJUnitListener.start(ResourceCheckerJUnitListener.java:155)
at org.apache.hadoop.hbase.ResourceCheckerJUnitListener.testStarted(ResourceCheckerJUnitListener.java:178)
at org.junit.runner.notification.SynchronizedRunListener.testStarted(SynchronizedRunListener.java:49)
- locked <0x00000007c8a84e30> (a org.junit.runner.notification.RunNotifier)
at org.junit.runner.notification.RunNotifier$3.notifyListener(RunNotifier.java:121)
at org.junit.runner.notification.RunNotifier$SafeNotifier.run(RunNotifier.java:72)
at org.junit.runner.notification.RunNotifier.fireTestStarted(RunNotifier.java:118)
at org.junit.internal.runners.model.EachTestNotifier.fireTestStarted(EachTestNotifier.java:42)
at org.junit.runners.ParentRunner.runLeaf(ParentRunner.java:323)
at org.junit.runners.BlockJUnit4ClassRunner.runChild(BlockJUnit4ClassRunner.java:78)
at org.junit.runners.BlockJUnit4ClassRunner.runChild(BlockJUnit4ClassRunner.java:57)
at org.junit.runners.ParentRunner$3.run(ParentRunner.java:290)
at org.junit.runners.ParentRunner$1.schedule(ParentRunner.java:71)
at org.junit.runners.ParentRunner.runChildren(ParentRunner.java:288)
at org.junit.runners.ParentRunner.access$000(ParentRunner.java:58)
at org.junit.runners.ParentRunner$2.evaluate(ParentRunner.java:268)
at org.junit.internal.runners.statements.RunBefores.evaluate(RunBefores.java:26)
at org.junit.runners.ParentRunner.run(ParentRunner.java:363)
at org.junit.runners.Suite.runChild(Suite.java:128)
at org.junit.runners.Suite.runChild(Suite.java:27)
at org.junit.runners.ParentRunner$3.run(ParentRunner.java:290)
at org.junit.runners.ParentRunner$1.schedule(ParentRunner.java:71)
at org.junit.runners.ParentRunner.runChildren(ParentRunner.java:288)
at org.junit.runners.ParentRunner.access$000(ParentRunner.java:58)
at org.junit.runners.ParentRunner$2.evaluate(ParentRunner.java:268)
at org.junit.runners.ParentRunner.run(ParentRunner.java:363)
at org.junit.runner.JUnitCore.run(JUnitCore.java:137)
at org.junit.runner.JUnitCore.run(JUnitCore.java:115)
at org.apache.maven.surefire.junitcore.JUnitCoreWrapper.createRequestAndRun(JUnitCoreWrapper.java:108)
at org.apache.maven.surefire.junitcore.JUnitCoreWrapper.executeEager(JUnitCoreWrapper.java:78)
at org.apache.maven.surefire.junitcore.JUnitCoreWrapper.execute(JUnitCoreWrapper.java:54)
at org.apache.maven.surefire.junitcore.JUnitCoreProvider.invoke(JUnitCoreProvider.java:144)
at org.apache.maven.surefire.booter.ForkedBooter.invokeProviderInSameClassLoader(ForkedBooter.java:203)
at org.apache.maven.surefire.booter.ForkedBooter.runSuitesInProcess(ForkedBooter.java:155)
at org.apache.maven.surefire.booter.ForkedBooter.main(ForkedBooter.java:103)
"VM Thread" prio=10 tid=0x00007f9bbc266000 nid=0x50c2 runnable
"GC task thread#0 (ParallelGC)" prio=10 tid=0x00007f9bbc021800 nid=0x50b5 runnable
"GC task thread#1 (ParallelGC)" prio=10 tid=0x00007f9bbc023800 nid=0x50b6 runnable
"GC task thread#2 (ParallelGC)" prio=10 tid=0x00007f9bbc025800 nid=0x50b7 runnable
"GC task thread#3 (ParallelGC)" prio=10 tid=0x00007f9bbc027000 nid=0x50b8 runnable
"GC task thread#4 (ParallelGC)" prio=10 tid=0x00007f9bbc029000 nid=0x50b9 runnable
"GC task thread#5 (ParallelGC)" prio=10 tid=0x00007f9bbc02b000 nid=0x50ba runnable
"GC task thread#6 (ParallelGC)" prio=10 tid=0x00007f9bbc02c800 nid=0x50bb runnable
"GC task thread#7 (ParallelGC)" prio=10 tid=0x00007f9bbc02e800 nid=0x50bc runnable
"GC task thread#8 (ParallelGC)" prio=10 tid=0x00007f9bbc030800 nid=0x50bd runnable
"GC task thread#9 (ParallelGC)" prio=10 tid=0x00007f9bbc032800 nid=0x50be runnable
"GC task thread#10 (ParallelGC)" prio=10 tid=0x00007f9bbc034000 nid=0x50bf runnable
"GC task thread#11 (ParallelGC)" prio=10 tid=0x00007f9bbc036000 nid=0x50c0 runnable
"GC task thread#12 (ParallelGC)" prio=10 tid=0x00007f9bbc038000 nid=0x50c1 runnable
"VM Periodic Task Thread" prio=10 tid=0x00007f9bbc8b0000 nid=0x50d0 waiting on condition
JNI global references: 183
+ echo '************ END zombies jstack extract'
************ END zombies jstack extract
+ JIRA_COMMENT='
{color:red}-1 core zombie tests{color}. There are 1 zombie test(s): at org.apache.hadoop.hbase.io.TestHeapSize.testSizes(TestHeapSize.java:299)'
+ BAD=1
+ cut -d ' ' -f 1
+ xargs kill -9
+ jps
+ grep surefirebooter
POST BUILD TASK : SUCCESS
END OF POST BUILD TASK : 0
Archiving artifacts
Build failed in Jenkins: HBase-1.2 » latest1.8,Hadoop #231
Posted by Apache Jenkins Server <je...@builds.apache.org>.
See <https://builds.apache.org/job/HBase-1.2/jdk=latest1.8,label=Hadoop/231/changes>
Changes:
[stack] HBASE-14436 HTableDescriptor#addCoprocessor will always make
------------------------------------------
[...truncated 53254 lines...]
java.lang.Thread.State: WAITING (on object monitor)
at java.lang.Object.wait(Native Method)
- waiting on <0x00000007f6e805c8> (a java.lang.ref.ReferenceQueue$Lock)
at java.lang.ref.ReferenceQueue.remove(ReferenceQueue.java:135)
- locked <0x00000007f6e805c8> (a java.lang.ref.ReferenceQueue$Lock)
at java.lang.ref.ReferenceQueue.remove(ReferenceQueue.java:151)
at java.lang.ref.Finalizer$FinalizerThread.run(Finalizer.java:209)
"Reference Handler" daemon prio=10 tid=0x00007fd158269000 nid=0x3a4c in Object.wait() [0x00007fd12a6e5000]
java.lang.Thread.State: WAITING (on object monitor)
at java.lang.Object.wait(Native Method)
- waiting on <0x00000007f6e802f0> (a java.lang.ref.Reference$Lock)
at java.lang.Object.wait(Object.java:503)
at java.lang.ref.Reference$ReferenceHandler.run(Reference.java:133)
- locked <0x00000007f6e802f0> (a java.lang.ref.Reference$Lock)
"main" prio=10 tid=0x00007fd15800a800 nid=0x3a1d waiting on condition [0x00007fd16123e000]
java.lang.Thread.State: TIMED_WAITING (sleeping)
at java.lang.Thread.sleep(Native Method)
at org.apache.hadoop.hbase.client.HBaseAdmin$ProcedureFuture.waitProcedureResult(HBaseAdmin.java:4244)
at org.apache.hadoop.hbase.client.HBaseAdmin$ProcedureFuture.get(HBaseAdmin.java:4173)
at org.apache.hadoop.hbase.client.HBaseAdmin.disableTable(HBaseAdmin.java:1219)
at org.apache.hadoop.hbase.client.HBaseAdmin.disableTable(HBaseAdmin.java:1240)
at sun.reflect.GeneratedMethodAccessor68.invoke(Unknown Source)
at sun.reflect.DelegatingMethodAccessorImpl.invoke(DelegatingMethodAccessorImpl.java:43)
at java.lang.reflect.Method.invoke(Method.java:606)
at org.jruby.javasupport.JavaMethod.invokeDirectWithExceptionHandling(JavaMethod.java:450)
at org.jruby.javasupport.JavaMethod.invokeDirect(JavaMethod.java:311)
at org.jruby.java.invokers.InstanceMethodInvoker.call(InstanceMethodInvoker.java:59)
at org.jruby.runtime.callsite.CachingCallSite.call(CachingCallSite.java:167)
at org.jruby.ast.CallOneArgNode.interpret(CallOneArgNode.java:57)
at org.jruby.ast.NewlineNode.interpret(NewlineNode.java:104)
at org.jruby.ast.BlockNode.interpret(BlockNode.java:71)
at org.jruby.evaluator.ASTInterpreter.INTERPRET_METHOD(ASTInterpreter.java:74)
at org.jruby.internal.runtime.methods.InterpretedMethod.call(InterpretedMethod.java:190)
at org.jruby.runtime.callsite.CachingCallSite.cacheAndCall(CachingCallSite.java:312)
at org.jruby.runtime.callsite.CachingCallSite.call(CachingCallSite.java:169)
at org.jruby.ast.CallOneArgNode.interpret(CallOneArgNode.java:57)
at org.jruby.ast.NewlineNode.interpret(NewlineNode.java:104)
at org.jruby.ast.BlockNode.interpret(BlockNode.java:71)
at org.jruby.evaluator.ASTInterpreter.INTERPRET_BLOCK(ASTInterpreter.java:111)
at org.jruby.runtime.InterpretedBlock.evalBlockBody(InterpretedBlock.java:374)
at org.jruby.runtime.InterpretedBlock.yield(InterpretedBlock.java:328)
at org.jruby.runtime.BlockBody.call(BlockBody.java:73)
at org.jruby.runtime.Block.call(Block.java:89)
at org.jruby.RubyProc.call(RubyProc.java:270)
at org.jruby.internal.runtime.methods.ProcMethod.call(ProcMethod.java:64)
at org.jruby.internal.runtime.methods.DynamicMethod.call(DynamicMethod.java:203)
at org.jruby.RubyClass.finvoke(RubyClass.java:552)
at org.jruby.RubyBasicObject.send(RubyBasicObject.java:2777)
at org.jruby.RubyKernel.send(RubyKernel.java:2105)
at org.jruby.RubyKernel$s$send.call(RubyKernel$s$send.gen:65535)
at org.jruby.internal.runtime.methods.JavaMethod$JavaMethodZeroOrOneOrNBlock.call(JavaMethod.java:266)
at org.jruby.runtime.callsite.CachingCallSite.call(CachingCallSite.java:167)
at org.jruby.ast.FCallOneArgNode.interpret(FCallOneArgNode.java:36)
at org.jruby.ast.NewlineNode.interpret(NewlineNode.java:104)
at org.jruby.ast.BlockNode.interpret(BlockNode.java:71)
at org.jruby.ast.RescueNode.executeBody(RescueNode.java:216)
at org.jruby.ast.RescueNode.interpretWithJavaExceptions(RescueNode.java:120)
at org.jruby.ast.RescueNode.interpret(RescueNode.java:110)
at org.jruby.ast.EnsureNode.interpret(EnsureNode.java:96)
at org.jruby.ast.BeginNode.interpret(BeginNode.java:83)
at org.jruby.ast.NewlineNode.interpret(NewlineNode.java:104)
at org.jruby.ast.BlockNode.interpret(BlockNode.java:71)
at org.jruby.evaluator.ASTInterpreter.INTERPRET_METHOD(ASTInterpreter.java:74)
at org.jruby.internal.runtime.methods.InterpretedMethod.call(InterpretedMethod.java:212)
at org.jruby.runtime.callsite.CachingCallSite.callBlock(CachingCallSite.java:176)
at org.jruby.runtime.callsite.CachingCallSite.call(CachingCallSite.java:182)
at org.jruby.ast.CallOneArgBlockPassNode.interpret(CallOneArgBlockPassNode.java:60)
at org.jruby.ast.NewlineNode.interpret(NewlineNode.java:104)
at org.jruby.evaluator.ASTInterpreter.INTERPRET_BLOCK(ASTInterpreter.java:111)
at org.jruby.runtime.InterpretedBlock.evalBlockBody(InterpretedBlock.java:374)
at org.jruby.runtime.InterpretedBlock.yield(InterpretedBlock.java:347)
at org.jruby.runtime.InterpretedBlock.yield(InterpretedBlock.java:304)
at org.jruby.runtime.Block.yield(Block.java:130)
at org.jruby.RubyArray.eachCommon(RubyArray.java:1613)
at org.jruby.RubyArray.each(RubyArray.java:1620)
at org.jruby.RubyArray$i$0$0$each.call(RubyArray$i$0$0$each.gen:65535)
at org.jruby.runtime.callsite.CachingCallSite.callBlock(CachingCallSite.java:142)
at org.jruby.runtime.callsite.CachingCallSite.callIter(CachingCallSite.java:153)
at org.jruby.ast.CallNoArgBlockNode.interpret(CallNoArgBlockNode.java:64)
at org.jruby.ast.NewlineNode.interpret(NewlineNode.java:104)
at org.jruby.ast.BlockNode.interpret(BlockNode.java:71)
at org.jruby.evaluator.ASTInterpreter.INTERPRET_METHOD(ASTInterpreter.java:74)
at org.jruby.internal.runtime.methods.InterpretedMethod.call(InterpretedMethod.java:212)
at org.jruby.runtime.callsite.CachingCallSite.cacheAndCall(CachingCallSite.java:322)
at org.jruby.runtime.callsite.CachingCallSite.callBlock(CachingCallSite.java:178)
at org.jruby.runtime.callsite.CachingCallSite.call(CachingCallSite.java:182)
at org.jruby.ast.CallOneArgBlockPassNode.interpret(CallOneArgBlockPassNode.java:60)
at org.jruby.ast.NewlineNode.interpret(NewlineNode.java:104)
at org.jruby.evaluator.ASTInterpreter.INTERPRET_BLOCK(ASTInterpreter.java:111)
at org.jruby.runtime.InterpretedBlock.evalBlockBody(InterpretedBlock.java:374)
at org.jruby.runtime.InterpretedBlock.yield(InterpretedBlock.java:347)
at org.jruby.runtime.InterpretedBlock.yield(InterpretedBlock.java:304)
at org.jruby.runtime.Block.yield(Block.java:130)
at org.jruby.RubyArray.eachCommon(RubyArray.java:1613)
at org.jruby.RubyArray.each(RubyArray.java:1620)
at org.jruby.RubyArray$i$0$0$each.call(RubyArray$i$0$0$each.gen:65535)
at org.jruby.runtime.callsite.CachingCallSite.cacheAndCall(CachingCallSite.java:302)
at org.jruby.runtime.callsite.CachingCallSite.callBlock(CachingCallSite.java:144)
at org.jruby.runtime.callsite.CachingCallSite.callIter(CachingCallSite.java:153)
at org.jruby.ast.CallNoArgBlockNode.interpret(CallNoArgBlockNode.java:64)
at org.jruby.ast.NewlineNode.interpret(NewlineNode.java:104)
at org.jruby.ast.BlockNode.interpret(BlockNode.java:71)
at org.jruby.evaluator.ASTInterpreter.INTERPRET_METHOD(ASTInterpreter.java:74)
at org.jruby.internal.runtime.methods.InterpretedMethod.call(InterpretedMethod.java:212)
at org.jruby.runtime.callsite.CachingCallSite.cacheAndCall(CachingCallSite.java:322)
at org.jruby.runtime.callsite.CachingCallSite.callBlock(CachingCallSite.java:178)
at org.jruby.runtime.callsite.CachingCallSite.callIter(CachingCallSite.java:187)
at org.jruby.ast.CallOneArgBlockNode.interpret(CallOneArgBlockNode.java:60)
at org.jruby.ast.NewlineNode.interpret(NewlineNode.java:104)
at org.jruby.ast.BlockNode.interpret(BlockNode.java:71)
at org.jruby.evaluator.ASTInterpreter.INTERPRET_METHOD(ASTInterpreter.java:74)
at org.jruby.internal.runtime.methods.InterpretedMethod.call(InterpretedMethod.java:147)
at org.jruby.runtime.callsite.CachingCallSite.cacheAndCall(CachingCallSite.java:292)
at org.jruby.runtime.callsite.CachingCallSite.call(CachingCallSite.java:135)
at org.jruby.ast.CallNoArgNode.interpret(CallNoArgNode.java:63)
at org.jruby.ast.ReturnNode.interpret(ReturnNode.java:92)
at org.jruby.ast.NewlineNode.interpret(NewlineNode.java:104)
at org.jruby.evaluator.ASTInterpreter.INTERPRET_METHOD(ASTInterpreter.java:74)
at org.jruby.internal.runtime.methods.InterpretedMethod.call(InterpretedMethod.java:147)
at org.jruby.runtime.callsite.CachingCallSite.cacheAndCall(CachingCallSite.java:292)
at org.jruby.runtime.callsite.CachingCallSite.call(CachingCallSite.java:135)
at org.jruby.ast.VCallNode.interpret(VCallNode.java:86)
at org.jruby.ast.ReturnNode.interpret(ReturnNode.java:92)
at org.jruby.ast.NewlineNode.interpret(NewlineNode.java:104)
at org.jruby.ast.BlockNode.interpret(BlockNode.java:71)
at org.jruby.evaluator.ASTInterpreter.INTERPRET_METHOD(ASTInterpreter.java:74)
at org.jruby.internal.runtime.methods.InterpretedMethod.call(InterpretedMethod.java:147)
at org.jruby.runtime.callsite.CachingCallSite.cacheAndCall(CachingCallSite.java:292)
at org.jruby.runtime.callsite.CachingCallSite.call(CachingCallSite.java:135)
at org.jruby.ast.CallNoArgNode.interpret(CallNoArgNode.java:63)
at org.jruby.ast.ReturnNode.interpret(ReturnNode.java:92)
at org.jruby.ast.NewlineNode.interpret(NewlineNode.java:104)
at org.jruby.evaluator.ASTInterpreter.INTERPRET_METHOD(ASTInterpreter.java:74)
at org.jruby.internal.runtime.methods.InterpretedMethod.call(InterpretedMethod.java:233)
at org.jruby.runtime.callsite.CachingCallSite.cacheAndCall(CachingCallSite.java:332)
at org.jruby.runtime.callsite.CachingCallSite.call(CachingCallSite.java:203)
at org.jruby.ast.CallTwoArgNode.interpret(CallTwoArgNode.java:59)
at org.jruby.ast.CallNoArgNode.interpret(CallNoArgNode.java:63)
at org.jruby.ast.NewlineNode.interpret(NewlineNode.java:104)
at org.jruby.ast.BlockNode.interpret(BlockNode.java:71)
at org.jruby.evaluator.ASTInterpreter.INTERPRET_METHOD(ASTInterpreter.java:74)
at org.jruby.internal.runtime.methods.InterpretedMethod.call(InterpretedMethod.java:147)
at org.jruby.runtime.callsite.CachingCallSite.cacheAndCall(CachingCallSite.java:292)
at org.jruby.runtime.callsite.CachingCallSite.call(CachingCallSite.java:135)
at org.jruby.ast.CallNoArgNode.interpret(CallNoArgNode.java:63)
at org.jruby.ast.NewlineNode.interpret(NewlineNode.java:104)
at org.jruby.ast.BlockNode.interpret(BlockNode.java:71)
at org.jruby.evaluator.ASTInterpreter.INTERPRET_METHOD(ASTInterpreter.java:74)
at org.jruby.internal.runtime.methods.InterpretedMethod.call(InterpretedMethod.java:276)
at org.jruby.runtime.callsite.CachingCallSite.cacheAndCall(CachingCallSite.java:352)
at org.jruby.runtime.callsite.CachingCallSite.call(CachingCallSite.java:237)
at org.jruby.ast.CallThreeArgNode.interpret(CallThreeArgNode.java:61)
at org.jruby.ast.NewlineNode.interpret(NewlineNode.java:104)
at org.jruby.ast.NotNode.interpret(NotNode.java:85)
at org.jruby.ast.IfNode.interpret(IfNode.java:111)
at org.jruby.ast.NewlineNode.interpret(NewlineNode.java:104)
at org.jruby.ast.BlockNode.interpret(BlockNode.java:71)
at org.jruby.ast.RootNode.interpret(RootNode.java:129)
at org.jruby.evaluator.ASTInterpreter.INTERPRET_ROOT(ASTInterpreter.java:119)
at org.jruby.Ruby.runInterpreter(Ruby.java:724)
at org.jruby.Ruby.runInterpreter(Ruby.java:732)
at org.jruby.embed.internal.EmbedEvalUnitImpl.run(EmbedEvalUnitImpl.java:124)
at org.jruby.embed.ScriptingContainer.runUnit(ScriptingContainer.java:1263)
at org.jruby.embed.ScriptingContainer.runScriptlet(ScriptingContainer.java:1308)
at org.apache.hadoop.hbase.client.TestShell.testRunShellTests(TestShell.java:35)
at sun.reflect.NativeMethodAccessorImpl.invoke0(Native Method)
at sun.reflect.NativeMethodAccessorImpl.invoke(NativeMethodAccessorImpl.java:57)
at sun.reflect.DelegatingMethodAccessorImpl.invoke(DelegatingMethodAccessorImpl.java:43)
at java.lang.reflect.Method.invoke(Method.java:606)
at org.junit.runners.model.FrameworkMethod$1.runReflectiveCall(FrameworkMethod.java:50)
at org.junit.internal.runners.model.ReflectiveCallable.run(ReflectiveCallable.java:12)
at org.junit.runners.model.FrameworkMethod.invokeExplosively(FrameworkMethod.java:47)
at org.junit.internal.runners.statements.InvokeMethod.evaluate(InvokeMethod.java:17)
at org.junit.runners.ParentRunner.runLeaf(ParentRunner.java:325)
at org.junit.runners.BlockJUnit4ClassRunner.runChild(BlockJUnit4ClassRunner.java:78)
at org.junit.runners.BlockJUnit4ClassRunner.runChild(BlockJUnit4ClassRunner.java:57)
at org.junit.runners.ParentRunner$3.run(ParentRunner.java:290)
at org.junit.runners.ParentRunner$1.schedule(ParentRunner.java:71)
at org.junit.runners.ParentRunner.runChildren(ParentRunner.java:288)
at org.junit.runners.ParentRunner.access$000(ParentRunner.java:58)
at org.junit.runners.ParentRunner$2.evaluate(ParentRunner.java:268)
at org.junit.internal.runners.statements.RunBefores.evaluate(RunBefores.java:26)
at org.junit.internal.runners.statements.RunAfters.evaluate(RunAfters.java:27)
at org.junit.runners.ParentRunner.run(ParentRunner.java:363)
at org.junit.runners.Suite.runChild(Suite.java:128)
at org.junit.runners.Suite.runChild(Suite.java:27)
at org.junit.runners.ParentRunner$3.run(ParentRunner.java:290)
at org.junit.runners.ParentRunner$1.schedule(ParentRunner.java:71)
at org.junit.runners.ParentRunner.runChildren(ParentRunner.java:288)
at org.junit.runners.ParentRunner.access$000(ParentRunner.java:58)
at org.junit.runners.ParentRunner$2.evaluate(ParentRunner.java:268)
at org.junit.runners.ParentRunner.run(ParentRunner.java:363)
at org.junit.runner.JUnitCore.run(JUnitCore.java:137)
at org.junit.runner.JUnitCore.run(JUnitCore.java:115)
at org.apache.maven.surefire.junitcore.JUnitCoreWrapper.createRequestAndRun(JUnitCoreWrapper.java:108)
at org.apache.maven.surefire.junitcore.JUnitCoreWrapper.executeEager(JUnitCoreWrapper.java:78)
at org.apache.maven.surefire.junitcore.JUnitCoreWrapper.execute(JUnitCoreWrapper.java:54)
at org.apache.maven.surefire.junitcore.JUnitCoreProvider.invoke(JUnitCoreProvider.java:144)
at org.apache.maven.surefire.booter.ForkedBooter.invokeProviderInSameClassLoader(ForkedBooter.java:203)
at org.apache.maven.surefire.booter.ForkedBooter.runSuitesInProcess(ForkedBooter.java:155)
at org.apache.maven.surefire.booter.ForkedBooter.main(ForkedBooter.java:103)
"VM Thread" prio=10 tid=0x00007fd158265000 nid=0x3a4a runnable
"GC task thread#0 (ParallelGC)" prio=10 tid=0x00007fd158020800 nid=0x3a1f runnable
"GC task thread#1 (ParallelGC)" prio=10 tid=0x00007fd158022000 nid=0x3a21 runnable
"GC task thread#2 (ParallelGC)" prio=10 tid=0x00007fd158024000 nid=0x3a36 runnable
"GC task thread#3 (ParallelGC)" prio=10 tid=0x00007fd158026000 nid=0x3a39 runnable
"GC task thread#4 (ParallelGC)" prio=10 tid=0x00007fd158028000 nid=0x3a3c runnable
"GC task thread#5 (ParallelGC)" prio=10 tid=0x00007fd158029800 nid=0x3a3f runnable
"GC task thread#6 (ParallelGC)" prio=10 tid=0x00007fd15802b800 nid=0x3a41 runnable
"GC task thread#7 (ParallelGC)" prio=10 tid=0x00007fd15802d800 nid=0x3a43 runnable
"GC task thread#8 (ParallelGC)" prio=10 tid=0x00007fd15802f000 nid=0x3a45 runnable
"GC task thread#9 (ParallelGC)" prio=10 tid=0x00007fd158031000 nid=0x3a46 runnable
"GC task thread#10 (ParallelGC)" prio=10 tid=0x00007fd158033000 nid=0x3a47 runnable
"GC task thread#11 (ParallelGC)" prio=10 tid=0x00007fd158035000 nid=0x3a48 runnable
"GC task thread#12 (ParallelGC)" prio=10 tid=0x00007fd158036800 nid=0x3a49 runnable
"VM Periodic Task Thread" prio=10 tid=0x00007fd15829e000 nid=0x3a5a waiting on condition
JNI global references: 320
+ echo '************ END zombies jstack extract'
************ END zombies jstack extract
+ JIRA_COMMENT='
{color:red}-1 core zombie tests{color}. There are 1 zombie test(s): at org.apache.hadoop.hbase.client.TestShell.testRunShellTests(TestShell.java:35)'
+ BAD=1
+ jps
+ cut -d ' ' -f 1
+ xargs kill -9
+ grep surefirebooter
POST BUILD TASK : SUCCESS
END OF POST BUILD TASK : 0
Archiving artifacts
Build failed in Jenkins: HBase-1.2 » latest1.8,Hadoop #230
Posted by Apache Jenkins Server <je...@builds.apache.org>.
See <https://builds.apache.org/job/HBase-1.2/jdk=latest1.8,label=Hadoop/230/changes>
Changes:
[stack] HBASE-14563 Disable zombie TestHFileOutputFormat2
------------------------------------------
[...truncated 49609 lines...]
at java.util.concurrent.ThreadPoolExecutor$Worker.run(ThreadPoolExecutor.java:617)
at java.lang.Thread.run(Thread.java:744)
"org.apache.hadoop.hdfs.server.blockmanagement.PendingReplicationBlocks$PendingReplicationMonitor@655ef322" #44 daemon prio=5 os_prio=0 tid=0x00007fed7926e800 nid=0x7171 waiting on condition [0x00007fed56287000]
java.lang.Thread.State: TIMED_WAITING (sleeping)
at java.lang.Thread.sleep(Native Method)
at org.apache.hadoop.hdfs.server.blockmanagement.PendingReplicationBlocks$PendingReplicationMonitor.run(PendingReplicationBlocks.java:220)
at java.lang.Thread.run(Thread.java:744)
"org.apache.hadoop.util.JvmPauseMonitor$Monitor@333dd51e" #40 daemon prio=5 os_prio=0 tid=0x00007fed7926b000 nid=0x716a waiting on condition [0x00007fed56388000]
java.lang.Thread.State: TIMED_WAITING (sleeping)
at java.lang.Thread.sleep(Native Method)
at org.apache.hadoop.util.JvmPauseMonitor$Monitor.run(JvmPauseMonitor.java:182)
at java.lang.Thread.run(Thread.java:744)
"IPC Server idle connection scanner for port 10000" #38 daemon prio=5 os_prio=0 tid=0x00007fed79246800 nid=0x7169 in Object.wait() [0x00007fed56489000]
java.lang.Thread.State: TIMED_WAITING (on object monitor)
at java.lang.Object.wait(Native Method)
at java.util.TimerThread.mainLoop(Timer.java:552)
- locked <0x0000000081f8f2a0> (a java.util.TaskQueue)
at java.util.TimerThread.run(Timer.java:505)
"Socket Reader #1 for port 10000" #37 prio=5 os_prio=0 tid=0x00007fed79213000 nid=0x7168 runnable [0x00007fed5658a000]
java.lang.Thread.State: RUNNABLE
at sun.nio.ch.EPollArrayWrapper.epollWait(Native Method)
at sun.nio.ch.EPollArrayWrapper.poll(EPollArrayWrapper.java:269)
at sun.nio.ch.EPollSelectorImpl.doSelect(EPollSelectorImpl.java:79)
at sun.nio.ch.SelectorImpl.lockAndDoSelect(SelectorImpl.java:86)
- locked <0x0000000081f90550> (a sun.nio.ch.Util$2)
- locked <0x0000000081f90540> (a java.util.Collections$UnmodifiableSet)
- locked <0x0000000081f90428> (a sun.nio.ch.EPollSelectorImpl)
at sun.nio.ch.SelectorImpl.select(SelectorImpl.java:97)
at sun.nio.ch.SelectorImpl.select(SelectorImpl.java:101)
at org.apache.hadoop.ipc.Server$Listener$Reader.doRunLoop(Server.java:701)
- locked <0x0000000081f90188> (a org.apache.hadoop.ipc.Server$Listener$Reader)
at org.apache.hadoop.ipc.Server$Listener$Reader.run(Server.java:680)
"Timer-0" #33 daemon prio=5 os_prio=0 tid=0x00007fed79065000 nid=0x7167 in Object.wait() [0x00007fed56a8b000]
java.lang.Thread.State: TIMED_WAITING (on object monitor)
at java.lang.Object.wait(Native Method)
at java.util.TimerThread.mainLoop(Timer.java:552)
- locked <0x0000000081cc43d8> (a java.util.TaskQueue)
at java.util.TimerThread.run(Timer.java:505)
"1534755892@qtp-1916700921-1 - Acceptor0 SelectChannelConnector@localhost:10001" #32 daemon prio=5 os_prio=0 tid=0x00007fed79058000 nid=0x7166 runnable [0x00007fed56b8c000]
java.lang.Thread.State: RUNNABLE
at sun.nio.ch.EPollArrayWrapper.epollWait(Native Method)
at sun.nio.ch.EPollArrayWrapper.poll(EPollArrayWrapper.java:269)
at sun.nio.ch.EPollSelectorImpl.doSelect(EPollSelectorImpl.java:79)
at sun.nio.ch.SelectorImpl.lockAndDoSelect(SelectorImpl.java:86)
- locked <0x0000000081cc44b8> (a sun.nio.ch.Util$2)
- locked <0x0000000081cc44c8> (a java.util.Collections$UnmodifiableSet)
- locked <0x0000000081cc4470> (a sun.nio.ch.EPollSelectorImpl)
at sun.nio.ch.SelectorImpl.select(SelectorImpl.java:97)
at org.mortbay.io.nio.SelectorManager$SelectSet.doSelect(SelectorManager.java:498)
at org.mortbay.io.nio.SelectorManager.doSelect(SelectorManager.java:192)
at org.mortbay.jetty.nio.SelectChannelConnector.accept(SelectChannelConnector.java:124)
at org.mortbay.jetty.AbstractConnector$Acceptor.run(AbstractConnector.java:708)
at org.mortbay.thread.QueuedThreadPool$PoolThread.run(QueuedThreadPool.java:582)
"194481424@qtp-1916700921-0" #31 daemon prio=5 os_prio=0 tid=0x00007fed79057000 nid=0x7165 in Object.wait() [0x00007fed56c8d000]
java.lang.Thread.State: TIMED_WAITING (on object monitor)
at java.lang.Object.wait(Native Method)
at org.mortbay.thread.QueuedThreadPool$PoolThread.run(QueuedThreadPool.java:626)
- locked <0x00000000804065e8> (a org.mortbay.thread.QueuedThreadPool$PoolThread)
"pool-2-thread-1" #30 prio=5 os_prio=0 tid=0x00007fed78fd9000 nid=0x7164 waiting on condition [0x00007fed56d8e000]
java.lang.Thread.State: TIMED_WAITING (parking)
at sun.misc.Unsafe.park(Native Method)
- parking to wait for <0x0000000080407570> (a java.util.concurrent.locks.AbstractQueuedSynchronizer$ConditionObject)
at java.util.concurrent.locks.LockSupport.parkNanos(LockSupport.java:215)
at java.util.concurrent.locks.AbstractQueuedSynchronizer$ConditionObject.awaitNanos(AbstractQueuedSynchronizer.java:2078)
at java.util.concurrent.ScheduledThreadPoolExecutor$DelayedWorkQueue.take(ScheduledThreadPoolExecutor.java:1093)
at java.util.concurrent.ScheduledThreadPoolExecutor$DelayedWorkQueue.take(ScheduledThreadPoolExecutor.java:809)
at java.util.concurrent.ThreadPoolExecutor.getTask(ThreadPoolExecutor.java:1067)
at java.util.concurrent.ThreadPoolExecutor.runWorker(ThreadPoolExecutor.java:1127)
at java.util.concurrent.ThreadPoolExecutor$Worker.run(ThreadPoolExecutor.java:617)
at java.lang.Thread.run(Thread.java:744)
"Timer for 'NameNode' metrics system" #28 daemon prio=5 os_prio=0 tid=0x00007fed78ea7800 nid=0x7163 in Object.wait() [0x00007fed5728f000]
java.lang.Thread.State: TIMED_WAITING (on object monitor)
at java.lang.Object.wait(Native Method)
at java.util.TimerThread.mainLoop(Timer.java:552)
- locked <0x0000000080410708> (a java.util.TaskQueue)
at java.util.TimerThread.run(Timer.java:505)
"org.apache.hadoop.fs.FileSystem$Statistics$StatisticsDataReferenceCleaner" #26 daemon prio=5 os_prio=0 tid=0x00007fed78e77800 nid=0x7162 in Object.wait() [0x00007fed5891b000]
java.lang.Thread.State: WAITING (on object monitor)
at java.lang.Object.wait(Native Method)
at java.lang.ref.ReferenceQueue.remove(ReferenceQueue.java:142)
- locked <0x0000000080355640> (a java.lang.ref.ReferenceQueue$Lock)
at java.lang.ref.ReferenceQueue.remove(ReferenceQueue.java:158)
at org.apache.hadoop.fs.FileSystem$Statistics$StatisticsDataReferenceCleaner.run(FileSystem.java:3116)
at java.lang.Thread.run(Thread.java:744)
"process reaper" #19 daemon prio=10 os_prio=0 tid=0x00007fed78b7e800 nid=0x715c waiting on condition [0x00007fed58954000]
java.lang.Thread.State: TIMED_WAITING (parking)
at sun.misc.Unsafe.park(Native Method)
- parking to wait for <0x00000000802120c8> (a java.util.concurrent.SynchronousQueue$TransferStack)
at java.util.concurrent.locks.LockSupport.parkNanos(LockSupport.java:215)
at java.util.concurrent.SynchronousQueue$TransferStack.awaitFulfill(SynchronousQueue.java:460)
at java.util.concurrent.SynchronousQueue$TransferStack.transfer(SynchronousQueue.java:362)
at java.util.concurrent.SynchronousQueue.poll(SynchronousQueue.java:941)
at java.util.concurrent.ThreadPoolExecutor.getTask(ThreadPoolExecutor.java:1066)
at java.util.concurrent.ThreadPoolExecutor.runWorker(ThreadPoolExecutor.java:1127)
at java.util.concurrent.ThreadPoolExecutor$Worker.run(ThreadPoolExecutor.java:617)
at java.lang.Thread.run(Thread.java:744)
"Service Thread" #17 daemon prio=9 os_prio=0 tid=0x00007fed782d5000 nid=0x7158 runnable [0x0000000000000000]
java.lang.Thread.State: RUNNABLE
"C1 CompilerThread11" #16 daemon prio=9 os_prio=0 tid=0x00007fed782cf800 nid=0x7157 waiting on condition [0x0000000000000000]
java.lang.Thread.State: RUNNABLE
"C1 CompilerThread10" #15 daemon prio=9 os_prio=0 tid=0x00007fed782cd800 nid=0x7156 waiting on condition [0x0000000000000000]
java.lang.Thread.State: RUNNABLE
"C1 CompilerThread9" #14 daemon prio=9 os_prio=0 tid=0x00007fed782cb800 nid=0x7155 waiting on condition [0x0000000000000000]
java.lang.Thread.State: RUNNABLE
"C1 CompilerThread8" #13 daemon prio=9 os_prio=0 tid=0x00007fed782c9000 nid=0x7154 waiting on condition [0x0000000000000000]
java.lang.Thread.State: RUNNABLE
"C2 CompilerThread7" #12 daemon prio=9 os_prio=0 tid=0x00007fed782c7000 nid=0x7153 waiting on condition [0x0000000000000000]
java.lang.Thread.State: RUNNABLE
"C2 CompilerThread6" #11 daemon prio=9 os_prio=0 tid=0x00007fed782c5000 nid=0x7152 waiting on condition [0x0000000000000000]
java.lang.Thread.State: RUNNABLE
"C2 CompilerThread5" #10 daemon prio=9 os_prio=0 tid=0x00007fed782c2800 nid=0x7151 waiting on condition [0x0000000000000000]
java.lang.Thread.State: RUNNABLE
"C2 CompilerThread4" #9 daemon prio=9 os_prio=0 tid=0x00007fed782b0000 nid=0x7150 waiting on condition [0x0000000000000000]
java.lang.Thread.State: RUNNABLE
"C2 CompilerThread3" #8 daemon prio=9 os_prio=0 tid=0x00007fed782ae000 nid=0x714f waiting on condition [0x0000000000000000]
java.lang.Thread.State: RUNNABLE
"C2 CompilerThread2" #7 daemon prio=9 os_prio=0 tid=0x00007fed782a9800 nid=0x714e waiting on condition [0x0000000000000000]
java.lang.Thread.State: RUNNABLE
"C2 CompilerThread1" #6 daemon prio=9 os_prio=0 tid=0x00007fed782a8000 nid=0x714d waiting on condition [0x0000000000000000]
java.lang.Thread.State: RUNNABLE
"C2 CompilerThread0" #5 daemon prio=9 os_prio=0 tid=0x00007fed782a5000 nid=0x714c waiting on condition [0x0000000000000000]
java.lang.Thread.State: RUNNABLE
"Signal Dispatcher" #4 daemon prio=9 os_prio=0 tid=0x00007fed782a3000 nid=0x714b runnable [0x0000000000000000]
java.lang.Thread.State: RUNNABLE
"Finalizer" #3 daemon prio=8 os_prio=0 tid=0x00007fed78276000 nid=0x714a in Object.wait() [0x00007fed5a2e1000]
java.lang.Thread.State: WAITING (on object monitor)
at java.lang.Object.wait(Native Method)
at java.lang.ref.ReferenceQueue.remove(ReferenceQueue.java:142)
- locked <0x0000000080031d28> (a java.lang.ref.ReferenceQueue$Lock)
at java.lang.ref.ReferenceQueue.remove(ReferenceQueue.java:158)
at java.lang.ref.Finalizer$FinalizerThread.run(Finalizer.java:209)
"Reference Handler" #2 daemon prio=10 os_prio=0 tid=0x00007fed78271800 nid=0x7149 in Object.wait() [0x00007fed5a3e2000]
java.lang.Thread.State: WAITING (on object monitor)
at java.lang.Object.wait(Native Method)
at java.lang.Object.wait(Object.java:502)
at java.lang.ref.Reference$ReferenceHandler.run(Reference.java:157)
- locked <0x0000000080038f38> (a java.lang.ref.Reference$Lock)
"main" #1 prio=5 os_prio=0 tid=0x00007fed7800a000 nid=0x713a waiting on condition [0x00007fed81435000]
java.lang.Thread.State: TIMED_WAITING (sleeping)
at java.lang.Thread.sleep(Native Method)
at org.apache.hadoop.hdfs.server.namenode.ha.HATestUtil.waitForStandbyToCatchUp(HATestUtil.java:87)
at org.apache.hadoop.hdfs.server.namenode.ha.TestFailureToReadEdits.testCheckpointStartingMidEditsFile(TestFailureToReadEdits.java:230)
at sun.reflect.NativeMethodAccessorImpl.invoke0(Native Method)
at sun.reflect.NativeMethodAccessorImpl.invoke(NativeMethodAccessorImpl.java:62)
at sun.reflect.DelegatingMethodAccessorImpl.invoke(DelegatingMethodAccessorImpl.java:43)
at java.lang.reflect.Method.invoke(Method.java:483)
at org.junit.runners.model.FrameworkMethod$1.runReflectiveCall(FrameworkMethod.java:47)
at org.junit.internal.runners.model.ReflectiveCallable.run(ReflectiveCallable.java:12)
at org.junit.runners.model.FrameworkMethod.invokeExplosively(FrameworkMethod.java:44)
at org.junit.internal.runners.statements.InvokeMethod.evaluate(InvokeMethod.java:17)
at org.junit.internal.runners.statements.RunBefores.evaluate(RunBefores.java:26)
at org.junit.internal.runners.statements.RunAfters.evaluate(RunAfters.java:27)
at org.junit.runners.ParentRunner.runLeaf(ParentRunner.java:271)
at org.junit.runners.BlockJUnit4ClassRunner.runChild(BlockJUnit4ClassRunner.java:70)
at org.junit.runners.BlockJUnit4ClassRunner.runChild(BlockJUnit4ClassRunner.java:50)
at org.junit.runners.ParentRunner$3.run(ParentRunner.java:238)
at org.junit.runners.ParentRunner$1.schedule(ParentRunner.java:63)
at org.junit.runners.ParentRunner.runChildren(ParentRunner.java:236)
at org.junit.runners.ParentRunner.access$000(ParentRunner.java:53)
at org.junit.runners.ParentRunner$2.evaluate(ParentRunner.java:229)
at org.junit.runners.ParentRunner.run(ParentRunner.java:309)
at org.junit.runners.Suite.runChild(Suite.java:127)
at org.junit.runners.Suite.runChild(Suite.java:26)
at org.junit.runners.ParentRunner$3.run(ParentRunner.java:238)
at org.junit.runners.ParentRunner$1.schedule(ParentRunner.java:63)
at org.junit.runners.ParentRunner.runChildren(ParentRunner.java:236)
at org.junit.runners.ParentRunner.access$000(ParentRunner.java:53)
at org.junit.runners.ParentRunner$2.evaluate(ParentRunner.java:229)
at org.junit.runners.ParentRunner.run(ParentRunner.java:309)
at org.apache.maven.surefire.junit4.JUnit4Provider.execute(JUnit4Provider.java:264)
at org.apache.maven.surefire.junit4.JUnit4Provider.executeTestSet(JUnit4Provider.java:153)
at org.apache.maven.surefire.junit4.JUnit4Provider.invoke(JUnit4Provider.java:124)
at org.apache.maven.surefire.booter.ForkedBooter.invokeProviderInSameClassLoader(ForkedBooter.java:200)
at org.apache.maven.surefire.booter.ForkedBooter.runSuitesInProcess(ForkedBooter.java:153)
at org.apache.maven.surefire.booter.ForkedBooter.main(ForkedBooter.java:103)
"VM Thread" os_prio=0 tid=0x00007fed7826c800 nid=0x7148 runnable
"GC task thread#0 (ParallelGC)" os_prio=0 tid=0x00007fed7801f800 nid=0x713b runnable
"GC task thread#1 (ParallelGC)" os_prio=0 tid=0x00007fed78021800 nid=0x713c runnable
"GC task thread#2 (ParallelGC)" os_prio=0 tid=0x00007fed78023000 nid=0x713d runnable
"GC task thread#3 (ParallelGC)" os_prio=0 tid=0x00007fed78024800 nid=0x713e runnable
"GC task thread#4 (ParallelGC)" os_prio=0 tid=0x00007fed78026800 nid=0x713f runnable
"GC task thread#5 (ParallelGC)" os_prio=0 tid=0x00007fed78028000 nid=0x7140 runnable
"GC task thread#6 (ParallelGC)" os_prio=0 tid=0x00007fed7802a000 nid=0x7141 runnable
"GC task thread#7 (ParallelGC)" os_prio=0 tid=0x00007fed7802b800 nid=0x7142 runnable
"GC task thread#8 (ParallelGC)" os_prio=0 tid=0x00007fed7802d800 nid=0x7143 runnable
"GC task thread#9 (ParallelGC)" os_prio=0 tid=0x00007fed7802f000 nid=0x7144 runnable
"GC task thread#10 (ParallelGC)" os_prio=0 tid=0x00007fed78031000 nid=0x7145 runnable
"GC task thread#11 (ParallelGC)" os_prio=0 tid=0x00007fed78032800 nid=0x7146 runnable
"GC task thread#12 (ParallelGC)" os_prio=0 tid=0x00007fed78034800 nid=0x7147 runnable
"VM Periodic Task Thread" os_prio=0 tid=0x00007fed782d7800 nid=0x7159 waiting on condition
JNI global references: 109
+ echo '************ END zombies jstack extract'
************ END zombies jstack extract
+ JIRA_COMMENT='
{color:red}-1 core zombie tests{color}. There are 2 zombie test(s): at org.apache.hadoop.hdfs.server.namenode.ha.TestFailureToReadEdits.testCheckpointStartingMidEditsFile(TestFailureToReadEdits.java:230)'
+ BAD=1
+ jps
+ grep surefirebooter
+ cut -d ' ' -f 1
+ xargs kill -9
POST BUILD TASK : SUCCESS
END OF POST BUILD TASK : 0
Archiving artifacts
Build failed in Jenkins: HBase-1.2 » latest1.8,Hadoop #229
Posted by Apache Jenkins Server <je...@builds.apache.org>.
See <https://builds.apache.org/job/HBase-1.2/jdk=latest1.8,label=Hadoop/229/changes>
Changes:
[stack] HBASE-14559 branch-1 test tweeks; disable assert explicit region lands
------------------------------------------
[...truncated 48007 lines...]
Java HotSpot(TM) 64-Bit Server VM warning: ignoring option MaxPermSize=256m; support was removed in 8.0
Running org.apache.hadoop.hbase.coprocessor.TestOpenTableInCoprocessor
Tests run: 2, Failures: 0, Errors: 0, Skipped: 0, Time elapsed: 15.82 sec - in org.apache.hadoop.hbase.coprocessor.TestOpenTableInCoprocessor
Java HotSpot(TM) 64-Bit Server VM warning: ignoring option MaxPermSize=256m; support was removed in 8.0
Running org.apache.hadoop.hbase.coprocessor.TestMasterCoprocessorExceptionWithAbort
Tests run: 1, Failures: 0, Errors: 0, Skipped: 0, Time elapsed: 17.032 sec - in org.apache.hadoop.hbase.coprocessor.TestMasterCoprocessorExceptionWithAbort
Java HotSpot(TM) 64-Bit Server VM warning: ignoring option MaxPermSize=256m; support was removed in 8.0
Running org.apache.hadoop.hbase.coprocessor.TestCoprocessorTableEndpoint
Tests run: 2, Failures: 0, Errors: 0, Skipped: 0, Time elapsed: 11.305 sec - in org.apache.hadoop.hbase.coprocessor.TestCoprocessorTableEndpoint
Java HotSpot(TM) 64-Bit Server VM warning: ignoring option MaxPermSize=256m; support was removed in 8.0
Java HotSpot(TM) 64-Bit Server VM warning: ignoring option MaxPermSize=256m; support was removed in 8.0
Java HotSpot(TM) 64-Bit Server VM warning: ignoring option MaxPermSize=256m; support was removed in 8.0
Tests run: 2, Failures: 0, Errors: 0, Skipped: 0, Time elapsed: 111.66 sec - in org.apache.hadoop.hbase.TestIOFencing
Java HotSpot(TM) 64-Bit Server VM warning: ignoring option MaxPermSize=256m; support was removed in 8.0
Running org.apache.hadoop.hbase.coprocessor.TestRegionServerCoprocessorEndpoint
Tests run: 2, Failures: 0, Errors: 0, Skipped: 0, Time elapsed: 1.6 sec - in org.apache.hadoop.hbase.coprocessor.TestRegionServerCoprocessorEndpoint
Java HotSpot(TM) 64-Bit Server VM warning: ignoring option MaxPermSize=256m; support was removed in 8.0
Running org.apache.hadoop.hbase.coprocessor.TestRegionObserverInterface
Running org.apache.hadoop.hbase.coprocessor.TestMasterCoprocessorExceptionWithRemove
Tests run: 1, Failures: 0, Errors: 0, Skipped: 0, Time elapsed: 6.291 sec - in org.apache.hadoop.hbase.coprocessor.TestMasterCoprocessorExceptionWithRemove
Java HotSpot(TM) 64-Bit Server VM warning: ignoring option MaxPermSize=256m; support was removed in 8.0
Running org.apache.hadoop.hbase.coprocessor.TestAggregateProtocol
Tests run: 44, Failures: 0, Errors: 0, Skipped: 0, Time elapsed: 6.939 sec - in org.apache.hadoop.hbase.coprocessor.TestAggregateProtocol
Java HotSpot(TM) 64-Bit Server VM warning: ignoring option MaxPermSize=256m; support was removed in 8.0
Running org.apache.hadoop.hbase.coprocessor.TestBatchCoprocessorEndpoint
Tests run: 4, Failures: 0, Errors: 0, Skipped: 0, Time elapsed: 1.722 sec - in org.apache.hadoop.hbase.coprocessor.TestBatchCoprocessorEndpoint
Java HotSpot(TM) 64-Bit Server VM warning: ignoring option MaxPermSize=256m; support was removed in 8.0
Running org.apache.hadoop.hbase.coprocessor.TestHTableWrapper
Tests run: 1, Failures: 0, Errors: 0, Skipped: 0, Time elapsed: 5.225 sec - in org.apache.hadoop.hbase.coprocessor.TestHTableWrapper
Java HotSpot(TM) 64-Bit Server VM warning: ignoring option MaxPermSize=256m; support was removed in 8.0
Running org.apache.hadoop.hbase.coprocessor.TestRegionServerObserver
Tests run: 14, Failures: 0, Errors: 0, Skipped: 2, Time elapsed: 75.829 sec - in org.apache.hadoop.hbase.coprocessor.TestRegionObserverInterface
Java HotSpot(TM) 64-Bit Server VM warning: ignoring option MaxPermSize=256m; support was removed in 8.0
Java HotSpot(TM) 64-Bit Server VM warning: ignoring option MaxPermSize=256m; support was removed in 8.0
Java HotSpot(TM) 64-Bit Server VM warning: ignoring option MaxPermSize=256m; support was removed in 8.0
Tests run: 1, Failures: 0, Errors: 0, Skipped: 0, Time elapsed: 16.186 sec - in org.apache.hadoop.hbase.coprocessor.TestRegionServerObserver
Java HotSpot(TM) 64-Bit Server VM warning: ignoring option MaxPermSize=256m; support was removed in 8.0
Running org.apache.hadoop.hbase.coprocessor.TestRegionServerCoprocessorExceptionWithAbort
Running org.apache.hadoop.hbase.coprocessor.TestClassLoading
Tests run: 2, Failures: 0, Errors: 0, Skipped: 0, Time elapsed: 22.362 sec - in org.apache.hadoop.hbase.coprocessor.TestRegionServerCoprocessorExceptionWithAbort
Java HotSpot(TM) 64-Bit Server VM warning: ignoring option MaxPermSize=256m; support was removed in 8.0
Tests run: 9, Failures: 0, Errors: 0, Skipped: 0, Time elapsed: 340.429 sec - in org.apache.hadoop.hbase.snapshot.TestExportSnapshot
Java HotSpot(TM) 64-Bit Server VM warning: ignoring option MaxPermSize=256m; support was removed in 8.0
Tests run: 9, Failures: 0, Errors: 0, Skipped: 0, Time elapsed: 31.101 sec - in org.apache.hadoop.hbase.coprocessor.TestClassLoading
Java HotSpot(TM) 64-Bit Server VM warning: ignoring option MaxPermSize=256m; support was removed in 8.0
Running org.apache.hadoop.hbase.coprocessor.TestDoubleColumnInterpreter
Running org.apache.hadoop.hbase.coprocessor.TestRegionObserverBypass
Tests run: 38, Failures: 0, Errors: 0, Skipped: 0, Time elapsed: 5.46 sec - in org.apache.hadoop.hbase.coprocessor.TestDoubleColumnInterpreter
Java HotSpot(TM) 64-Bit Server VM warning: ignoring option MaxPermSize=256m; support was removed in 8.0
Running org.apache.hadoop.hbase.coprocessor.TestRowProcessorEndpoint
Tests run: 2, Failures: 0, Errors: 0, Skipped: 0, Time elapsed: 8.944 sec - in org.apache.hadoop.hbase.coprocessor.TestRegionObserverBypass
Java HotSpot(TM) 64-Bit Server VM warning: ignoring option MaxPermSize=256m; support was removed in 8.0
Running org.apache.hadoop.hbase.coprocessor.TestCoprocessorStop
Running org.apache.hadoop.hbase.coprocessor.TestRegionServerCoprocessorExceptionWithRemove
Tests run: 4, Failures: 0, Errors: 0, Skipped: 0, Time elapsed: 20.574 sec - in org.apache.hadoop.hbase.coprocessor.TestRowProcessorEndpoint
Java HotSpot(TM) 64-Bit Server VM warning: ignoring option MaxPermSize=256m; support was removed in 8.0
Tests run: 1, Failures: 0, Errors: 0, Skipped: 0, Time elapsed: 16.776 sec - in org.apache.hadoop.hbase.coprocessor.TestCoprocessorStop
Java HotSpot(TM) 64-Bit Server VM warning: ignoring option MaxPermSize=256m; support was removed in 8.0
Tests run: 9, Failures: 0, Errors: 0, Skipped: 0, Time elapsed: 332.19 sec - in org.apache.hadoop.hbase.snapshot.TestSecureExportSnapshot
Java HotSpot(TM) 64-Bit Server VM warning: ignoring option MaxPermSize=256m; support was removed in 8.0
Tests run: 1, Failures: 0, Errors: 0, Skipped: 0, Time elapsed: 15.725 sec - in org.apache.hadoop.hbase.coprocessor.TestRegionServerCoprocessorExceptionWithRemove
Java HotSpot(TM) 64-Bit Server VM warning: ignoring option MaxPermSize=256m; support was removed in 8.0
Running org.apache.hadoop.hbase.coprocessor.TestBigDecimalColumnInterpreter
Running org.apache.hadoop.hbase.coprocessor.TestMasterObserver
Running org.apache.hadoop.hbase.coprocessor.TestCoprocessorEndpoint
Tests run: 38, Failures: 0, Errors: 0, Skipped: 0, Time elapsed: 6.241 sec - in org.apache.hadoop.hbase.coprocessor.TestBigDecimalColumnInterpreter
Java HotSpot(TM) 64-Bit Server VM warning: ignoring option MaxPermSize=256m; support was removed in 8.0
Running org.apache.hadoop.hbase.TestGlobalMemStoreSize
Tests run: 6, Failures: 0, Errors: 0, Skipped: 0, Time elapsed: 2.011 sec - in org.apache.hadoop.hbase.coprocessor.TestCoprocessorEndpoint
Java HotSpot(TM) 64-Bit Server VM warning: ignoring option MaxPermSize=256m; support was removed in 8.0
Running org.apache.hadoop.hbase.coprocessor.TestWALObserver
Tests run: 6, Failures: 0, Errors: 0, Skipped: 0, Time elapsed: 8.586 sec - in org.apache.hadoop.hbase.coprocessor.TestWALObserver
Java HotSpot(TM) 64-Bit Server VM warning: ignoring option MaxPermSize=256m; support was removed in 8.0
Running org.apache.hadoop.hbase.TestJMXListener
Java HotSpot(TM) 64-Bit Server VM warning: ignoring option MaxPermSize=256m; support was removed in 8.0
Java HotSpot(TM) 64-Bit Server VM warning: ignoring option MaxPermSize=256m; support was removed in 8.0
Java HotSpot(TM) 64-Bit Server VM warning: ignoring option MaxPermSize=256m; support was removed in 8.0
Running org.apache.hadoop.hbase.TestMetaTableLocator
Tests run: 1, Failures: 0, Errors: 0, Skipped: 0, Time elapsed: 14.521 sec - in org.apache.hadoop.hbase.TestGlobalMemStoreSize
Java HotSpot(TM) 64-Bit Server VM warning: ignoring option MaxPermSize=256m; support was removed in 8.0
Tests run: 7, Failures: 0, Errors: 0, Skipped: 0, Time elapsed: 3.295 sec - in org.apache.hadoop.hbase.TestMetaTableLocator
Java HotSpot(TM) 64-Bit Server VM warning: ignoring option MaxPermSize=256m; support was removed in 8.0
Running org.apache.hadoop.hbase.zookeeper.TestZKTableStateManager
Tests run: 1, Failures: 0, Errors: 0, Skipped: 0, Time elapsed: 0.616 sec - in org.apache.hadoop.hbase.zookeeper.TestZKTableStateManager
Java HotSpot(TM) 64-Bit Server VM warning: ignoring option MaxPermSize=256m; support was removed in 8.0
Running org.apache.hadoop.hbase.zookeeper.TestZKMulti
Tests run: 12, Failures: 0, Errors: 0, Skipped: 0, Time elapsed: 1.18 sec - in org.apache.hadoop.hbase.zookeeper.TestZKMulti
Java HotSpot(TM) 64-Bit Server VM warning: ignoring option MaxPermSize=256m; support was removed in 8.0
Running org.apache.hadoop.hbase.zookeeper.lock.TestZKInterProcessReadWriteLock
Running org.apache.hadoop.hbase.zookeeper.TestZooKeeperACL
Tests run: 7, Failures: 0, Errors: 0, Skipped: 0, Time elapsed: 0.398 sec - in org.apache.hadoop.hbase.zookeeper.TestZooKeeperACL
Java HotSpot(TM) 64-Bit Server VM warning: ignoring option MaxPermSize=256m; support was removed in 8.0
Running org.apache.hadoop.hbase.zookeeper.TestZKLeaderManager
Tests run: 1, Failures: 0, Errors: 0, Skipped: 0, Time elapsed: 0.116 sec - in org.apache.hadoop.hbase.zookeeper.TestZKLeaderManager
Java HotSpot(TM) 64-Bit Server VM warning: ignoring option MaxPermSize=256m; support was removed in 8.0
Tests run: 2, Failures: 0, Errors: 0, Skipped: 0, Time elapsed: 16.614 sec - in org.apache.hadoop.hbase.TestJMXListener
Java HotSpot(TM) 64-Bit Server VM warning: ignoring option MaxPermSize=256m; support was removed in 8.0
Java HotSpot(TM) 64-Bit Server VM warning: ignoring option MaxPermSize=256m; support was removed in 8.0
Java HotSpot(TM) 64-Bit Server VM warning: ignoring option MaxPermSize=256m; support was removed in 8.0
Running org.apache.hadoop.hbase.zookeeper.TestRecoverableZooKeeper
Running org.apache.hadoop.hbase.zookeeper.TestZooKeeperNodeTracker
Tests run: 1, Failures: 0, Errors: 0, Skipped: 0, Time elapsed: 1.24 sec - in org.apache.hadoop.hbase.zookeeper.TestRecoverableZooKeeper
Java HotSpot(TM) 64-Bit Server VM warning: ignoring option MaxPermSize=256m; support was removed in 8.0
Tests run: 3, Failures: 0, Errors: 0, Skipped: 0, Time elapsed: 0.749 sec - in org.apache.hadoop.hbase.zookeeper.TestZooKeeperNodeTracker
Java HotSpot(TM) 64-Bit Server VM warning: ignoring option MaxPermSize=256m; support was removed in 8.0
Running org.apache.hadoop.hbase.zookeeper.TestHQuorumPeer
Tests run: 4, Failures: 0, Errors: 0, Skipped: 0, Time elapsed: 1.509 sec - in org.apache.hadoop.hbase.zookeeper.TestHQuorumPeer
Java HotSpot(TM) 64-Bit Server VM warning: ignoring option MaxPermSize=256m; support was removed in 8.0
Running org.apache.hadoop.hbase.TestClusterBootOrder
Tests run: 7, Failures: 0, Errors: 0, Skipped: 0, Time elapsed: 38.154 sec - in org.apache.hadoop.hbase.coprocessor.TestMasterObserver
Java HotSpot(TM) 64-Bit Server VM warning: ignoring option MaxPermSize=256m; support was removed in 8.0
Running org.apache.hadoop.hbase.TestPartialResultsFromClientSide
Running org.apache.hadoop.hbase.TestServerSideScanMetricsFromClientSide
Tests run: 6, Failures: 0, Errors: 0, Skipped: 0, Time elapsed: 24.622 sec - in org.apache.hadoop.hbase.zookeeper.lock.TestZKInterProcessReadWriteLock
Java HotSpot(TM) 64-Bit Server VM warning: ignoring option MaxPermSize=256m; support was removed in 8.0
Tests run: 2, Failures: 0, Errors: 0, Skipped: 0, Time elapsed: 2.774 sec - in org.apache.hadoop.hbase.TestServerSideScanMetricsFromClientSide
Java HotSpot(TM) 64-Bit Server VM warning: ignoring option MaxPermSize=256m; support was removed in 8.0
Tests run: 2, Failures: 0, Errors: 0, Skipped: 0, Time elapsed: 27.728 sec - in org.apache.hadoop.hbase.TestClusterBootOrder
Killed
Killed
Results :
Tests in error:
TestMultiTableSnapshotInputFormat>MultiTableInputFormatTestBase.setUpBeforeClass:77 » Bind
TestTableInputFormat.beforeClass:90 » Bind Port in use: localhost:0
TestTableMapReduce>TestTableMapReduceBase.beforeClass:78 » Bind Port in use: l...
org.apache.hadoop.hbase.mapred.TestTableSnapshotInputFormat.testInitTableSnapshotMapperJobConfig(org.apache.hadoop.hbase.mapred.TestTableSnapshotInputFormat)
Run 1: TestTableSnapshotInputFormat.testInitTableSnapshotMapperJobConfig:99->TableSnapshotInputFormatTestBase.setupCluster:60 » Bind
Run 2: TestTableSnapshotInputFormat.testInitTableSnapshotMapperJobConfig:99->TableSnapshotInputFormatTestBase.setupCluster:60 » Bind
Run 3: TestTableSnapshotInputFormat.testInitTableSnapshotMapperJobConfig:99->TableSnapshotInputFormatTestBase.setupCluster:60 » Bind
org.apache.hadoop.hbase.mapred.TestTableSnapshotInputFormat.testRestoreSnapshotDoesNotCreateBackRefLinks(org.apache.hadoop.hbase.mapred.TestTableSnapshotInputFormat)
Run 1: TestTableSnapshotInputFormat>TableSnapshotInputFormatTestBase.testRestoreSnapshotDoesNotCreateBackRefLinks:114->TableSnapshotInputFormatTestBase.setupCluster:60 » Bind
Run 2: TestTableSnapshotInputFormat>TableSnapshotInputFormatTestBase.testRestoreSnapshotDoesNotCreateBackRefLinks:114->TableSnapshotInputFormatTestBase.setupCluster:60 » Bind
Run 3: TestTableSnapshotInputFormat>TableSnapshotInputFormatTestBase.testRestoreSnapshotDoesNotCreateBackRefLinks:114->TableSnapshotInputFormatTestBase.setupCluster:60 » Bind
org.apache.hadoop.hbase.mapred.TestTableSnapshotInputFormat.testWithMapReduceAndOfflineHBaseMultiRegion(org.apache.hadoop.hbase.mapred.TestTableSnapshotInputFormat)
Run 1: TestTableSnapshotInputFormat.testWithMapReduceAndOfflineHBaseMultiRegion:147->TableSnapshotInputFormatTestBase.testWithMapReduce:157->TableSnapshotInputFormatTestBase.setupCluster:60 » Bind
Run 2: TestTableSnapshotInputFormat.testWithMapReduceAndOfflineHBaseMultiRegion:147->TableSnapshotInputFormatTestBase.testWithMapReduce:157->TableSnapshotInputFormatTestBase.setupCluster:60 » Bind
Run 3: TestTableSnapshotInputFormat.testWithMapReduceAndOfflineHBaseMultiRegion:147->TableSnapshotInputFormatTestBase.testWithMapReduce:157->TableSnapshotInputFormatTestBase.setupCluster:60 » Bind
org.apache.hadoop.hbase.mapred.TestTableSnapshotInputFormat.testWithMapReduceMultiRegion(org.apache.hadoop.hbase.mapred.TestTableSnapshotInputFormat)
Run 1: TestTableSnapshotInputFormat.testWithMapReduceMultiRegion:140->TableSnapshotInputFormatTestBase.testWithMapReduce:157->TableSnapshotInputFormatTestBase.setupCluster:60 » Bind
Run 2: TestTableSnapshotInputFormat.testWithMapReduceMultiRegion:140->TableSnapshotInputFormatTestBase.testWithMapReduce:157->TableSnapshotInputFormatTestBase.setupCluster:60 » Bind
Run 3: TestTableSnapshotInputFormat.testWithMapReduceMultiRegion:140->TableSnapshotInputFormatTestBase.testWithMapReduce:157->TableSnapshotInputFormatTestBase.setupCluster:60 » Bind
org.apache.hadoop.hbase.mapred.TestTableSnapshotInputFormat.testWithMapReduceSingleRegion(org.apache.hadoop.hbase.mapred.TestTableSnapshotInputFormat)
Run 1: TestTableSnapshotInputFormat>TableSnapshotInputFormatTestBase.testWithMapReduceSingleRegion:97->TableSnapshotInputFormatTestBase.testWithMapReduce:157->TableSnapshotInputFormatTestBase.setupCluster:60 » Bind
Run 2: TestTableSnapshotInputFormat>TableSnapshotInputFormatTestBase.testWithMapReduceSingleRegion:97->TableSnapshotInputFormatTestBase.testWithMapReduce:157->TableSnapshotInputFormatTestBase.setupCluster:60 » Bind
Run 3: TestTableSnapshotInputFormat>TableSnapshotInputFormatTestBase.testWithMapReduceSingleRegion:97->TableSnapshotInputFormatTestBase.testWithMapReduce:157->TableSnapshotInputFormatTestBase.setupCluster:60 » Bind
org.apache.hadoop.hbase.mapred.TestTableSnapshotInputFormat.testWithMockedMapReduceMultiRegion(org.apache.hadoop.hbase.mapred.TestTableSnapshotInputFormat)
Run 1: TestTableSnapshotInputFormat.testWithMockedMapReduceMultiRegion:134->testWithMockedMapReduce:162->TableSnapshotInputFormatTestBase.setupCluster:60 » Bind
Run 2: TestTableSnapshotInputFormat.testWithMockedMapReduceMultiRegion:134->testWithMockedMapReduce:162->TableSnapshotInputFormatTestBase.setupCluster:60 » Bind
Run 3: TestTableSnapshotInputFormat.testWithMockedMapReduceMultiRegion:134->testWithMockedMapReduce:162->TableSnapshotInputFormatTestBase.setupCluster:60 » Bind
org.apache.hadoop.hbase.mapred.TestTableSnapshotInputFormat.testWithMockedMapReduceSingleRegion(org.apache.hadoop.hbase.mapred.TestTableSnapshotInputFormat)
Run 1: TestTableSnapshotInputFormat>TableSnapshotInputFormatTestBase.testWithMockedMapReduceSingleRegion:87->testWithMockedMapReduce:162->TableSnapshotInputFormatTestBase.setupCluster:60 » Bind
Run 2: TestTableSnapshotInputFormat>TableSnapshotInputFormatTestBase.testWithMockedMapReduceSingleRegion:87->testWithMockedMapReduce:162->TableSnapshotInputFormatTestBase.setupCluster:60 » Bind
Run 3: TestTableSnapshotInputFormat>TableSnapshotInputFormatTestBase.testWithMockedMapReduceSingleRegion:87->testWithMockedMapReduce:162->TableSnapshotInputFormatTestBase.setupCluster:60 » Bind
TestMasterFailoverWithProcedures.testWALfencingWithoutWALRolling:173->testWALfencing:205 » FileNotFound
TestDefaultWALProviderWithHLogKey>TestDefaultWALProvider.setUpBeforeClass:104 » Bind
TestWALSplitCompressed.setUpBeforeClass:32->TestWALSplit.setUpBeforeClass:161 » Bind
Tests run: 2461, Failures: 0, Errors: 13, Skipped: 40
[INFO] ------------------------------------------------------------------------
[INFO] Reactor Summary:
[INFO]
[INFO] Apache HBase ...................................... SUCCESS [1:15.492s]
[INFO] Apache HBase - Checkstyle ......................... SUCCESS [5.207s]
[INFO] Apache HBase - Resource Bundle .................... SUCCESS [0.165s]
[INFO] Apache HBase - Annotations ........................ SUCCESS [0.973s]
[INFO] Apache HBase - Protocol ........................... SUCCESS [16.612s]
[INFO] Apache HBase - Common ............................. SUCCESS [8:19.658s]
[INFO] Apache HBase - Procedure .......................... SUCCESS [1:53.483s]
[INFO] Apache HBase - Client ............................. SUCCESS [3:30.348s]
[INFO] Apache HBase - Hadoop Compatibility ............... SUCCESS [8.473s]
[INFO] Apache HBase - Hadoop Two Compatibility ........... SUCCESS [9.466s]
[INFO] Apache HBase - Prefix Tree ........................ SUCCESS [7.846s]
[INFO] Apache HBase - Server ............................. FAILURE [1:37:35.908s]
[INFO] Apache HBase - Testing Util ....................... SKIPPED
[INFO] Apache HBase - Thrift ............................. SKIPPED
[INFO] Apache HBase - Rest ............................... SKIPPED
[INFO] Apache HBase - Shell .............................. SKIPPED
[INFO] Apache HBase - Integration Tests .................. SKIPPED
[INFO] Apache HBase - Examples ........................... SKIPPED
[INFO] Apache HBase - External Block Cache ............... SKIPPED
[INFO] Apache HBase - Assembly ........................... SKIPPED
[INFO] Apache HBase - Shaded ............................. SKIPPED
[INFO] Apache HBase - Shaded - Client .................... SKIPPED
[INFO] Apache HBase - Shaded - Server .................... SKIPPED
[INFO] ------------------------------------------------------------------------
[INFO] BUILD FAILURE
[INFO] ------------------------------------------------------------------------
[INFO] Total time: 1:53:43.737s
[INFO] Finished at: Tue Oct 06 08:05:39 UTC 2015
[INFO] Final Memory: 97M/656M
[INFO] ------------------------------------------------------------------------
[ERROR] Failed to execute goal org.apache.maven.plugins:maven-surefire-plugin:2.18.1:test (secondPartTestsExecution) on project hbase-server: ExecutionException: java.lang.RuntimeException: java.lang.RuntimeException: org.apache.maven.surefire.report.ReporterException: When writing xml report stdout/stderr: /tmp/stderr4782012523387799358deferred (No such file or directory) -> [Help 1]
[ERROR]
[ERROR] To see the full stack trace of the errors, re-run Maven with the -e switch.
[ERROR] Re-run Maven using the -X switch to enable full debug logging.
[ERROR]
[ERROR] For more information about the errors and possible solutions, please read the following articles:
[ERROR] [Help 1] http://cwiki.apache.org/confluence/display/MAVEN/MojoFailureException
[ERROR]
[ERROR] After correcting the problems, you can resume the build with the command
[ERROR] mvn <goals> -rf :hbase-server
Build step 'Invoke top-level Maven targets' marked build as failure
Performing Post build task...
Match found for :.* : True
Logical operation result is TRUE
Running script : ZOMBIE_TESTS_COUNT=`jps | grep surefirebooter | wc -l`
if [[ $ZOMBIE_TESTS_COUNT != 0 ]] ; then
#It seems sometimes the tests are not dying immediately. Let's give them 10s
echo "Suspicious java process found - waiting 10s to see if there are just slow to stop"
sleep 10
ZOMBIE_TESTS_COUNT=`jps | grep surefirebooter | wc -l`
if [[ $ZOMBIE_TESTS_COUNT != 0 ]] ; then
echo "There are $ZOMBIE_TESTS_COUNT zombie tests, they should have been killed by surefire but survived"
echo "************ BEGIN zombies jstack extract"
ZB_STACK=`jps | grep surefirebooter | cut -d ' ' -f 1 | xargs -n 1 jstack | grep ".test" | grep "\.java"`
jps | grep surefirebooter | cut -d ' ' -f 1 | xargs -n 1 jstack
echo "************ END zombies jstack extract"
JIRA_COMMENT="$JIRA_COMMENT
{color:red}-1 core zombie tests{color}. There are ${ZOMBIE_TESTS_COUNT} zombie test(s): ${ZB_STACK}"
BAD=1
jps | grep surefirebooter | cut -d ' ' -f 1 | xargs kill -9
else
echo "We're ok: there is no zombie test, but some tests took some time to stop"
fi
else
echo "We're ok: there is no zombie test"
fi
[Hadoop] $ /bin/bash -xe /tmp/hudson4790665519878635838.sh
++ jps
++ grep surefirebooter
++ wc -l
+ ZOMBIE_TESTS_COUNT=0
+ [[ 0 != 0 ]]
+ echo 'We'\''re ok: there is no zombie test'
We're ok: there is no zombie test
POST BUILD TASK : SUCCESS
END OF POST BUILD TASK : 0
Archiving artifacts