You are viewing a plain text version of this content. The canonical link for it is here.
Posted to commits@tomee.apache.org by Apache Jenkins Server <je...@builds.apache.org> on 2026/09/28 23:06:57 UTC
Jenkins build is still unstable: TomEE » master-build-full-tck #591
See <https://ci-builds.apache.org/job/Tomee/job/master-build-full-tck/591/display/redirect?page=changes>
Jenkins build is back to stable : TomEE » master-build-full-tck #608
Posted by Apache Jenkins Server <je...@builds.apache.org>.
See <https://ci-builds.apache.org/job/Tomee/job/master-build-full-tck/608/display/redirect?page=changes>
Jenkins build is unstable: TomEE » master-build-full-tck #607
Posted by Apache Jenkins Server <je...@builds.apache.org>.
See <https://ci-builds.apache.org/job/Tomee/job/master-build-full-tck/607/display/redirect>
Build failed in Jenkins: TomEE » master-build-full-tck #606
Posted by Apache Jenkins Server <je...@builds.apache.org>.
See <https://ci-builds.apache.org/job/Tomee/job/master-build-full-tck/606/display/redirect>
Changes:
------------------------------------------
Started by user Richard Zowalla
Running as SYSTEM
[EnvInject] - Loading node environment variables.
Building remotely on builds37 (ubuntu) in workspace <https://ci-builds.apache.org/job/Tomee/job/master-build-full-tck/ws/>
The recommended git tool is: NONE
No credentials specified
> git rev-parse --resolve-git-dir <https://ci-builds.apache.org/job/Tomee/job/master-build-full-tck/ws/.git> # timeout=10
Fetching changes from the remote Git repository
> git config remote.origin.url https://github.com/apache/tomee # timeout=10
Cleaning workspace
> git rev-parse --verify HEAD # timeout=10
Resetting working tree
> git reset --hard # timeout=10
> git clean -fdx # timeout=10
Fetching upstream changes from https://github.com/apache/tomee
> git --version # timeout=10
> git --version # 'git version 2.34.1'
> git fetch --tags --force --progress -- https://github.com/apache/tomee +refs/heads/*:refs/remotes/origin/* # timeout=10
> git rev-parse refs/remotes/origin/main^{commit} # timeout=10
Checking out Revision 1d72919b50ebd447fe839d9b9dfa36add82e206e (refs/remotes/origin/main)
> git config core.sparsecheckout # timeout=10
> git checkout -f 1d72919b50ebd447fe839d9b9dfa36add82e206e # timeout=10
Commit message: "make the scan exclusion and async MP-JWT tests independent of their environment (#3088)"
> git rev-list --no-walk 1d72919b50ebd447fe839d9b9dfa36add82e206e # timeout=10
[master-build-full-tck] $ /bin/sh -xe /tmp/jenkins13979106736088867167.sh
+ rm -rf /home/jenkins/.m2/repository/org/apache/apache/
+ /usr/local/asfpackages/maven/apache-maven-3.9.2/bin/mvn clean install -DskipTests
[INFO] Scanning for projects...
Downloading from apache: https://repository.apache.org/content/repositories/releases/org/apache/apache/40/apache-40.pom
Progress (1): 7.5/27 kBProgress (1): 8.2/27 kBProgress (1): 16/27 kB Progress (1): 23/27 kBProgress (1): 25/27 kBProgress (1): 27 kB Downloaded from apache: https://repository.apache.org/content/repositories/releases/org/apache/apache/40/apache-40.pom (27 kB at 15 kB/s)
[WARNING] The POM for org.apache.felix:maven-bundle-plugin:jar:6.2.0 is invalid, transitive dependencies (if any) will not be available, enable debug logging for more details
[ERROR] Invalid extension descriptor for org.apache.felix:maven-bundle-plugin:6.2.0: zip file is empty
Downloading from central: https://repo.maven.apache.org/maven2/org/jboss/arquillian/arquillian-bom/1.10.0.Final/arquillian-bom-1.10.0.Final.pom
Progress (1): 980 BProgress (1): 4.3 kBProgress (1): 8.6 kB Downloaded from central: https://repo.maven.apache.org/maven2/org/jboss/arquillian/arquillian-bom/1.10.0.Final/arquillian-bom-1.10.0.Final.pom (8.6 kB at 18 kB/s)
Downloading from central: https://repo.maven.apache.org/maven2/org/arquillian/arquillian-universe/1.5.0.0/arquillian-universe-1.5.0.0.pom
Progress (1): 2.3 kBProgress (1): 12 kB Downloaded from central: https://repo.maven.apache.org/maven2/org/arquillian/arquillian-universe/1.5.0.0/arquillian-universe-1.5.0.0.pom (12 kB at 157 kB/s)
Downloading from central: https://repo.maven.apache.org/maven2/org/arquillian/universe/arquillian-universe-parent/1.5.0.0/arquillian-universe-parent-1.5.0.0.pom
Progress (1): 1.1 kBProgress (1): 2.9 kBProgress (1): 6.3 kBProgress (1): 7.1 kB Downloaded from central: https://repo.maven.apache.org/maven2/org/arquillian/universe/arquillian-universe-parent/1.5.0.0/arquillian-universe-parent-1.5.0.0.pom (7.1 kB at 91 kB/s)
Downloading from central: https://repo.maven.apache.org/maven2/org/jboss/jboss-parent/36/jboss-parent-36.pom
Progress (1): 769 BProgress (1): 1.7 kBProgress (1): 4.2 kBProgress (1): 6.5 kBProgress (1): 8.1 kBProgress (1): 8.2 kBProgress (1): 10 kB Progress (1): 15 kBProgress (1): 22 kBProgress (1): 28 kBProgress (1): 32 kBProgress (1): 34 kBProgress (1): 37 kBProgress (1): 41 kBProgress (1): 49 kBProgress (1): 65 kBProgress (1): 66 kB Downloaded from central: https://repo.maven.apache.org/maven2/org/jboss/jboss-parent/36/jboss-parent-36.pom (66 kB at 633 kB/s)
Downloading from central: https://repo.maven.apache.org/maven2/org/arquillian/universe/arquillian-core/1.5.0.0/arquillian-core-1.5.0.0.pom
Progress (1): 2.1 kB Downloaded from central: https://repo.maven.apache.org/maven2/org/arquillian/universe/arquillian-core/1.5.0.0/arquillian-core-1.5.0.0.pom (2.1 kB at 23 kB/s)
Downloading from central: https://repo.maven.apache.org/maven2/org/jboss/shrinkwrap/shrinkwrap-bom/1.2.6/shrinkwrap-bom-1.2.6.pom
Progress (1): 986 BProgress (1): 3.4 kBProgress (1): 4.0 kB Downloaded from central: https://repo.maven.apache.org/maven2/org/jboss/shrinkwrap/shrinkwrap-bom/1.2.6/shrinkwrap-bom-1.2.6.pom (4.0 kB at 37 kB/s)
Downloading from central: https://repo.maven.apache.org/maven2/org/jboss/shrinkwrap/descriptors/shrinkwrap-descriptors-bom/2.0.0/shrinkwrap-descriptors-bom-2.0.0.pom
Progress (1): 1.1 kBProgress (1): 4.4 kBProgress (1): 5.2 kB Downloaded from central: https://repo.maven.apache.org/maven2/org/jboss/shrinkwrap/descriptors/shrinkwrap-descriptors-bom/2.0.0/shrinkwrap-descriptors-bom-2.0.0.pom (5.2 kB at 89 kB/s)
Downloading from central: https://repo.maven.apache.org/maven2/org/jboss/shrinkwrap/resolver/shrinkwrap-resolver-bom/3.1.3/shrinkwrap-resolver-bom-3.1.3.pom
Progress (1): 979 BProgress (1): 4.4 kBProgress (1): 6.9 kBProgress (1): 7.0 kB Downloaded from central: https://repo.maven.apache.org/maven2/org/jboss/shrinkwrap/resolver/shrinkwrap-resolver-bom/3.1.3/shrinkwrap-resolver-bom-3.1.3.pom (7.0 kB at 122 kB/s)
Downloading from central: https://repo.maven.apache.org/maven2/org/apache/maven/maven/3.5.2/maven-3.5.2.pom
Progress (1): 732 BProgress (1): 1.6 kBProgress (1): 3.1 kBProgress (1): 4.8 kBProgress (1): 7.1 kBProgress (1): 13 kB Progress (1): 18 kBProgress (1): 20 kBProgress (1): 23 kBProgress (1): 25 kB Downloaded from central: https://repo.maven.apache.org/maven2/org/apache/maven/maven/3.5.2/maven-3.5.2.pom (25 kB at 550 kB/s)
Downloading from central: https://repo.maven.apache.org/maven2/org/apache/maven/maven-parent/27/maven-parent-27.pom
Progress (1): 807 BProgress (1): 2.1 kBProgress (1): 4.7 kBProgress (1): 8.2 kBProgress (1): 12 kB Progress (1): 16 kBProgress (1): 19 kBProgress (1): 23 kBProgress (1): 24 kBProgress (1): 26 kBProgress (1): 30 kBProgress (1): 33 kBProgress (1): 34 kBProgress (1): 39 kBProgress (1): 41 kB Downloaded from central: https://repo.maven.apache.org/maven2/org/apache/maven/maven-parent/27/maven-parent-27.pom (41 kB at 295 kB/s)
Downloading from central: https://repo.maven.apache.org/maven2/org/apache/apache/17/apache-17.pom
Progress (1): 749 BProgress (1): 1.6 kBProgress (1): 3.4 kBProgress (1): 6.9 kBProgress (1): 11 kB Progress (1): 14 kBProgress (1): 16 kB Downloaded from central: https://repo.maven.apache.org/maven2/org/apache/apache/17/apache-17.pom (16 kB at 292 kB/s)
Downloading from central: https://repo.maven.apache.org/maven2/org/jboss/arquillian/arquillian-bom/1.5.0.Final/arquillian-bom-1.5.0.Final.pom
Progress (1): 1.0 kBProgress (1): 6.6 kBProgress (1): 9.1 kB Downloaded from central: https://repo.maven.apache.org/maven2/org/jboss/arquillian/arquillian-bom/1.5.0.Final/arquillian-bom-1.5.0.Final.pom (9.1 kB at 169 kB/s)
Downloading from central: https://repo.maven.apache.org/maven2/org/jboss/shrinkwrap/resolver/shrinkwrap-resolver-bom/2.2.6/shrinkwrap-resolver-bom-2.2.6.pom
Progress (1): 979 BProgress (1): 5.1 kBProgress (1): 5.3 kB Downloaded from central: https://repo.maven.apache.org/maven2/org/jboss/shrinkwrap/resolver/shrinkwrap-resolver-bom/2.2.6/shrinkwrap-resolver-bom-2.2.6.pom (5.3 kB at 147 kB/s)
Downloading from central: https://repo.maven.apache.org/maven2/org/junit/junit-bom/5.12.0/junit-bom-5.12.0.pom
Progress (1): 912 BProgress (1): 4.1 kBProgress (1): 5.6 kB Downloaded from central: https://repo.maven.apache.org/maven2/org/junit/junit-bom/5.12.0/junit-bom-5.12.0.pom (5.6 kB at 128 kB/s)
Downloading from central: https://repo.maven.apache.org/maven2/org/jboss/shrinkwrap/resolver/shrinkwrap-resolver-bom/3.3.4/shrinkwrap-resolver-bom-3.3.4.pom
Progress (1): 978 BProgress (1): 5.7 kBProgress (1): 7.2 kB Downloaded from central: https://repo.maven.apache.org/maven2/org/jboss/shrinkwrap/resolver/shrinkwrap-resolver-bom/3.3.4/shrinkwrap-resolver-bom-3.3.4.pom (7.2 kB at 141 kB/s)
Downloading from central: https://repo.maven.apache.org/maven2/org/apache/maven/maven/3.9.9/maven-3.9.9.pom
Progress (1): 710 BProgress (1): 1.9 kBProgress (1): 4.0 kBProgress (1): 5.6 kBProgress (1): 9.8 kBProgress (1): 15 kB Progress (1): 20 kBProgress (1): 21 kBProgress (1): 24 kBProgress (1): 27 kBProgress (1): 28 kB Downloaded from central: https://repo.maven.apache.org/maven2/org/apache/maven/maven/3.9.9/maven-3.9.9.pom (28 kB at 559 kB/s)
Downloading from apache: https://repository.apache.org/content/repositories/releases/org/jboss/arquillian/arquillian-bom/1.10.1.Final/arquillian-bom-1.10.1.Final.pom
Downloading from B_shibboleth: https://build.shibboleth.net/maven/releases/org/jboss/arquillian/arquillian-bom/1.10.1.Final/arquillian-bom-1.10.1.Final.pom
Downloading from central: https://repo.maven.apache.org/maven2/org/jboss/arquillian/arquillian-bom/1.10.1.Final/arquillian-bom-1.10.1.Final.pom
Progress (1): 2.6 kBProgress (1): 6.5 kB Downloaded from central: https://repo.maven.apache.org/maven2/org/jboss/arquillian/arquillian-bom/1.10.1.Final/arquillian-bom-1.10.1.Final.pom (6.5 kB at 192 kB/s)
Downloading from apache: https://repository.apache.org/content/repositories/releases/org/jboss/arquillian/arquillian-parent/1.10.1.Final/arquillian-parent-1.10.1.Final.pom
Downloading from B_shibboleth: https://build.shibboleth.net/maven/releases/org/jboss/arquillian/arquillian-parent/1.10.1.Final/arquillian-parent-1.10.1.Final.pom
Downloading from central: https://repo.maven.apache.org/maven2/org/jboss/arquillian/arquillian-parent/1.10.1.Final/arquillian-parent-1.10.1.Final.pom
Progress (1): 960 BProgress (1): 2.7 kBProgress (1): 4.9 kBProgress (1): 6.7 kB Downloaded from central: https://repo.maven.apache.org/maven2/org/jboss/arquillian/arquillian-parent/1.10.1.Final/arquillian-parent-1.10.1.Final.pom (6.7 kB at 182 kB/s)
Downloading from apache: https://repository.apache.org/content/repositories/releases/org/jboss/jboss-parent/52/jboss-parent-52.pom
Downloading from B_shibboleth: https://build.shibboleth.net/maven/releases/org/jboss/jboss-parent/52/jboss-parent-52.pom
Downloading from central: https://repo.maven.apache.org/maven2/org/jboss/jboss-parent/52/jboss-parent-52.pom
Progress (1): 692 BProgress (1): 2.0 kBProgress (1): 4.5 kBProgress (1): 6.8 kBProgress (1): 9.2 kBProgress (1): 11 kB Progress (1): 16 kBProgress (1): 19 kBProgress (1): 25 kBProgress (1): 31 kBProgress (1): 35 kBProgress (1): 38 kBProgress (1): 43 kBProgress (1): 46 kBProgress (1): 58 kBProgress (1): 82 kBProgress (1): 91 kBProgress (1): 102 kB Downloaded from central: https://repo.maven.apache.org/maven2/org/jboss/jboss-parent/52/jboss-parent-52.pom (102 kB at 2.4 MB/s)
Downloading from apache: https://repository.apache.org/content/repositories/releases/org/jboss/arquillian/arquillian-bom/1.9.1.Final/arquillian-bom-1.9.1.Final.pom
Downloading from B_shibboleth: https://build.shibboleth.net/maven/releases/org/jboss/arquillian/arquillian-bom/1.9.1.Final/arquillian-bom-1.9.1.Final.pom
Downloading from central: https://repo.maven.apache.org/maven2/org/jboss/arquillian/arquillian-bom/1.9.1.Final/arquillian-bom-1.9.1.Final.pom
Progress (1): 979 BProgress (1): 7.0 kBProgress (1): 8.6 kB Downloaded from central: https://repo.maven.apache.org/maven2/org/jboss/arquillian/arquillian-bom/1.9.1.Final/arquillian-bom-1.9.1.Final.pom (8.6 kB at 260 kB/s)
Downloading from apache: https://repository.apache.org/content/repositories/releases/org/jboss/shrinkwrap/resolver/shrinkwrap-resolver-bom/3.3.7/shrinkwrap-resolver-bom-3.3.7.pom
Downloading from B_shibboleth: https://build.shibboleth.net/maven/releases/org/jboss/shrinkwrap/resolver/shrinkwrap-resolver-bom/3.3.7/shrinkwrap-resolver-bom-3.3.7.pom
Downloading from central: https://repo.maven.apache.org/maven2/org/jboss/shrinkwrap/resolver/shrinkwrap-resolver-bom/3.3.7/shrinkwrap-resolver-bom-3.3.7.pom
Progress (1): 981 BProgress (1): 5.6 kBProgress (1): 6.8 kB Downloaded from central: https://repo.maven.apache.org/maven2/org/jboss/shrinkwrap/resolver/shrinkwrap-resolver-bom/3.3.7/shrinkwrap-resolver-bom-3.3.7.pom (6.8 kB at 167 kB/s)
[ERROR] [ERROR] Some problems were encountered while processing the POMs:
[FATAL] Non-readable POM /home/jenkins/.m2/repository/org/apache/maven/maven-parent/43/maven-parent-43.pom: input contained no data @ /home/jenkins/.m2/repository/org/apache/maven/maven-parent/43/maven-parent-43.pom
[ERROR] 'dependencies.dependency.version' for org.jboss.shrinkwrap.resolver:shrinkwrap-resolver-depchain:pom is missing. @ line 98, column 17
[FATAL] Non-readable POM /home/jenkins/.m2/repository/org/apache/maven/maven-parent/43/maven-parent-43.pom: input contained no data @ /home/jenkins/.m2/repository/org/apache/maven/maven-parent/43/maven-parent-43.pom
[ERROR] 'dependencies.dependency.version' for org.jboss.shrinkwrap.resolver:shrinkwrap-resolver-depchain:pom is missing. @ line 121, column 17
[FATAL] Non-readable POM /home/jenkins/.m2/repository/org/apache/maven/maven-parent/43/maven-parent-43.pom: input contained no data @ /home/jenkins/.m2/repository/org/apache/maven/maven-parent/43/maven-parent-43.pom
[ERROR] 'dependencies.dependency.version' for org.jboss.shrinkwrap.resolver:shrinkwrap-resolver-depchain:pom is missing. @ line 146, column 17
[FATAL] Non-readable POM /home/jenkins/.m2/repository/org/apache/maven/maven-parent/43/maven-parent-43.pom: input contained no data @ /home/jenkins/.m2/repository/org/apache/maven/maven-parent/43/maven-parent-43.pom
[ERROR] 'dependencies.dependency.version' for org.jboss.shrinkwrap.resolver:shrinkwrap-resolver-depchain:pom is missing. @ line 111, column 21
[FATAL] Non-readable POM /home/jenkins/.m2/repository/org/apache/maven/maven-parent/43/maven-parent-43.pom: input contained no data @ /home/jenkins/.m2/repository/org/apache/maven/maven-parent/43/maven-parent-43.pom
[ERROR] 'dependencies.dependency.version' for org.jboss.shrinkwrap.resolver:shrinkwrap-resolver-depchain:pom is missing. @ line 129, column 17
[FATAL] Non-readable POM /home/jenkins/.m2/repository/org/apache/maven/maven-parent/43/maven-parent-43.pom: input contained no data @ /home/jenkins/.m2/repository/org/apache/maven/maven-parent/43/maven-parent-43.pom
[ERROR] 'dependencies.dependency.version' for org.jboss.shrinkwrap.resolver:shrinkwrap-resolver-depchain:pom is missing. @ line 129, column 17
[FATAL] Non-readable POM /home/jenkins/.m2/repository/org/apache/maven/maven-parent/43/maven-parent-43.pom: input contained no data @ /home/jenkins/.m2/repository/org/apache/maven/maven-parent/43/maven-parent-43.pom
[ERROR] 'dependencies.dependency.version' for org.jboss.shrinkwrap.resolver:shrinkwrap-resolver-depchain:pom is missing. @ line 125, column 17
[FATAL] Non-readable POM /home/jenkins/.m2/repository/org/apache/maven/maven-parent/43/maven-parent-43.pom: input contained no data @ /home/jenkins/.m2/repository/org/apache/maven/maven-parent/43/maven-parent-43.pom
[ERROR] 'dependencies.dependency.version' for org.jboss.shrinkwrap.resolver:shrinkwrap-resolver-depchain:pom is missing. @ line 154, column 17
[FATAL] Non-readable POM /home/jenkins/.m2/repository/org/apache/maven/maven-parent/43/maven-parent-43.pom: input contained no data @ /home/jenkins/.m2/repository/org/apache/maven/maven-parent/43/maven-parent-43.pom
[ERROR] 'dependencies.dependency.version' for org.jboss.shrinkwrap.resolver:shrinkwrap-resolver-depchain:pom is missing. @ line 112, column 17
[WARNING] 'build.plugins.plugin.version' for org.codehaus.mojo:build-helper-maven-plugin is missing. @ line 42, column 15
[WARNING] 'build.plugins.plugin.version' for org.codehaus.mojo:build-helper-maven-plugin is missing. @ line 45, column 15
[FATAL] Non-readable POM /home/jenkins/.m2/repository/org/apache/maven/maven-parent/43/maven-parent-43.pom: input contained no data @ /home/jenkins/.m2/repository/org/apache/maven/maven-parent/43/maven-parent-43.pom
[ERROR] 'dependencies.dependency.version' for org.jboss.shrinkwrap.resolver:shrinkwrap-resolver-depchain:pom is missing. @ line 77, column 17
[FATAL] Non-readable POM /home/jenkins/.m2/repository/org/apache/maven/maven-parent/43/maven-parent-43.pom: input contained no data @ /home/jenkins/.m2/repository/org/apache/maven/maven-parent/43/maven-parent-43.pom
[ERROR] 'dependencies.dependency.version' for org.jboss.shrinkwrap.resolver:shrinkwrap-resolver-depchain:pom is missing. @ line 186, column 17
[FATAL] Non-readable POM /home/jenkins/.m2/repository/org/apache/maven/maven-parent/43/maven-parent-43.pom: input contained no data @ /home/jenkins/.m2/repository/org/apache/maven/maven-parent/43/maven-parent-43.pom
[ERROR] 'dependencies.dependency.version' for org.jboss.shrinkwrap.resolver:shrinkwrap-resolver-depchain:pom is missing. @ line 169, column 17
[FATAL] Non-readable POM /home/jenkins/.m2/repository/org/apache/maven/maven-parent/43/maven-parent-43.pom: input contained no data @ /home/jenkins/.m2/repository/org/apache/maven/maven-parent/43/maven-parent-43.pom
[ERROR] 'dependencies.dependency.version' for org.jboss.shrinkwrap.resolver:shrinkwrap-resolver-depchain:pom is missing. @ line 124, column 17
[WARNING] 'dependencies.dependency.scope' for org.junit:junit-bom:pom must be one of [provided, compile, runtime, test, system] but is 'import'. @ line 43, column 20
[WARNING] 'dependencies.dependency.scope' for org.junit:junit-bom:pom must be one of [provided, compile, runtime, test, system] but is 'import'. @ line 44, column 20
@
[ERROR] The build could not read 13 projects -> [Help 1]
[ERROR]
[ERROR] The project org.superbiz:connector-sample-functional-test:11.0.0-SNAPSHOT (<https://ci-builds.apache.org/job/Tomee/job/master-build-full-tck/ws/examples/connector-ear/connector-sample-functional-tests/pom.xml)> has 2 errors
[ERROR] Non-readable POM /home/jenkins/.m2/repository/org/apache/maven/maven-parent/43/maven-parent-43.pom: input contained no data @ /home/jenkins/.m2/repository/org/apache/maven/maven-parent/43/maven-parent-43.pom
[ERROR] 'dependencies.dependency.version' for org.jboss.shrinkwrap.resolver:shrinkwrap-resolver-depchain:pom is missing. @ line 98, column 17
[ERROR]
[ERROR] The project org.superbiz:connector-war:11.0.0-SNAPSHOT (<https://ci-builds.apache.org/job/Tomee/job/master-build-full-tck/ws/examples/connector-war/pom.xml)> has 2 errors
[ERROR] Non-readable POM /home/jenkins/.m2/repository/org/apache/maven/maven-parent/43/maven-parent-43.pom: input contained no data @ /home/jenkins/.m2/repository/org/apache/maven/maven-parent/43/maven-parent-43.pom
[ERROR] 'dependencies.dependency.version' for org.jboss.shrinkwrap.resolver:shrinkwrap-resolver-depchain:pom is missing. @ line 121, column 17
[ERROR]
[ERROR] The project org.superbiz:datasource-versioning:11.0.0-SNAPSHOT (<https://ci-builds.apache.org/job/Tomee/job/master-build-full-tck/ws/examples/datasource-versioning/pom.xml)> has 2 errors
[ERROR] Non-readable POM /home/jenkins/.m2/repository/org/apache/maven/maven-parent/43/maven-parent-43.pom: input contained no data @ /home/jenkins/.m2/repository/org/apache/maven/maven-parent/43/maven-parent-43.pom
[ERROR] 'dependencies.dependency.version' for org.jboss.shrinkwrap.resolver:shrinkwrap-resolver-depchain:pom is missing. @ line 146, column 17
[ERROR]
[ERROR] The project org.superbiz:jpa-hibernate-arquillian:11.0.0-SNAPSHOT (<https://ci-builds.apache.org/job/Tomee/job/master-build-full-tck/ws/examples/jpa-hibernate-arquillian/pom.xml)> has 2 errors
[ERROR] Non-readable POM /home/jenkins/.m2/repository/org/apache/maven/maven-parent/43/maven-parent-43.pom: input contained no data @ /home/jenkins/.m2/repository/org/apache/maven/maven-parent/43/maven-parent-43.pom
[ERROR] 'dependencies.dependency.version' for org.jboss.shrinkwrap.resolver:shrinkwrap-resolver-depchain:pom is missing. @ line 111, column 21
[ERROR]
[ERROR] The project org.superbiz:mp-jwt-bean-validation:11.0.0-SNAPSHOT (<https://ci-builds.apache.org/job/Tomee/job/master-build-full-tck/ws/examples/mp-jwt-bean-validation/pom.xml)> has 2 errors
[ERROR] Non-readable POM /home/jenkins/.m2/repository/org/apache/maven/maven-parent/43/maven-parent-43.pom: input contained no data @ /home/jenkins/.m2/repository/org/apache/maven/maven-parent/43/maven-parent-43.pom
[ERROR] 'dependencies.dependency.version' for org.jboss.shrinkwrap.resolver:shrinkwrap-resolver-depchain:pom is missing. @ line 129, column 17
[ERROR]
[ERROR] The project org.superbiz:mp-jwt-bean-validation-strongly-typed:11.0.0-SNAPSHOT (<https://ci-builds.apache.org/job/Tomee/job/master-build-full-tck/ws/examples/mp-jwt-bean-validation-strongly-typed/pom.xml)> has 2 errors
[ERROR] Non-readable POM /home/jenkins/.m2/repository/org/apache/maven/maven-parent/43/maven-parent-43.pom: input contained no data @ /home/jenkins/.m2/repository/org/apache/maven/maven-parent/43/maven-parent-43.pom
[ERROR] 'dependencies.dependency.version' for org.jboss.shrinkwrap.resolver:shrinkwrap-resolver-depchain:pom is missing. @ line 129, column 17
[ERROR]
[ERROR] The project org.superbiz:mp-rest-jwt-jwk:11.0.0-SNAPSHOT (<https://ci-builds.apache.org/job/Tomee/job/master-build-full-tck/ws/examples/mp-rest-jwt-jwk/pom.xml)> has 2 errors
[ERROR] Non-readable POM /home/jenkins/.m2/repository/org/apache/maven/maven-parent/43/maven-parent-43.pom: input contained no data @ /home/jenkins/.m2/repository/org/apache/maven/maven-parent/43/maven-parent-43.pom
[ERROR] 'dependencies.dependency.version' for org.jboss.shrinkwrap.resolver:shrinkwrap-resolver-depchain:pom is missing. @ line 125, column 17
[ERROR]
[ERROR] The project org.superbiz:mp-rest-jwt-public-key:11.0.0-SNAPSHOT (<https://ci-builds.apache.org/job/Tomee/job/master-build-full-tck/ws/examples/mp-rest-jwt-public-key/pom.xml)> has 2 errors
[ERROR] Non-readable POM /home/jenkins/.m2/repository/org/apache/maven/maven-parent/43/maven-parent-43.pom: input contained no data @ /home/jenkins/.m2/repository/org/apache/maven/maven-parent/43/maven-parent-43.pom
[ERROR] 'dependencies.dependency.version' for org.jboss.shrinkwrap.resolver:shrinkwrap-resolver-depchain:pom is missing. @ line 154, column 17
[ERROR]
[ERROR] The project org.superbiz:moviefun-functional-test:11.0.0-SNAPSHOT (<https://ci-builds.apache.org/job/Tomee/job/master-build-full-tck/ws/examples/simple-ear/moviefun-functional-tests/pom.xml)> has 2 errors
[ERROR] Non-readable POM /home/jenkins/.m2/repository/org/apache/maven/maven-parent/43/maven-parent-43.pom: input contained no data @ /home/jenkins/.m2/repository/org/apache/maven/maven-parent/43/maven-parent-43.pom
[ERROR] 'dependencies.dependency.version' for org.jboss.shrinkwrap.resolver:shrinkwrap-resolver-depchain:pom is missing. @ line 112, column 17
[ERROR]
[ERROR] The project org.superbiz:tomee-jersey-eclipselink:11.0.0-SNAPSHOT (<https://ci-builds.apache.org/job/Tomee/job/master-build-full-tck/ws/examples/tomee-jersey-eclipselink/pom.xml)> has 2 errors
[ERROR] Non-readable POM /home/jenkins/.m2/repository/org/apache/maven/maven-parent/43/maven-parent-43.pom: input contained no data @ /home/jenkins/.m2/repository/org/apache/maven/maven-parent/43/maven-parent-43.pom
[ERROR] 'dependencies.dependency.version' for org.jboss.shrinkwrap.resolver:shrinkwrap-resolver-depchain:pom is missing. @ line 77, column 17
[ERROR]
[ERROR] The project org.superbiz:moviefun:11.0.0-SNAPSHOT (<https://ci-builds.apache.org/job/Tomee/job/master-build-full-tck/ws/examples/moviefun/pom.xml)> has 2 errors
[ERROR] Non-readable POM /home/jenkins/.m2/repository/org/apache/maven/maven-parent/43/maven-parent-43.pom: input contained no data @ /home/jenkins/.m2/repository/org/apache/maven/maven-parent/43/maven-parent-43.pom
[ERROR] 'dependencies.dependency.version' for org.jboss.shrinkwrap.resolver:shrinkwrap-resolver-depchain:pom is missing. @ line 186, column 17
[ERROR]
[ERROR] The project org.superbiz:moviefun-rest:11.0.0-SNAPSHOT (<https://ci-builds.apache.org/job/Tomee/job/master-build-full-tck/ws/examples/moviefun-rest/pom.xml)> has 2 errors
[ERROR] Non-readable POM /home/jenkins/.m2/repository/org/apache/maven/maven-parent/43/maven-parent-43.pom: input contained no data @ /home/jenkins/.m2/repository/org/apache/maven/maven-parent/43/maven-parent-43.pom
[ERROR] 'dependencies.dependency.version' for org.jboss.shrinkwrap.resolver:shrinkwrap-resolver-depchain:pom is missing. @ line 169, column 17
[ERROR]
[ERROR] The project org.superbiz:multi-broker:11.0.0-SNAPSHOT (<https://ci-builds.apache.org/job/Tomee/job/master-build-full-tck/ws/examples/activemq-multiple-brokers/pom.xml)> has 2 errors
[ERROR] Non-readable POM /home/jenkins/.m2/repository/org/apache/maven/maven-parent/43/maven-parent-43.pom: input contained no data @ /home/jenkins/.m2/repository/org/apache/maven/maven-parent/43/maven-parent-43.pom
[ERROR] 'dependencies.dependency.version' for org.jboss.shrinkwrap.resolver:shrinkwrap-resolver-depchain:pom is missing. @ line 124, column 17
[ERROR]
[ERROR] To see the full stack trace of the errors, re-run Maven with the -e switch.
[ERROR] Re-run Maven using the -X switch to enable full debug logging.
[ERROR]
[ERROR] For more information about the errors and possible solutions, please read the following articles:
[ERROR] [Help 1] http://cwiki.apache.org/confluence/display/MAVEN/ProjectBuildingException
Build step 'Execute shell' marked build as failure
INFO: Processing JUnit
INFO: [JUnit] - No test report file(s) were found with the pattern '**/target/surefire-reports/TEST-*.xml' relative to '<https://ci-builds.apache.org/job/Tomee/job/master-build-full-tck/ws/'> for the testing framework 'JUnit'.
Did you enter a pattern relative to (and within) the workspace directory?
Did you generate the result report(s) for 'JUnit'?"
WARNING: All test reports are empty.
[Checks API] No suitable checks publisher found.
INFO: Setting the build status to SUCCESS
Build failed in Jenkins: TomEE » master-build-full-tck #605
Posted by Apache Jenkins Server <je...@builds.apache.org>.
See <https://ci-builds.apache.org/job/Tomee/job/master-build-full-tck/605/display/redirect?page=changes>
Changes:
[github] TOMEE-4730 - Apply class-level security annotations of a resource superclass (#3081)
[github] make the scan exclusion and async MP-JWT tests independent of their environment (#3088)
------------------------------------------
Started by upstream project "Tomee/master-sanity-checks" build number 1306
originally caused by:
Started by an SCM change
Running as SYSTEM
[EnvInject] - Loading node environment variables.
Building remotely on builds37 (ubuntu) in workspace <https://ci-builds.apache.org/job/Tomee/job/master-build-full-tck/ws/>
The recommended git tool is: NONE
No credentials specified
> git rev-parse --resolve-git-dir <https://ci-builds.apache.org/job/Tomee/job/master-build-full-tck/ws/.git> # timeout=10
Fetching changes from the remote Git repository
> git config remote.origin.url https://github.com/apache/tomee # timeout=10
Cleaning workspace
> git rev-parse --verify HEAD # timeout=10
Resetting working tree
> git reset --hard # timeout=10
> git clean -fdx # timeout=10
Fetching upstream changes from https://github.com/apache/tomee
> git --version # timeout=10
> git --version # 'git version 2.34.1'
> git fetch --tags --force --progress -- https://github.com/apache/tomee +refs/heads/*:refs/remotes/origin/* # timeout=10
> git rev-parse refs/remotes/origin/main^{commit} # timeout=10
Checking out Revision 1d72919b50ebd447fe839d9b9dfa36add82e206e (refs/remotes/origin/main)
> git config core.sparsecheckout # timeout=10
> git checkout -f 1d72919b50ebd447fe839d9b9dfa36add82e206e # timeout=10
Commit message: "make the scan exclusion and async MP-JWT tests independent of their environment (#3088)"
> git rev-list --no-walk 0fb057efe6e322538a8c30ddfa7401a4c0835793 # timeout=10
[master-build-full-tck] $ /bin/sh -xe /tmp/jenkins17954258413593034155.sh
+ /usr/local/asfpackages/maven/apache-maven-3.9.2/bin/mvn clean install -DskipTests
[INFO] Scanning for projects...
[ERROR] [ERROR] Some problems were encountered while processing the POMs:
[FATAL] Non-readable POM /home/jenkins/.m2/repository/org/apache/apache/40/apache-40.pom: input contained no data @ /home/jenkins/.m2/repository/org/apache/apache/40/apache-40.pom
@
[ERROR] The build could not read 1 project -> [Help 1]
[ERROR]
[ERROR] The project org.apache.tomee:tomee-project:11.0.0-SNAPSHOT (<https://ci-builds.apache.org/job/Tomee/job/master-build-full-tck/ws/pom.xml)> has 1 error
[ERROR] Non-readable POM /home/jenkins/.m2/repository/org/apache/apache/40/apache-40.pom: input contained no data @ /home/jenkins/.m2/repository/org/apache/apache/40/apache-40.pom
[ERROR]
[ERROR] To see the full stack trace of the errors, re-run Maven with the -e switch.
[ERROR] Re-run Maven using the -X switch to enable full debug logging.
[ERROR]
[ERROR] For more information about the errors and possible solutions, please read the following articles:
[ERROR] [Help 1] http://cwiki.apache.org/confluence/display/MAVEN/ProjectBuildingException
Build step 'Execute shell' marked build as failure
INFO: Processing JUnit
INFO: [JUnit] - No test report file(s) were found with the pattern '**/target/surefire-reports/TEST-*.xml' relative to '<https://ci-builds.apache.org/job/Tomee/job/master-build-full-tck/ws/'> for the testing framework 'JUnit'.
Did you enter a pattern relative to (and within) the workspace directory?
Did you generate the result report(s) for 'JUnit'?"
WARNING: All test reports are empty.
[Checks API] No suitable checks publisher found.
INFO: Setting the build status to SUCCESS
Jenkins build is unstable: TomEE » master-build-full-tck #604
Posted by Apache Jenkins Server <je...@builds.apache.org>.
See <https://ci-builds.apache.org/job/Tomee/job/master-build-full-tck/604/display/redirect>
Build failed in Jenkins: TomEE » master-build-full-tck #603
Posted by Apache Jenkins Server <je...@builds.apache.org>.
See <https://ci-builds.apache.org/job/Tomee/job/master-build-full-tck/603/display/redirect?page=changes>
Changes:
[github] Update the systemd service example (#3085)
[github] Register the MP-JWT filter only for the MP-JWT auth method (#3067)
[github] Resolve MP-JWT security constraints per resource class (#3068)
[github] Log webapp jars skipped by the scan exclusion list (#3069)
[github] Do not map the caller principal to a role by name in getLogicalRoles (#3070)
[github] Keep Debian package configuration read-only for the service group (#3071)
[github] Bind the LiveReload connector to loopback and check the websocket origin (#3072)
[github] Validate stored parameters in TomEEPbkdf2PasswordHash (#3073)
[github] Verify Tomcat user identity store passwords with the realm CredentialHandler (#3074)
[github] Make only_from authoritative for server services (#3075)
[github] Warn that the Static3DES password cipher only obfuscates (#3076)
[github] Passivate stateful beans to a private directory by default (#3077)
[github] Warn when tomee-maven-plugin sends credentials over plain HTTP (#3078)
[github] Reject archive entries escaping the target in tomee-maven-plugin (#3079)
[github] TOMEE-4729 - Restore MP-JWT security state for asynchronous requests (#3080)
[github] Keep RAFPassivater files in a private temp directory (#3082)
[github] Do not return EJB exception messages from the default JAX-RS mapper (#3083)
[github] Clear the WS-Security caller identity after the JAX-WS request (#3084)
[github] Require a secret for stop requests on the admin port (#3087)
------------------------------------------
Started by upstream project "Tomee/master-sanity-checks" build number 1305
originally caused by:
Started by an SCM change
Running as SYSTEM
[EnvInject] - Loading node environment variables.
Building remotely on builds37 (ubuntu) in workspace <https://ci-builds.apache.org/job/Tomee/job/master-build-full-tck/ws/>
The recommended git tool is: NONE
No credentials specified
Cloning the remote Git repository
Cloning repository https://github.com/apache/tomee
> git init <https://ci-builds.apache.org/job/Tomee/job/master-build-full-tck/ws/> # timeout=10
Fetching upstream changes from https://github.com/apache/tomee
> git --version # timeout=10
> git --version # 'git version 2.34.1'
> git fetch --tags --force --progress -- https://github.com/apache/tomee +refs/heads/*:refs/remotes/origin/* # timeout=10
> git config remote.origin.url https://github.com/apache/tomee # timeout=10
> git config --add remote.origin.fetch +refs/heads/*:refs/remotes/origin/* # timeout=10
Avoid second fetch
> git rev-parse refs/remotes/origin/main^{commit} # timeout=10
Checking out Revision 0fb057efe6e322538a8c30ddfa7401a4c0835793 (refs/remotes/origin/main)
> git config core.sparsecheckout # timeout=10
> git checkout -f 0fb057efe6e322538a8c30ddfa7401a4c0835793 # timeout=10
Commit message: "Require a secret for stop requests on the admin port (#3087)"
> git rev-list --no-walk fca9dbddff1d704d03bcfc77bf8e90e3a9aa24f6 # timeout=10
[master-build-full-tck] $ /bin/sh -xe /tmp/jenkins12117528864806524539.sh
+ /usr/local/asfpackages/maven/apache-maven-3.9.2/bin/mvn clean install -DskipTests
[INFO] Scanning for projects...
[ERROR] [ERROR] Some problems were encountered while processing the POMs:
[FATAL] Non-readable POM /home/jenkins/.m2/repository/org/apache/apache/40/apache-40.pom: input contained no data @ /home/jenkins/.m2/repository/org/apache/apache/40/apache-40.pom
@
[ERROR] The build could not read 1 project -> [Help 1]
[ERROR]
[ERROR] The project org.apache.tomee:tomee-project:11.0.0-SNAPSHOT (<https://ci-builds.apache.org/job/Tomee/job/master-build-full-tck/ws/pom.xml)> has 1 error
[ERROR] Non-readable POM /home/jenkins/.m2/repository/org/apache/apache/40/apache-40.pom: input contained no data @ /home/jenkins/.m2/repository/org/apache/apache/40/apache-40.pom
[ERROR]
[ERROR] To see the full stack trace of the errors, re-run Maven with the -e switch.
[ERROR] Re-run Maven using the -X switch to enable full debug logging.
[ERROR]
[ERROR] For more information about the errors and possible solutions, please read the following articles:
[ERROR] [Help 1] http://cwiki.apache.org/confluence/display/MAVEN/ProjectBuildingException
Build step 'Execute shell' marked build as failure
INFO: Processing JUnit
INFO: [JUnit] - No test report file(s) were found with the pattern '**/target/surefire-reports/TEST-*.xml' relative to '<https://ci-builds.apache.org/job/Tomee/job/master-build-full-tck/ws/'> for the testing framework 'JUnit'.
Did you enter a pattern relative to (and within) the workspace directory?
Did you generate the result report(s) for 'JUnit'?"
WARNING: All test reports are empty.
[Checks API] No suitable checks publisher found.
INFO: Setting the build status to SUCCESS
Jenkins build is still unstable: TomEE » master-build-full-tck #602
Posted by Apache Jenkins Server <je...@builds.apache.org>.
See <https://ci-builds.apache.org/job/Tomee/job/master-build-full-tck/602/display/redirect?page=changes>
Jenkins build is still unstable: TomEE » master-build-full-tck #601
Posted by Apache Jenkins Server <je...@builds.apache.org>.
See <https://ci-builds.apache.org/job/Tomee/job/master-build-full-tck/601/display/redirect?page=changes>
Jenkins build is still unstable: TomEE » master-build-full-tck #600
Posted by Apache Jenkins Server <je...@builds.apache.org>.
See <https://ci-builds.apache.org/job/Tomee/job/master-build-full-tck/600/display/redirect?page=changes>
Jenkins build is still unstable: TomEE » master-build-full-tck #599
Posted by Apache Jenkins Server <je...@builds.apache.org>.
See <https://ci-builds.apache.org/job/Tomee/job/master-build-full-tck/599/display/redirect?page=changes>
Jenkins build is still unstable: TomEE » master-build-full-tck #598
Posted by Apache Jenkins Server <je...@builds.apache.org>.
See <https://ci-builds.apache.org/job/Tomee/job/master-build-full-tck/598/display/redirect?page=changes>
Jenkins build is still unstable: TomEE » master-build-full-tck #597
Posted by Apache Jenkins Server <je...@builds.apache.org>.
See <https://ci-builds.apache.org/job/Tomee/job/master-build-full-tck/597/display/redirect?page=changes>
Jenkins build is still unstable: TomEE » master-build-full-tck #596
Posted by Apache Jenkins Server <je...@builds.apache.org>.
See <https://ci-builds.apache.org/job/Tomee/job/master-build-full-tck/596/display/redirect?page=changes>
Jenkins build is still unstable: TomEE » master-build-full-tck #595
Posted by Apache Jenkins Server <je...@builds.apache.org>.
See <https://ci-builds.apache.org/job/Tomee/job/master-build-full-tck/595/display/redirect?page=changes>
Jenkins build is still unstable: TomEE » master-build-full-tck #594
Posted by Apache Jenkins Server <je...@builds.apache.org>.
See <https://ci-builds.apache.org/job/Tomee/job/master-build-full-tck/594/display/redirect?page=changes>
Jenkins build is still unstable: TomEE » master-build-full-tck #593
Posted by Apache Jenkins Server <je...@builds.apache.org>.
See <https://ci-builds.apache.org/job/Tomee/job/master-build-full-tck/593/display/redirect?page=changes>
Jenkins build is still unstable: TomEE » master-build-full-tck #592
Posted by Apache Jenkins Server <je...@builds.apache.org>.
See <https://ci-builds.apache.org/job/Tomee/job/master-build-full-tck/592/display/redirect?page=changes>