You are viewing a plain text version of this content. The canonical link for it is here.
Posted to dev@lucene.apache.org by Policeman Jenkins Server <je...@thetaphi.de> on 2016/06/25 06:49:34 UTC

[JENKINS] Lucene-Solr-6.x-Windows (64bit/jdk1.8.0_92) - Build # 271 - Still Failing!

Build: http://jenkins.thetaphi.de/job/Lucene-Solr-6.x-Windows/271/
Java: 64bit/jdk1.8.0_92 -XX:-UseCompressedOops -XX:+UseParallelGC

1 tests failed.
FAILED:  junit.framework.TestSuite.org.apache.solr.schema.TestManagedSchemaAPI

Error Message:
ObjectTracker found 8 object(s) that were not released!!! [MockDirectoryWrapper, MDCAwareThreadPoolExecutor, TransactionLog, TransactionLog, MockDirectoryWrapper, MockDirectoryWrapper, MDCAwareThreadPoolExecutor, MockDirectoryWrapper]

Stack Trace:
java.lang.AssertionError: ObjectTracker found 8 object(s) that were not released!!! [MockDirectoryWrapper, MDCAwareThreadPoolExecutor, TransactionLog, TransactionLog, MockDirectoryWrapper, MockDirectoryWrapper, MDCAwareThreadPoolExecutor, MockDirectoryWrapper]
	at __randomizedtesting.SeedInfo.seed([5635B27ECB49862A]:0)
	at org.junit.Assert.fail(Assert.java:93)
	at org.junit.Assert.assertTrue(Assert.java:43)
	at org.junit.Assert.assertNull(Assert.java:551)
	at org.apache.solr.SolrTestCaseJ4.teardownTestCases(SolrTestCaseJ4.java:257)
	at sun.reflect.GeneratedMethodAccessor31.invoke(Unknown Source)
	at sun.reflect.DelegatingMethodAccessorImpl.invoke(DelegatingMethodAccessorImpl.java:43)
	at java.lang.reflect.Method.invoke(Method.java:498)
	at com.carrotsearch.randomizedtesting.RandomizedRunner.invoke(RandomizedRunner.java:1764)
	at com.carrotsearch.randomizedtesting.RandomizedRunner$7.evaluate(RandomizedRunner.java:834)
	at com.carrotsearch.randomizedtesting.rules.StatementAdapter.evaluate(StatementAdapter.java:36)
	at com.carrotsearch.randomizedtesting.rules.SystemPropertiesRestoreRule$1.evaluate(SystemPropertiesRestoreRule.java:57)
	at org.apache.lucene.util.AbstractBeforeAfterRule$1.evaluate(AbstractBeforeAfterRule.java:45)
	at com.carrotsearch.randomizedtesting.rules.StatementAdapter.evaluate(StatementAdapter.java:36)
	at org.apache.lucene.util.TestRuleStoreClassName$1.evaluate(TestRuleStoreClassName.java:41)
	at com.carrotsearch.randomizedtesting.rules.NoShadowingOrOverridesOnMethodsRule$1.evaluate(NoShadowingOrOverridesOnMethodsRule.java:40)
	at com.carrotsearch.randomizedtesting.rules.NoShadowingOrOverridesOnMethodsRule$1.evaluate(NoShadowingOrOverridesOnMethodsRule.java:40)
	at com.carrotsearch.randomizedtesting.rules.StatementAdapter.evaluate(StatementAdapter.java:36)
	at com.carrotsearch.randomizedtesting.rules.StatementAdapter.evaluate(StatementAdapter.java:36)
	at com.carrotsearch.randomizedtesting.rules.StatementAdapter.evaluate(StatementAdapter.java:36)
	at org.apache.lucene.util.TestRuleAssertionsRequired$1.evaluate(TestRuleAssertionsRequired.java:53)
	at org.apache.lucene.util.TestRuleMarkFailure$1.evaluate(TestRuleMarkFailure.java:47)
	at org.apache.lucene.util.TestRuleIgnoreAfterMaxFailures$1.evaluate(TestRuleIgnoreAfterMaxFailures.java:64)
	at org.apache.lucene.util.TestRuleIgnoreTestSuites$1.evaluate(TestRuleIgnoreTestSuites.java:54)
	at com.carrotsearch.randomizedtesting.rules.StatementAdapter.evaluate(StatementAdapter.java:36)
	at com.carrotsearch.randomizedtesting.ThreadLeakControl$StatementRunner.run(ThreadLeakControl.java:367)
	at java.lang.Thread.run(Thread.java:745)




Build Log:
[...truncated 11358 lines...]
   [junit4] Suite: org.apache.solr.schema.TestManagedSchemaAPI
   [junit4]   2> Creating dataDir: C:\Users\jenkins\workspace\Lucene-Solr-6.x-Windows\solr\build\solr-core\test\J0\temp\solr.schema.TestManagedSchemaAPI_5635B27ECB49862A-001\init-core-data-001
   [junit4]   2> 1213558 INFO  (SUITE-TestManagedSchemaAPI-seed#[5635B27ECB49862A]-worker) [    ] o.a.s.SolrTestCaseJ4 Randomized ssl (true) and clientAuth (false) via: @org.apache.solr.util.RandomizeSSL(reason=, value=NaN, ssl=NaN, clientAuth=NaN)
   [junit4]   2> 1213562 INFO  (SUITE-TestManagedSchemaAPI-seed#[5635B27ECB49862A]-worker) [    ] o.a.s.c.ZkTestServer STARTING ZK TEST SERVER
   [junit4]   2> 1213563 INFO  (Thread-2672) [    ] o.a.s.c.ZkTestServer client port:0.0.0.0/0.0.0.0:0
   [junit4]   2> 1213563 INFO  (Thread-2672) [    ] o.a.s.c.ZkTestServer Starting server
   [junit4]   2> 1213663 INFO  (SUITE-TestManagedSchemaAPI-seed#[5635B27ECB49862A]-worker) [    ] o.a.s.c.ZkTestServer start zk server on port:63745
   [junit4]   2> 1213663 INFO  (SUITE-TestManagedSchemaAPI-seed#[5635B27ECB49862A]-worker) [    ] o.a.s.c.c.SolrZkClient Using default ZkCredentialsProvider
   [junit4]   2> 1213664 INFO  (SUITE-TestManagedSchemaAPI-seed#[5635B27ECB49862A]-worker) [    ] o.a.s.c.c.ConnectionManager Waiting for client to connect to ZooKeeper
   [junit4]   2> 1213672 INFO  (zkCallback-6924-thread-1) [    ] o.a.s.c.c.ConnectionManager Watcher org.apache.solr.common.cloud.ConnectionManager@7f7ecabd name:ZooKeeperConnection Watcher:127.0.0.1:63745 got event WatchedEvent state:SyncConnected type:None path:null path:null type:None
   [junit4]   2> 1213672 INFO  (SUITE-TestManagedSchemaAPI-seed#[5635B27ECB49862A]-worker) [    ] o.a.s.c.c.ConnectionManager Client is connected to ZooKeeper
   [junit4]   2> 1213672 INFO  (SUITE-TestManagedSchemaAPI-seed#[5635B27ECB49862A]-worker) [    ] o.a.s.c.c.SolrZkClient Using default ZkACLProvider
   [junit4]   2> 1213672 INFO  (SUITE-TestManagedSchemaAPI-seed#[5635B27ECB49862A]-worker) [    ] o.a.s.c.c.SolrZkClient makePath: /solr/solr.xml
   [junit4]   2> 1213683 INFO  (SUITE-TestManagedSchemaAPI-seed#[5635B27ECB49862A]-worker) [    ] o.a.s.c.c.SolrZkClient makePath: /solr/clusterprops.json
   [junit4]   2> 1213686 WARN  (NIOServerCxn.Factory:0.0.0.0/0.0.0.0:0) [    ] o.a.z.s.NIOServerCnxn caught end of stream exception
   [junit4]   2> EndOfStreamException: Unable to read additional data from client sessionid 0x155862ce4400000, likely client has closed socket
   [junit4]   2> 	at org.apache.zookeeper.server.NIOServerCnxn.doIO(NIOServerCnxn.java:228)
   [junit4]   2> 	at org.apache.zookeeper.server.NIOServerCnxnFactory.run(NIOServerCnxnFactory.java:208)
   [junit4]   2> 	at java.lang.Thread.run(Thread.java:745)
   [junit4]   2> 1213698 INFO  (jetty-launcher-6923-thread-1) [    ] o.e.j.s.Server jetty-9.3.8.v20160314
   [junit4]   2> 1213702 INFO  (jetty-launcher-6923-thread-1) [    ] o.e.j.s.h.ContextHandler Started o.e.j.s.ServletContextHandler@1cdc3a45{/solr,null,AVAILABLE}
   [junit4]   2> 1213706 INFO  (jetty-launcher-6923-thread-1) [    ] o.e.j.s.ServerConnector Started ServerConnector@75def5df{SSL,[ssl, http/1.1]}{127.0.0.1:63749}
   [junit4]   2> 1213707 INFO  (jetty-launcher-6923-thread-1) [    ] o.e.j.s.Server Started @1219941ms
   [junit4]   2> 1213707 INFO  (jetty-launcher-6923-thread-1) [    ] o.a.s.c.s.e.JettySolrRunner Jetty properties: {hostContext=/solr, hostPort=63749}
   [junit4]   2> 1213707 INFO  (jetty-launcher-6923-thread-1) [    ] o.a.s.s.SolrDispatchFilter SolrDispatchFilter.init(): sun.misc.Launcher$AppClassLoader@73d16e93
   [junit4]   2> 1213707 INFO  (jetty-launcher-6923-thread-1) [    ] o.a.s.c.SolrResourceLoader new SolrResourceLoader for directory: 'C:\Users\jenkins\workspace\Lucene-Solr-6.x-Windows\solr\build\solr-core\test\J0\temp\solr.schema.TestManagedSchemaAPI_5635B27ECB49862A-001\tempDir-001\node1'
   [junit4]   2> 1213707 INFO  (jetty-launcher-6923-thread-1) [    ] o.a.s.c.SolrResourceLoader JNDI not configured for solr (NoInitialContextEx)
   [junit4]   2> 1213707 INFO  (jetty-launcher-6923-thread-1) [    ] o.a.s.c.SolrResourceLoader solr home defaulted to 'solr/' (could not find system property or JNDI)
   [junit4]   2> 1213709 INFO  (jetty-launcher-6923-thread-1) [    ] o.a.s.c.c.SolrZkClient Using default ZkCredentialsProvider
   [junit4]   2> 1213712 INFO  (jetty-launcher-6923-thread-1) [    ] o.a.s.c.c.ConnectionManager Waiting for client to connect to ZooKeeper
   [junit4]   2> 1213715 INFO  (jetty-launcher-6923-thread-2) [    ] o.e.j.s.Server jetty-9.3.8.v20160314
   [junit4]   2> 1213716 INFO  (jetty-launcher-6923-thread-2) [    ] o.e.j.s.h.ContextHandler Started o.e.j.s.ServletContextHandler@4fb36335{/solr,null,AVAILABLE}
   [junit4]   2> 1213719 INFO  (jetty-launcher-6923-thread-2) [    ] o.e.j.s.ServerConnector Started ServerConnector@4fba0d65{SSL,[ssl, http/1.1]}{127.0.0.1:63754}
   [junit4]   2> 1213719 INFO  (jetty-launcher-6923-thread-2) [    ] o.e.j.s.Server Started @1219953ms
   [junit4]   2> 1213719 INFO  (jetty-launcher-6923-thread-2) [    ] o.a.s.c.s.e.JettySolrRunner Jetty properties: {hostContext=/solr, hostPort=63754}
   [junit4]   2> 1213719 INFO  (jetty-launcher-6923-thread-2) [    ] o.a.s.s.SolrDispatchFilter SolrDispatchFilter.init(): sun.misc.Launcher$AppClassLoader@73d16e93
   [junit4]   2> 1213720 INFO  (jetty-launcher-6923-thread-2) [    ] o.a.s.c.SolrResourceLoader new SolrResourceLoader for directory: 'C:\Users\jenkins\workspace\Lucene-Solr-6.x-Windows\solr\build\solr-core\test\J0\temp\solr.schema.TestManagedSchemaAPI_5635B27ECB49862A-001\tempDir-001\node2'
   [junit4]   2> 1213720 INFO  (jetty-launcher-6923-thread-2) [    ] o.a.s.c.SolrResourceLoader JNDI not configured for solr (NoInitialContextEx)
   [junit4]   2> 1213720 INFO  (jetty-launcher-6923-thread-2) [    ] o.a.s.c.SolrResourceLoader solr home defaulted to 'solr/' (could not find system property or JNDI)
   [junit4]   2> 1213721 INFO  (jetty-launcher-6923-thread-2) [    ] o.a.s.c.c.SolrZkClient Using default ZkCredentialsProvider
   [junit4]   2> 1213721 INFO  (jetty-launcher-6923-thread-2) [    ] o.a.s.c.c.ConnectionManager Waiting for client to connect to ZooKeeper
   [junit4]   2> 1213740 INFO  (zkCallback-6926-thread-1) [    ] o.a.s.c.c.ConnectionManager Watcher org.apache.solr.common.cloud.ConnectionManager@47e762d7 name:ZooKeeperConnection Watcher:127.0.0.1:63745/solr got event WatchedEvent state:SyncConnected type:None path:null path:null type:None
   [junit4]   2> 1213740 INFO  (jetty-launcher-6923-thread-2) [    ] o.a.s.c.c.ConnectionManager Client is connected to ZooKeeper
   [junit4]   2> 1213740 INFO  (zkCallback-6925-thread-1) [    ] o.a.s.c.c.ConnectionManager Watcher org.apache.solr.common.cloud.ConnectionManager@5e010995 name:ZooKeeperConnection Watcher:127.0.0.1:63745/solr got event WatchedEvent state:SyncConnected type:None path:null path:null type:None
   [junit4]   2> 1213741 INFO  (jetty-launcher-6923-thread-1) [    ] o.a.s.c.c.ConnectionManager Client is connected to ZooKeeper
   [junit4]   2> 1213741 INFO  (jetty-launcher-6923-thread-2) [    ] o.a.s.c.c.SolrZkClient Using default ZkACLProvider
   [junit4]   2> 1213741 INFO  (jetty-launcher-6923-thread-1) [    ] o.a.s.c.c.SolrZkClient Using default ZkACLProvider
   [junit4]   2> 1213742 INFO  (jetty-launcher-6923-thread-2) [    ] o.a.s.s.SolrDispatchFilter solr.xml found in ZooKeeper. Loading...
   [junit4]   2> 1213742 INFO  (jetty-launcher-6923-thread-1) [    ] o.a.s.s.SolrDispatchFilter solr.xml found in ZooKeeper. Loading...
   [junit4]   2> 1213762 INFO  (jetty-launcher-6923-thread-2) [    ] o.a.s.c.CorePropertiesLocator Config-defined core root directory: C:\Users\jenkins\workspace\Lucene-Solr-6.x-Windows\solr\build\solr-core\test\J0\temp\solr.schema.TestManagedSchemaAPI_5635B27ECB49862A-001\tempDir-001\node2\.
   [junit4]   2> 1213762 INFO  (jetty-launcher-6923-thread-2) [    ] o.a.s.c.CoreContainer New CoreContainer 141275178
   [junit4]   2> 1213762 INFO  (jetty-launcher-6923-thread-2) [    ] o.a.s.c.CoreContainer Loading cores into CoreContainer [instanceDir=C:\Users\jenkins\workspace\Lucene-Solr-6.x-Windows\solr\build\solr-core\test\J0\temp\solr.schema.TestManagedSchemaAPI_5635B27ECB49862A-001\tempDir-001\node2]
   [junit4]   2> 1213762 WARN  (jetty-launcher-6923-thread-2) [    ] o.a.s.c.CoreContainer Couldn't add files from C:\Users\jenkins\workspace\Lucene-Solr-6.x-Windows\solr\build\solr-core\test\J0\temp\solr.schema.TestManagedSchemaAPI_5635B27ECB49862A-001\tempDir-001\node2\lib to classpath: C:\Users\jenkins\workspace\Lucene-Solr-6.x-Windows\solr\build\solr-core\test\J0\temp\solr.schema.TestManagedSchemaAPI_5635B27ECB49862A-001\tempDir-001\node2\lib
   [junit4]   2> 1213763 INFO  (jetty-launcher-6923-thread-2) [    ] o.a.s.h.c.HttpShardHandlerFactory created with socketTimeout : 90000,urlScheme : https,connTimeout : 15000,maxConnectionsPerHost : 20,maxConnections : 10000,corePoolSize : 0,maximumPoolSize : 2147483647,maxThreadIdleTime : 5,sizeOfQueue : -1,fairnessPolicy : false,useRetries : false,
   [junit4]   2> 1213772 INFO  (jetty-launcher-6923-thread-2) [    ] o.a.s.u.UpdateShardHandler Creating UpdateShardHandler HTTP client with params: socketTimeout=340000&connTimeout=45000&retry=true
   [junit4]   2> 1213773 INFO  (jetty-launcher-6923-thread-2) [    ] o.a.s.l.LogWatcher SLF4J impl is org.slf4j.impl.Log4jLoggerFactory
   [junit4]   2> 1213774 INFO  (jetty-launcher-6923-thread-2) [    ] o.a.s.l.LogWatcher Registering Log Listener [Log4j (org.slf4j.impl.Log4jLoggerFactory)]
   [junit4]   2> 1213774 INFO  (jetty-launcher-6923-thread-2) [    ] o.a.s.c.ZkContainer Zookeeper client=127.0.0.1:63745/solr
   [junit4]   2> 1213774 INFO  (jetty-launcher-6923-thread-2) [    ] o.a.s.c.ZkController zkHost includes chroot
   [junit4]   2> 1213774 INFO  (jetty-launcher-6923-thread-2) [    ] o.a.s.c.c.SolrZkClient Using default ZkCredentialsProvider
   [junit4]   2> 1213776 INFO  (jetty-launcher-6923-thread-2) [    ] o.a.s.c.c.ConnectionManager Waiting for client to connect to ZooKeeper
   [junit4]   2> 1213776 INFO  (jetty-launcher-6923-thread-1) [    ] o.a.s.c.CorePropertiesLocator Config-defined core root directory: C:\Users\jenkins\workspace\Lucene-Solr-6.x-Windows\solr\build\solr-core\test\J0\temp\solr.schema.TestManagedSchemaAPI_5635B27ECB49862A-001\tempDir-001\node1\.
   [junit4]   2> 1213777 INFO  (jetty-launcher-6923-thread-1) [    ] o.a.s.c.CoreContainer New CoreContainer 1437019976
   [junit4]   2> 1213777 INFO  (jetty-launcher-6923-thread-1) [    ] o.a.s.c.CoreContainer Loading cores into CoreContainer [instanceDir=C:\Users\jenkins\workspace\Lucene-Solr-6.x-Windows\solr\build\solr-core\test\J0\temp\solr.schema.TestManagedSchemaAPI_5635B27ECB49862A-001\tempDir-001\node1]
   [junit4]   2> 1213778 WARN  (jetty-launcher-6923-thread-1) [    ] o.a.s.c.CoreContainer Couldn't add files from C:\Users\jenkins\workspace\Lucene-Solr-6.x-Windows\solr\build\solr-core\test\J0\temp\solr.schema.TestManagedSchemaAPI_5635B27ECB49862A-001\tempDir-001\node1\lib to classpath: C:\Users\jenkins\workspace\Lucene-Solr-6.x-Windows\solr\build\solr-core\test\J0\temp\solr.schema.TestManagedSchemaAPI_5635B27ECB49862A-001\tempDir-001\node1\lib
   [junit4]   2> 1213778 INFO  (jetty-launcher-6923-thread-1) [    ] o.a.s.h.c.HttpShardHandlerFactory created with socketTimeout : 90000,urlScheme : https,connTimeout : 15000,maxConnectionsPerHost : 20,maxConnections : 10000,corePoolSize : 0,maximumPoolSize : 2147483647,maxThreadIdleTime : 5,sizeOfQueue : -1,fairnessPolicy : false,useRetries : false,
   [junit4]   2> 1213779 INFO  (jetty-launcher-6923-thread-1) [    ] o.a.s.u.UpdateShardHandler Creating UpdateShardHandler HTTP client with params: socketTimeout=340000&connTimeout=45000&retry=true
   [junit4]   2> 1213779 INFO  (jetty-launcher-6923-thread-1) [    ] o.a.s.l.LogWatcher SLF4J impl is org.slf4j.impl.Log4jLoggerFactory
   [junit4]   2> 1213780 INFO  (jetty-launcher-6923-thread-1) [    ] o.a.s.l.LogWatcher Registering Log Listener [Log4j (org.slf4j.impl.Log4jLoggerFactory)]
   [junit4]   2> 1213780 INFO  (jetty-launcher-6923-thread-1) [    ] o.a.s.c.ZkContainer Zookeeper client=127.0.0.1:63745/solr
   [junit4]   2> 1213780 INFO  (jetty-launcher-6923-thread-1) [    ] o.a.s.c.ZkController zkHost includes chroot
   [junit4]   2> 1213780 INFO  (jetty-launcher-6923-thread-1) [    ] o.a.s.c.c.SolrZkClient Using default ZkCredentialsProvider
   [junit4]   2> 1213781 INFO  (jetty-launcher-6923-thread-1) [    ] o.a.s.c.c.ConnectionManager Waiting for client to connect to ZooKeeper
   [junit4]   2> 1213789 INFO  (zkCallback-6929-thread-1) [    ] o.a.s.c.c.ConnectionManager Watcher org.apache.solr.common.cloud.ConnectionManager@11584c50 name:ZooKeeperConnection Watcher:127.0.0.1:63745 got event WatchedEvent state:SyncConnected type:None path:null path:null type:None
   [junit4]   2> 1213789 INFO  (jetty-launcher-6923-thread-2) [    ] o.a.s.c.c.ConnectionManager Client is connected to ZooKeeper
   [junit4]   2> 1213789 INFO  (zkCallback-6932-thread-1) [    ] o.a.s.c.c.ConnectionManager Watcher org.apache.solr.common.cloud.ConnectionManager@3545d85b name:ZooKeeperConnection Watcher:127.0.0.1:63745 got event WatchedEvent state:SyncConnected type:None path:null path:null type:None
   [junit4]   2> 1213789 INFO  (jetty-launcher-6923-thread-1) [    ] o.a.s.c.c.ConnectionManager Client is connected to ZooKeeper
   [junit4]   2> 1213789 INFO  (jetty-launcher-6923-thread-2) [    ] o.a.s.c.c.SolrZkClient Using default ZkACLProvider
   [junit4]   2> 1213789 INFO  (jetty-launcher-6923-thread-1) [    ] o.a.s.c.c.SolrZkClient Using default ZkACLProvider
   [junit4]   2> 1213794 INFO  (jetty-launcher-6923-thread-1) [n:127.0.0.1:63749_solr    ] o.a.s.c.ZkController Added new OnReconnect listener org.apache.solr.cloud.ZkController$$Lambda$11/2058039450@222100dd
   [junit4]   2> 1213797 INFO  (jetty-launcher-6923-thread-2) [n:127.0.0.1:63754_solr    ] o.a.s.c.ZkController Added new OnReconnect listener org.apache.solr.cloud.ZkController$$Lambda$11/2058039450@f125442
   [junit4]   2> 1213797 INFO  (jetty-launcher-6923-thread-1) [n:127.0.0.1:63749_solr    ] o.a.s.c.c.ConnectionManager Waiting for client to connect to ZooKeeper
   [junit4]   2> 1213798 INFO  (jetty-launcher-6923-thread-2) [n:127.0.0.1:63754_solr    ] o.a.s.c.c.ConnectionManager Waiting for client to connect to ZooKeeper
   [junit4]   2> 1213801 INFO  (zkCallback-6933-thread-1-processing-n:127.0.0.1:63749_solr) [n:127.0.0.1:63749_solr    ] o.a.s.c.c.ConnectionManager Watcher org.apache.solr.common.cloud.ConnectionManager@6fd9c2be name:ZooKeeperConnection Watcher:127.0.0.1:63745/solr got event WatchedEvent state:SyncConnected type:None path:null path:null type:None
   [junit4]   2> 1213801 INFO  (jetty-launcher-6923-thread-1) [n:127.0.0.1:63749_solr    ] o.a.s.c.c.ConnectionManager Client is connected to ZooKeeper
   [junit4]   2> 1213804 INFO  (zkCallback-6934-thread-1-processing-n:127.0.0.1:63754_solr) [n:127.0.0.1:63754_solr    ] o.a.s.c.c.ConnectionManager Watcher org.apache.solr.common.cloud.ConnectionManager@280a0227 name:ZooKeeperConnection Watcher:127.0.0.1:63745/solr got event WatchedEvent state:SyncConnected type:None path:null path:null type:None
   [junit4]   2> 1213805 INFO  (jetty-launcher-6923-thread-2) [n:127.0.0.1:63754_solr    ] o.a.s.c.c.ConnectionManager Client is connected to ZooKeeper
   [junit4]   2> 1213809 INFO  (jetty-launcher-6923-thread-1) [n:127.0.0.1:63749_solr    ] o.a.s.c.c.SolrZkClient makePath: /overseer/queue
   [junit4]   2> 1213811 INFO  (jetty-launcher-6923-thread-2) [n:127.0.0.1:63754_solr    ] o.a.s.c.c.SolrZkClient makePath: /overseer/queue
   [junit4]   2> 1213814 INFO  (jetty-launcher-6923-thread-1) [n:127.0.0.1:63749_solr    ] o.a.s.c.c.SolrZkClient makePath: /overseer/collection-queue-work
   [junit4]   2> 1213815 INFO  (jetty-launcher-6923-thread-2) [n:127.0.0.1:63754_solr    ] o.a.s.c.c.SolrZkClient makePath: /overseer/collection-queue-work
   [junit4]   2> 1213820 INFO  (jetty-launcher-6923-thread-1) [n:127.0.0.1:63749_solr    ] o.a.s.c.c.SolrZkClient makePath: /overseer/collection-map-running
   [junit4]   2> 1213820 INFO  (jetty-launcher-6923-thread-2) [n:127.0.0.1:63754_solr    ] o.a.s.c.c.SolrZkClient makePath: /overseer/collection-map-running
   [junit4]   2> 1213822 INFO  (jetty-launcher-6923-thread-2) [n:127.0.0.1:63754_solr    ] o.a.s.c.c.SolrZkClient makePath: /overseer/collection-map-completed
   [junit4]   2> 1213822 INFO  (jetty-launcher-6923-thread-1) [n:127.0.0.1:63749_solr    ] o.a.s.c.c.SolrZkClient makePath: /overseer/collection-map-completed
   [junit4]   2> 1213824 INFO  (jetty-launcher-6923-thread-1) [n:127.0.0.1:63749_solr    ] o.a.s.c.c.SolrZkClient makePath: /overseer/collection-map-failure
   [junit4]   2> 1213825 INFO  (jetty-launcher-6923-thread-2) [n:127.0.0.1:63754_solr    ] o.a.s.c.c.SolrZkClient makePath: /overseer/collection-map-failure
   [junit4]   2> 1213827 INFO  (jetty-launcher-6923-thread-2) [n:127.0.0.1:63754_solr    ] o.a.s.c.c.SolrZkClient makePath: /live_nodes
   [junit4]   2> 1213827 INFO  (jetty-launcher-6923-thread-1) [n:127.0.0.1:63749_solr    ] o.a.s.c.c.SolrZkClient makePath: /live_nodes
   [junit4]   2> 1213829 INFO  (jetty-launcher-6923-thread-1) [n:127.0.0.1:63749_solr    ] o.a.s.c.c.SolrZkClient makePath: /collections
   [junit4]   2> 1213830 INFO  (jetty-launcher-6923-thread-2) [n:127.0.0.1:63754_solr    ] o.a.s.c.c.SolrZkClient makePath: /collections
   [junit4]   2> 1213832 INFO  (jetty-launcher-6923-thread-1) [n:127.0.0.1:63749_solr    ] o.a.s.c.c.SolrZkClient makePath: /aliases.json
   [junit4]   2> 1213833 INFO  (jetty-launcher-6923-thread-2) [n:127.0.0.1:63754_solr    ] o.a.s.c.c.SolrZkClient makePath: /aliases.json
   [junit4]   2> 1213836 INFO  (jetty-launcher-6923-thread-2) [n:127.0.0.1:63754_solr    ] o.a.s.c.c.SolrZkClient makePath: /clusterstate.json
   [junit4]   2> 1213836 INFO  (jetty-launcher-6923-thread-1) [n:127.0.0.1:63749_solr    ] o.a.s.c.c.SolrZkClient makePath: /clusterstate.json
   [junit4]   2> 1213837 INFO  (jetty-launcher-6923-thread-1) [n:127.0.0.1:63749_solr    ] o.a.s.c.c.SolrZkClient makePath: /security.json
   [junit4]   2> 1213837 INFO  (jetty-launcher-6923-thread-2) [n:127.0.0.1:63754_solr    ] o.a.s.c.c.SolrZkClient makePath: /security.json
   [junit4]   2> 1213838 INFO  (jetty-launcher-6923-thread-2) [n:127.0.0.1:63754_solr    ] o.a.s.c.c.ZkStateReader Updating cluster state from ZooKeeper... 
   [junit4]   2> 1213839 INFO  (jetty-launcher-6923-thread-1) [n:127.0.0.1:63749_solr    ] o.a.s.c.c.ZkStateReader Updating cluster state from ZooKeeper... 
   [junit4]   2> 1213840 INFO  (jetty-launcher-6923-thread-2) [n:127.0.0.1:63754_solr    ] o.a.s.c.c.ZkStateReader Loaded cluster properties: {urlScheme=https}
   [junit4]   2> 1213840 INFO  (jetty-launcher-6923-thread-1) [n:127.0.0.1:63749_solr    ] o.a.s.c.c.ZkStateReader Loaded cluster properties: {urlScheme=https}
   [junit4]   2> 1213840 INFO  (jetty-launcher-6923-thread-2) [n:127.0.0.1:63754_solr    ] o.a.s.c.c.ZkStateReader Updated live nodes from ZooKeeper... (0) -> (0)
   [junit4]   2> 1213840 INFO  (jetty-launcher-6923-thread-1) [n:127.0.0.1:63749_solr    ] o.a.s.c.c.ZkStateReader Updated live nodes from ZooKeeper... (0) -> (0)
   [junit4]   2> 1213844 INFO  (jetty-launcher-6923-thread-2) [n:127.0.0.1:63754_solr    ] o.a.s.c.c.SolrZkClient makePath: /overseer_elect
   [junit4]   2> 1213846 INFO  (jetty-launcher-6923-thread-1) [n:127.0.0.1:63749_solr    ] o.a.s.c.c.SolrZkClient makePath: /overseer_elect/election
   [junit4]   2> 1213846 INFO  (jetty-launcher-6923-thread-2) [n:127.0.0.1:63754_solr    ] o.a.s.c.c.SolrZkClient makePath: /overseer_elect/election
   [junit4]   2> 1213847 INFO  (jetty-launcher-6923-thread-2) [n:127.0.0.1:63754_solr    ] o.a.s.c.Overseer Overseer (id=null) closing
   [junit4]   2> 1213847 INFO  (jetty-launcher-6923-thread-1) [n:127.0.0.1:63749_solr    ] o.a.s.c.Overseer Overseer (id=null) closing
   [junit4]   2> 1213848 INFO  (jetty-launcher-6923-thread-1) [n:127.0.0.1:63749_solr    ] o.a.s.c.LeaderElector Joined leadership election with path: /overseer_elect/election/96130494424416261-127.0.0.1:63749_solr-n_0000000000
   [junit4]   2> 1213848 INFO  (jetty-launcher-6923-thread-2) [n:127.0.0.1:63754_solr    ] o.a.s.c.LeaderElector Joined leadership election with path: /overseer_elect/election/96130494424416262-127.0.0.1:63754_solr-n_0000000001
   [junit4]   2> 1213849 INFO  (jetty-launcher-6923-thread-1) [n:127.0.0.1:63749_solr    ] o.a.s.c.OverseerElectionContext I am going to be the leader 127.0.0.1:63749_solr
   [junit4]   2> 1213849 INFO  (jetty-launcher-6923-thread-1) [n:127.0.0.1:63749_solr    ] o.a.s.c.c.SolrZkClient makePath: /overseer_elect/leader
   [junit4]   2> 1213850 INFO  (jetty-launcher-6923-thread-2) [n:127.0.0.1:63754_solr    ] o.a.s.c.LeaderElector Watching path /overseer_elect/election/96130494424416261-127.0.0.1:63749_solr-n_0000000000 to know if I could be the leader
   [junit4]   2> 1213850 INFO  (jetty-launcher-6923-thread-2) [n:127.0.0.1:63754_solr    ] o.a.s.c.ZkController Register node as live in ZooKeeper:/live_nodes/127.0.0.1:63754_solr
   [junit4]   2> 1213851 INFO  (jetty-launcher-6923-thread-2) [n:127.0.0.1:63754_solr    ] o.a.s.c.c.SolrZkClient makePath: /live_nodes/127.0.0.1:63754_solr
   [junit4]   2> 1213851 INFO  (jetty-launcher-6923-thread-1) [n:127.0.0.1:63749_solr    ] o.a.s.c.Overseer Overseer (id=96130494424416261-127.0.0.1:63749_solr-n_0000000000) starting
   [junit4]   2> 1213852 INFO  (zkCallback-6933-thread-1-processing-n:127.0.0.1:63749_solr) [n:127.0.0.1:63749_solr    ] o.a.s.c.c.ZkStateReader A live node change: [WatchedEvent state:SyncConnected type:NodeChildrenChanged path:/live_nodes], has occurred - updating... (live nodes size: [0])
   [junit4]   2> 1213853 INFO  (zkCallback-6934-thread-1-processing-n:127.0.0.1:63754_solr) [n:127.0.0.1:63754_solr    ] o.a.s.c.c.ZkStateReader A live node change: [WatchedEvent state:SyncConnected type:NodeChildrenChanged path:/live_nodes], has occurred - updating... (live nodes size: [0])
   [junit4]   2> 1213854 INFO  (zkCallback-6933-thread-1-processing-n:127.0.0.1:63749_solr) [n:127.0.0.1:63749_solr    ] o.a.s.c.c.ZkStateReader Updated live nodes from ZooKeeper... (0) -> (1)
   [junit4]   2> 1213856 INFO  (jetty-launcher-6923-thread-1) [n:127.0.0.1:63749_solr    ] o.a.s.c.c.SolrZkClient makePath: /overseer/queue-work
   [junit4]   2> 1213860 INFO  (zkCallback-6934-thread-1-processing-n:127.0.0.1:63754_solr) [n:127.0.0.1:63754_solr    ] o.a.s.c.c.ZkStateReader Updated live nodes from ZooKeeper... (0) -> (1)
   [junit4]   2> 1213872 INFO  (jetty-launcher-6923-thread-2) [n:127.0.0.1:63754_solr    ] o.a.s.c.CoreContainer Security conf doesn't exist. Skipping setup for authorization module.
   [junit4]   2> 1213873 INFO  (jetty-launcher-6923-thread-2) [n:127.0.0.1:63754_solr    ] o.a.s.c.CoreContainer No authentication plugin used.
   [junit4]   2> 1213874 INFO  (jetty-launcher-6923-thread-2) [n:127.0.0.1:63754_solr    ] o.a.s.c.CorePropertiesLocator Looking for core definitions underneath C:\Users\jenkins\workspace\Lucene-Solr-6.x-Windows\solr\build\solr-core\test\J0\temp\solr.schema.TestManagedSchemaAPI_5635B27ECB49862A-001\tempDir-001\node2\.
   [junit4]   2> 1213876 INFO  (jetty-launcher-6923-thread-2) [n:127.0.0.1:63754_solr    ] o.a.s.c.CorePropertiesLocator Found 0 core definitions
   [junit4]   2> 1213877 INFO  (jetty-launcher-6923-thread-2) [n:127.0.0.1:63754_solr    ] o.a.s.s.SolrDispatchFilter user.dir=C:\Users\jenkins\workspace\Lucene-Solr-6.x-Windows\solr\build\solr-core\test\J0
   [junit4]   2> 1213877 INFO  (jetty-launcher-6923-thread-2) [n:127.0.0.1:63754_solr    ] o.a.s.s.SolrDispatchFilter SolrDispatchFilter.init() done
   [junit4]   2> 1213880 INFO  (jetty-launcher-6923-thread-1) [n:127.0.0.1:63749_solr    ] o.a.s.c.OverseerAutoReplicaFailoverThread Starting OverseerAutoReplicaFailoverThread autoReplicaFailoverWorkLoopDelay=10000 autoReplicaFailoverWaitAfterExpiration=30000 autoReplicaFailoverBadNodeExpiration=60000
   [junit4]   2> 1213881 INFO  (OverseerCollectionConfigSetProcessor-96130494424416261-127.0.0.1:63749_solr-n_0000000000) [n:127.0.0.1:63749_solr    ] o.a.s.c.OverseerTaskProcessor Process current queue of overseer operations
   [junit4]   2> 1213881 INFO  (jetty-launcher-6923-thread-1) [n:127.0.0.1:63749_solr    ] o.a.s.c.ZkController Publish node=127.0.0.1:63749_solr as DOWN
   [junit4]   2> 1213882 INFO  (OverseerStateUpdate-96130494424416261-127.0.0.1:63749_solr-n_0000000000) [n:127.0.0.1:63749_solr    ] o.a.s.c.Overseer Starting to work on the main queue
   [junit4]   2> 1213887 INFO  (OverseerStateUpdate-96130494424416261-127.0.0.1:63749_solr-n_0000000000) [n:127.0.0.1:63749_solr    ] o.a.s.c.c.ZkStateReader Updated live nodes from ZooKeeper... (1) -> (1)
   [junit4]   2> 1213892 INFO  (OverseerStateUpdate-96130494424416261-127.0.0.1:63749_solr-n_0000000000) [n:127.0.0.1:63749_solr    ] o.a.s.c.Overseer processMessage: queueSize: 1, message = {
   [junit4]   2>   "operation":"downnode",
   [junit4]   2>   "node_name":"127.0.0.1:63749_solr"} current state version: 0
   [junit4]   2> 1213892 INFO  (OverseerStateUpdate-96130494424416261-127.0.0.1:63749_solr-n_0000000000) [n:127.0.0.1:63749_solr    ] o.a.s.c.o.NodeMutator DownNode state invoked for node: 127.0.0.1:63749_solr
   [junit4]   2> 1214887 INFO  (jetty-launcher-6923-thread-1) [n:127.0.0.1:63749_solr    ] o.a.s.c.ZkController Register node as live in ZooKeeper:/live_nodes/127.0.0.1:63749_solr
   [junit4]   2> 1214888 INFO  (jetty-launcher-6923-thread-1) [n:127.0.0.1:63749_solr    ] o.a.s.c.c.SolrZkClient makePath: /live_nodes/127.0.0.1:63749_solr
   [junit4]   2> 1214890 INFO  (zkCallback-6934-thread-1-processing-n:127.0.0.1:63754_solr) [n:127.0.0.1:63754_solr    ] o.a.s.c.c.ZkStateReader A live node change: [WatchedEvent state:SyncConnected type:NodeChildrenChanged path:/live_nodes], has occurred - updating... (live nodes size: [1])
   [junit4]   2> 1214890 INFO  (zkCallback-6933-thread-1-processing-n:127.0.0.1:63749_solr) [n:127.0.0.1:63749_solr    ] o.a.s.c.c.ZkStateReader A live node change: [WatchedEvent state:SyncConnected type:NodeChildrenChanged path:/live_nodes], has occurred - updating... (live nodes size: [1])
   [junit4]   2> 1214895 INFO  (zkCallback-6933-thread-1-processing-n:127.0.0.1:63749_solr) [n:127.0.0.1:63749_solr    ] o.a.s.c.c.ZkStateReader Updated live nodes from ZooKeeper... (1) -> (2)
   [junit4]   2> 1214896 INFO  (zkCallback-6934-thread-1-processing-n:127.0.0.1:63754_solr) [n:127.0.0.1:63754_solr    ] o.a.s.c.c.ZkStateReader Updated live nodes from ZooKeeper... (1) -> (2)
   [junit4]   2> 1214907 INFO  (jetty-launcher-6923-thread-1) [n:127.0.0.1:63749_solr    ] o.a.s.c.CoreContainer Security conf doesn't exist. Skipping setup for authorization module.
   [junit4]   2> 1214907 INFO  (jetty-launcher-6923-thread-1) [n:127.0.0.1:63749_solr    ] o.a.s.c.CoreContainer No authentication plugin used.
   [junit4]   2> 1214908 INFO  (jetty-launcher-6923-thread-1) [n:127.0.0.1:63749_solr    ] o.a.s.c.CorePropertiesLocator Looking for core definitions underneath C:\Users\jenkins\workspace\Lucene-Solr-6.x-Windows\solr\build\solr-core\test\J0\temp\solr.schema.TestManagedSchemaAPI_5635B27ECB49862A-001\tempDir-001\node1\.
   [junit4]   2> 1214910 INFO  (jetty-launcher-6923-thread-1) [n:127.0.0.1:63749_solr    ] o.a.s.c.CorePropertiesLocator Found 0 core definitions
   [junit4]   2> 1214910 INFO  (jetty-launcher-6923-thread-1) [n:127.0.0.1:63749_solr    ] o.a.s.s.SolrDispatchFilter user.dir=C:\Users\jenkins\workspace\Lucene-Solr-6.x-Windows\solr\build\solr-core\test\J0
   [junit4]   2> 1214910 INFO  (jetty-launcher-6923-thread-1) [n:127.0.0.1:63749_solr    ] o.a.s.s.SolrDispatchFilter SolrDispatchFilter.init() done
   [junit4]   2> 1214911 INFO  (SUITE-TestManagedSchemaAPI-seed#[5635B27ECB49862A]-worker) [    ] o.a.s.c.c.SolrZkClient Using default ZkCredentialsProvider
   [junit4]   2> 1214912 INFO  (SUITE-TestManagedSchemaAPI-seed#[5635B27ECB49862A]-worker) [    ] o.a.s.c.c.ConnectionManager Waiting for client to connect to ZooKeeper
   [junit4]   2> 1214914 INFO  (zkCallback-6937-thread-1) [    ] o.a.s.c.c.ConnectionManager Watcher org.apache.solr.common.cloud.ConnectionManager@3c392065 name:ZooKeeperConnection Watcher:127.0.0.1:63745 got event WatchedEvent state:SyncConnected type:None path:null path:null type:None
   [junit4]   2> 1214915 INFO  (SUITE-TestManagedSchemaAPI-seed#[5635B27ECB49862A]-worker) [    ] o.a.s.c.c.ConnectionManager Client is connected to ZooKeeper
   [junit4]   2> 1214915 INFO  (SUITE-TestManagedSchemaAPI-seed#[5635B27ECB49862A]-worker) [    ] o.a.s.c.c.SolrZkClient Using default ZkACLProvider
   [junit4]   2> 1214923 INFO  (SUITE-TestManagedSchemaAPI-seed#[5635B27ECB49862A]-worker) [    ] o.a.s.c.s.i.CloudSolrClient Final constructed zkHost string: 127.0.0.1:63745/solr
   [junit4]   2> 1214924 INFO  (SUITE-TestManagedSchemaAPI-seed#[5635B27ECB49862A]-worker) [    ] o.a.s.c.c.SolrZkClient Using default ZkCredentialsProvider
   [junit4]   2> 1214928 INFO  (SUITE-TestManagedSchemaAPI-seed#[5635B27ECB49862A]-worker) [    ] o.a.s.c.c.ConnectionManager Waiting for client to connect to ZooKeeper
   [junit4]   2> 1214930 INFO  (zkCallback-6940-thread-1) [    ] o.a.s.c.c.ConnectionManager Watcher org.apache.solr.common.cloud.ConnectionManager@307f3206 name:ZooKeeperConnection Watcher:127.0.0.1:63745/solr got event WatchedEvent state:SyncConnected type:None path:null path:null type:None
   [junit4]   2> 1214930 INFO  (SUITE-TestManagedSchemaAPI-seed#[5635B27ECB49862A]-worker) [    ] o.a.s.c.c.ConnectionManager Client is connected to ZooKeeper
   [junit4]   2> 1214930 INFO  (SUITE-TestManagedSchemaAPI-seed#[5635B27ECB49862A]-worker) [    ] o.a.s.c.c.SolrZkClient Using default ZkACLProvider
   [junit4]   2> 1214930 INFO  (SUITE-TestManagedSchemaAPI-seed#[5635B27ECB49862A]-worker) [    ] o.a.s.c.c.ZkStateReader Updating cluster state from ZooKeeper... 
   [junit4]   2> 1214931 INFO  (SUITE-TestManagedSchemaAPI-seed#[5635B27ECB49862A]-worker) [    ] o.a.s.c.c.ZkStateReader Loaded cluster properties: {urlScheme=https}
   [junit4]   2> 1214932 INFO  (SUITE-TestManagedSchemaAPI-seed#[5635B27ECB49862A]-worker) [    ] o.a.s.c.c.ZkStateReader Updated live nodes from ZooKeeper... (0) -> (2)
   [junit4]   2> 1214938 INFO  (SUITE-TestManagedSchemaAPI-seed#[5635B27ECB49862A]-worker) [    ] o.a.s.c.c.SolrZkClient makePath: /configs/conf1/managed-schema
   [junit4]   2> 1214943 INFO  (SUITE-TestManagedSchemaAPI-seed#[5635B27ECB49862A]-worker) [    ] o.a.s.c.c.SolrZkClient makePath: /configs/conf1/solrconfig.xml
   [junit4]   2> 1214979 INFO  (TEST-TestManagedSchemaAPI.test-seed#[5635B27ECB49862A]) [    ] o.a.s.SolrTestCaseJ4 ###Starting test
   [junit4]   2> 1215034 INFO  (qtp1767843328-28405) [n:127.0.0.1:63754_solr    ] o.a.s.h.a.CollectionsHandler Invoked Collection Action :create with params replicationFactor=2&collection.configName=conf1&name=testschemaapi&action=CREATE&numShards=1&wt=javabin&version=2 and sendToOCPQueue=true
   [junit4]   2> 1215039 INFO  (OverseerCollectionConfigSetProcessor-96130494424416261-127.0.0.1:63749_solr-n_0000000000) [n:127.0.0.1:63749_solr    ] o.a.s.c.OverseerTaskProcessor Overseer Collection Message Handler: Get the message id:/overseer/collection-queue-work/qn-0000000000 message:{
   [junit4]   2>   "name":"testschemaapi",
   [junit4]   2>   "fromApi":"true",
   [junit4]   2>   "replicationFactor":"2",
   [junit4]   2>   "collection.configName":"conf1",
   [junit4]   2>   "numShards":"1",
   [junit4]   2>   "stateFormat":"2",
   [junit4]   2>   "operation":"create"}
   [junit4]   2> 1215043 INFO  (OverseerThreadFactory-4595-thread-1-processing-n:127.0.0.1:63749_solr) [n:127.0.0.1:63749_solr    ] o.a.s.c.OverseerCollectionMessageHandler OverseerCollectionMessageHandler.processMessage : create , {
   [junit4]   2>   "name":"testschemaapi",
   [junit4]   2>   "fromApi":"true",
   [junit4]   2>   "replicationFactor":"2",
   [junit4]   2>   "collection.configName":"conf1",
   [junit4]   2>   "numShards":"1",
   [junit4]   2>   "stateFormat":"2",
   [junit4]   2>   "operation":"create"}
   [junit4]   2> 1215043 INFO  (OverseerThreadFactory-4595-thread-1-processing-n:127.0.0.1:63749_solr) [n:127.0.0.1:63749_solr    ] o.a.s.c.OverseerCollectionMessageHandler Create collection testschemaapi
   [junit4]   2> 1215045 INFO  (OverseerThreadFactory-4595-thread-1-processing-n:127.0.0.1:63749_solr) [n:127.0.0.1:63749_solr    ] o.a.s.c.OverseerCollectionMessageHandler creating collections conf node /collections/testschemaapi 
   [junit4]   2> 1215046 INFO  (OverseerThreadFactory-4595-thread-1-processing-n:127.0.0.1:63749_solr) [n:127.0.0.1:63749_solr    ] o.a.s.c.c.SolrZkClient makePath: /collections/testschemaapi
   [junit4]   2> 1215050 INFO  (zkCallback-6934-thread-1-processing-n:127.0.0.1:63754_solr) [n:127.0.0.1:63754_solr    ] o.a.s.c.c.ZkStateReader A collections change: [WatchedEvent state:SyncConnected type:NodeChildrenChanged path:/collections], has occurred - updating...
   [junit4]   2> 1215050 INFO  (zkCallback-6933-thread-1-processing-n:127.0.0.1:63749_solr) [n:127.0.0.1:63749_solr    ] o.a.s.c.c.ZkStateReader A collections change: [WatchedEvent state:SyncConnected type:NodeChildrenChanged path:/collections], has occurred - updating...
   [junit4]   2> 1215051 INFO  (zkCallback-6940-thread-1) [    ] o.a.s.c.c.ZkStateReader A collections change: [WatchedEvent state:SyncConnected type:NodeChildrenChanged path:/collections], has occurred - updating...
   [junit4]   2> 1215057 INFO  (OverseerStateUpdate-96130494424416261-127.0.0.1:63749_solr-n_0000000000) [n:127.0.0.1:63749_solr    ] o.a.s.c.Overseer processMessage: queueSize: 1, message = {
   [junit4]   2>   "name":"testschemaapi",
   [junit4]   2>   "fromApi":"true",
   [junit4]   2>   "replicationFactor":"2",
   [junit4]   2>   "collection.configName":"conf1",
   [junit4]   2>   "numShards":"1",
   [junit4]   2>   "stateFormat":"2",
   [junit4]   2>   "operation":"create"} current state version: 0
   [junit4]   2> 1215057 INFO  (OverseerStateUpdate-96130494424416261-127.0.0.1:63749_solr-n_0000000000) [n:127.0.0.1:63749_solr    ] o.a.s.c.o.ClusterStateMutator building a new cName: testschemaapi
   [junit4]   2> 1215060 INFO  (OverseerStateUpdate-96130494424416261-127.0.0.1:63749_solr-n_0000000000) [n:127.0.0.1:63749_solr    ] o.a.s.c.o.ZkStateWriter going to create_collection /collections/testschemaapi/state.json
   [junit4]   2> 1215157 INFO  (OverseerThreadFactory-4595-thread-1-processing-n:127.0.0.1:63749_solr) [n:127.0.0.1:63749_solr    ] o.a.s.c.OverseerCollectionMessageHandler Creating SolrCores for new collection testschemaapi, shardNames [shard1] , replicationFactor : 2
   [junit4]   2> 1215157 INFO  (OverseerThreadFactory-4595-thread-1-processing-n:127.0.0.1:63749_solr) [n:127.0.0.1:63749_solr    ] o.a.s.c.OverseerCollectionMessageHandler Creating core testschemaapi_shard1_replica1 as part of shard shard1 of collection testschemaapi on 127.0.0.1:63749_solr
   [junit4]   2> 1215158 INFO  (OverseerThreadFactory-4595-thread-1-processing-n:127.0.0.1:63749_solr) [n:127.0.0.1:63749_solr    ] o.a.s.c.OverseerCollectionMessageHandler Creating core testschemaapi_shard1_replica2 as part of shard shard1 of collection testschemaapi on 127.0.0.1:63754_solr
   [junit4]   2> 1215234 INFO  (qtp1767843328-28403) [n:127.0.0.1:63754_solr    ] o.a.s.h.a.CoreAdminOperation core create command qt=/admin/cores&collection.configName=conf1&name=testschemaapi_shard1_replica2&action=CREATE&numShards=1&collection=testschemaapi&shard=shard1&wt=javabin&version=2
   [junit4]   2> 1215236 INFO  (qtp1767843328-28403) [n:127.0.0.1:63754_solr    ] o.a.s.c.CoreDescriptor Created CoreDescriptor: {name=testschemaapi_shard1_replica2, collection.configName=conf1, config=solrconfig.xml, transient=false, schema=schema.xml, loadOnStartup=true, configSetProperties=configsetprops.json, collection=testschemaapi, numShards=1, dataDir=data\, shard=shard1}
   [junit4]   2> 1215238 INFO  (qtp1767843328-28403) [n:127.0.0.1:63754_solr c:testschemaapi s:shard1  x:testschemaapi_shard1_replica2] o.a.s.c.ZkController publishing state=down
   [junit4]   2> 1215240 INFO  (qtp1767843328-28403) [n:127.0.0.1:63754_solr c:testschemaapi s:shard1  x:testschemaapi_shard1_replica2] o.a.s.c.ZkController Registering watch for collection testschemaapi
   [junit4]   2> 1215244 INFO  (qtp1767843328-28403) [n:127.0.0.1:63754_solr c:testschemaapi s:shard1  x:testschemaapi_shard1_replica2] o.a.s.c.c.ZkStateReader Add data for [testschemaapi] ver [0]
   [junit4]   2> 1215244 INFO  (qtp1767843328-28403) [n:127.0.0.1:63754_solr c:testschemaapi s:shard1  x:testschemaapi_shard1_replica2] o.a.s.c.ZkController look for our core node name
   [junit4]   2> 1215271 INFO  (qtp416395821-28393) [n:127.0.0.1:63749_solr    ] o.a.s.h.a.CoreAdminOperation core create command qt=/admin/cores&collection.configName=conf1&name=testschemaapi_shard1_replica1&action=CREATE&numShards=1&collection=testschemaapi&shard=shard1&wt=javabin&version=2
   [junit4]   2> 1215274 INFO  (qtp416395821-28393) [n:127.0.0.1:63749_solr    ] o.a.s.c.CoreDescriptor Created CoreDescriptor: {name=testschemaapi_shard1_replica1, collection.configName=conf1, config=solrconfig.xml, transient=false, schema=schema.xml, loadOnStartup=true, configSetProperties=configsetprops.json, collection=testschemaapi, numShards=1, dataDir=data\, shard=shard1}
   [junit4]   2> 1215281 INFO  (qtp416395821-28393) [n:127.0.0.1:63749_solr c:testschemaapi s:shard1  x:testschemaapi_shard1_replica1] o.a.s.c.ZkController publishing state=down
   [junit4]   2> 1215281 INFO  (OverseerStateUpdate-96130494424416261-127.0.0.1:63749_solr-n_0000000000) [n:127.0.0.1:63749_solr    ] o.a.s.c.Overseer processMessage: queueSize: 1, message = {
   [junit4]   2>   "core":"testschemaapi_shard1_replica2",
   [junit4]   2>   "roles":null,
   [junit4]   2>   "base_url":"https://127.0.0.1:63754/solr",
   [junit4]   2>   "node_name":"127.0.0.1:63754_solr",
   [junit4]   2>   "numShards":"1",
   [junit4]   2>   "state":"down",
   [junit4]   2>   "shard":"shard1",
   [junit4]   2>   "collection":"testschemaapi",
   [junit4]   2>   "operation":"state"} current state version: 0
   [junit4]   2> 1215281 INFO  (OverseerStateUpdate-96130494424416261-127.0.0.1:63749_solr-n_0000000000) [n:127.0.0.1:63749_solr    ] o.a.s.c.o.ReplicaMutator Update state numShards=1 message={
   [junit4]   2>   "core":"testschemaapi_shard1_replica2",
   [junit4]   2>   "roles":null,
   [junit4]   2>   "base_url":"https://127.0.0.1:63754/solr",
   [junit4]   2>   "node_name":"127.0.0.1:63754_solr",
   [junit4]   2>   "numShards":"1",
   [junit4]   2>   "state":"down",
   [junit4]   2>   "shard":"shard1",
   [junit4]   2>   "collection":"testschemaapi",
   [junit4]   2>   "operation":"state"}
   [junit4]   2> 1215300 INFO  (qtp416395821-28393) [n:127.0.0.1:63749_solr c:testschemaapi s:shard1  x:testschemaapi_shard1_replica1] o.a.s.c.ZkController Registering watch for collection testschemaapi
   [junit4]   2> 1215301 INFO  (qtp416395821-28393) [n:127.0.0.1:63749_solr c:testschemaapi s:shard1  x:testschemaapi_shard1_replica1] o.a.s.c.c.ZkStateReader Add data for [testschemaapi] ver [0]
   [junit4]   2> 1215301 INFO  (qtp416395821-28393) [n:127.0.0.1:63749_solr c:testschemaapi s:shard1  x:testschemaapi_shard1_replica1] o.a.s.c.ZkController look for our core node name
   [junit4]   2> 1215310 INFO  (OverseerStateUpdate-96130494424416261-127.0.0.1:63749_solr-n_0000000000) [n:127.0.0.1:63749_solr    ] o.a.s.c.Overseer processMessage: queueSize: 1, message = {
   [junit4]   2>   "core":"testschemaapi_shard1_replica1",
   [junit4]   2>   "roles":null,
   [junit4]   2>   "base_url":"https://127.0.0.1:63749/solr",
   [junit4]   2>   "node_name":"127.0.0.1:63749_solr",
   [junit4]   2>   "numShards":"1",
   [junit4]   2>   "state":"down",
   [junit4]   2>   "shard":"shard1",
   [junit4]   2>   "collection":"testschemaapi",
   [junit4]   2>   "operation":"state"} current state version: 0
   [junit4]   2> 1215310 INFO  (OverseerStateUpdate-96130494424416261-127.0.0.1:63749_solr-n_0000000000) [n:127.0.0.1:63749_solr    ] o.a.s.c.o.ReplicaMutator Update state numShards=1 message={
   [junit4]   2>   "core":"testschemaapi_shard1_replica1",
   [junit4]   2>   "roles":null,
   [junit4]   2>   "base_url":"https://127.0.0.1:63749/solr",
   [junit4]   2>   "node_name":"127.0.0.1:63749_solr",
   [junit4]   2>   "numShards":"1",
   [junit4]   2>   "state":"down",
   [junit4]   2>   "shard":"shard1",
   [junit4]   2>   "collection":"testschemaapi",
   [junit4]   2>   "operation":"state"}
   [junit4]   2> 1215414 INFO  (OverseerStateUpdate-96130494424416261-127.0.0.1:63749_solr-n_0000000000) [n:127.0.0.1:63749_solr    ] o.a.s.c.o.ZkStateWriter going to update_collection /collections/testschemaapi/state.json version: 0
   [junit4]   2> 1215416 INFO  (zkCallback-6934-thread-1-processing-n:127.0.0.1:63754_solr) [n:127.0.0.1:63754_solr    ] o.a.s.c.c.ZkStateReader A cluster state change: [WatchedEvent state:SyncConnected type:NodeDataChanged path:/collections/testschemaapi/state.json] for collection [testschemaapi] has occurred - updating... (live nodes size: [2])
   [junit4]   2> 1215416 INFO  (zkCallback-6933-thread-1-processing-n:127.0.0.1:63749_solr) [n:127.0.0.1:63749_solr    ] o.a.s.c.c.ZkStateReader A cluster state change: [WatchedEvent state:SyncConnected type:NodeDataChanged path:/collections/testschemaapi/state.json] for collection [testschemaapi] has occurred - updating... (live nodes size: [2])
   [junit4]   2> 1215417 INFO  (zkCallback-6934-thread-1-processing-n:127.0.0.1:63754_solr) [n:127.0.0.1:63754_solr    ] o.a.s.c.c.ZkStateReader Updating data for [testschemaapi] from [0] to [1]
   [junit4]   2> 1215417 INFO  (zkCallback-6933-thread-1-processing-n:127.0.0.1:63749_solr) [n:127.0.0.1:63749_solr    ] o.a.s.c.c.ZkStateReader Updating data for [testschemaapi] from [0] to [1]
   [junit4]   2> 1216244 INFO  (qtp1767843328-28403) [n:127.0.0.1:63754_solr c:testschemaapi s:shard1  x:testschemaapi_shard1_replica2] o.a.s.c.ZkController waiting to find shard id in clusterstate for testschemaapi_shard1_replica2
   [junit4]   2> 1216244 INFO  (qtp1767843328-28403) [n:127.0.0.1:63754_solr c:testschemaapi s:shard1  x:testschemaapi_shard1_replica2] o.a.s.c.ZkController Check for collection zkNode:testschemaapi
   [junit4]   2> 1216245 INFO  (qtp1767843328-28403) [n:127.0.0.1:63754_solr c:testschemaapi s:shard1  x:testschemaapi_shard1_replica2] o.a.s.c.ZkController Collection zkNode exists
   [junit4]   2> 1216245 INFO  (qtp1767843328-28403) [n:127.0.0.1:63754_solr c:testschemaapi s:shard1  x:testschemaapi_shard1_replica2] o.a.s.c.c.ZkStateReader Load collection config from: [/collections/testschemaapi]
   [junit4]   2> 1216246 INFO  (qtp1767843328-28403) [n:127.0.0.1:63754_solr c:testschemaapi s:shard1  x:testschemaapi_shard1_replica2] o.a.s.c.c.ZkStateReader path=[/collections/testschemaapi] [configName]=[conf1] specified config exists in ZooKeeper
   [junit4]   2> 1216246 INFO  (qtp1767843328-28403) [n:127.0.0.1:63754_solr c:testschemaapi s:shard1  x:testschemaapi_shard1_replica2] o.a.s.c.SolrResourceLoader new SolrResourceLoader for directory: 'C:\Users\jenkins\workspace\Lucene-Solr-6.x-Windows\solr\build\solr-core\test\J0\temp\solr.schema.TestManagedSchemaAPI_5635B27ECB49862A-001\tempDir-001\node2\testschemaapi_shard1_replica2'
   [junit4]   2> 1216247 INFO  (qtp1767843328-28403) [n:127.0.0.1:63754_solr c:testschemaapi s:shard1  x:testschemaapi_shard1_replica2] o.a.s.c.SolrResourceLoader JNDI not configured for solr (NoInitialContextEx)
   [junit4]   2> 1216247 INFO  (qtp1767843328-28403) [n:127.0.0.1:63754_solr c:testschemaapi s:shard1  x:testschemaapi_shard1_replica2] o.a.s.c.SolrResourceLoader solr home defaulted to 'solr/' (could not find system property or JNDI)
   [junit4]   2> 1216256 INFO  (qtp1767843328-28403) [n:127.0.0.1:63754_solr c:testschemaapi s:shard1  x:testschemaapi_shard1_replica2] o.a.s.c.Config loaded config solrconfig.xml with version 0 
   [junit4]   2> 1216267 INFO  (qtp1767843328-28403) [n:127.0.0.1:63754_solr c:testschemaapi s:shard1  x:testschemaapi_shard1_replica2] o.a.s.c.SolrConfig current version of requestparams : -1
   [junit4]   2> 1216272 INFO  (qtp1767843328-28403) [n:127.0.0.1:63754_solr c:testschemaapi s:shard1  x:testschemaapi_shard1_replica2] o.a.s.c.SolrConfig Using Lucene MatchVersion: 6.2.0
   [junit4]   2> 1216282 INFO  (qtp1767843328-28403) [n:127.0.0.1:63754_solr c:testschemaapi s:shard1  x:testschemaapi_shard1_replica2] o.a.s.c.SolrConfig Loaded SolrConfig: solrconfig.xml
   [junit4]   2> 1216301 INFO  (qtp416395821-28393) [n:127.0.0.1:63749_solr c:testschemaapi s:shard1  x:testschemaapi_shard1_replica1] o.a.s.c.ZkController waiting to find shard id in clusterstate for testschemaapi_shard1_replica1
   [junit4]   2> 1216301 INFO  (qtp416395821-28393) [n:127.0.0.1:63749_solr c:testschemaapi s:shard1  x:testschemaapi_shard1_replica1] o.a.s.c.ZkController Check for collection zkNode:testschemaapi
   [junit4]   2> 1216301 INFO  (qtp416395821-28393) [n:127.0.0.1:63749_solr c:testschemaapi s:shard1  x:testschemaapi_shard1_replica1] o.a.s.c.ZkController Collection zkNode exists
   [junit4]   2> 1216301 INFO  (qtp416395821-28393) [n:127.0.0.1:63749_solr c:testschemaapi s:shard1  x:testschemaapi_shard1_replica1] o.a.s.c.c.ZkStateReader Load collection config from: [/collections/testschemaapi]
   [junit4]   2> 1216302 INFO  (qtp416395821-28393) [n:127.0.0.1:63749_solr c:testschemaapi s:shard1  x:testschemaapi_shard1_replica1] o.a.s.c.c.ZkStateReader path=[/collections/testschemaapi] [configName]=[conf1] specified config exists in ZooKeeper
   [junit4]   2> 1216302 INFO  (qtp416395821-28393) [n:127.0.0.1:63749_solr c:testschemaapi s:shard1  x:testschemaapi_shard1_replica1] o.a.s.c.SolrResourceLoader new SolrResourceLoader for directory: 'C:\Users\jenkins\workspace\Lucene-Solr-6.x-Windows\solr\build\solr-core\test\J0\temp\solr.schema.TestManagedSchemaAPI_5635B27ECB49862A-001\tempDir-001\node1\testschemaapi_shard1_replica1'
   [junit4]   2> 1216304 INFO  (qtp416395821-28393) [n:127.0.0.1:63749_solr c:testschemaapi s:shard1  x:testschemaapi_shard1_replica1] o.a.s.c.SolrResourceLoader JNDI not configured for solr (NoInitialContextEx)
   [junit4]   2> 1216305 INFO  (qtp416395821-28393) [n:127.0.0.1:63749_solr c:testschemaapi s:shard1  x:testschemaapi_shard1_replica1] o.a.s.c.SolrResourceLoader solr home defaulted to 'solr/' (could not find system property or JNDI)
   [junit4]   2> 1216309 INFO  (qtp416395821-28393) [n:127.0.0.1:63749_solr c:testschemaapi s:shard1  x:testschemaapi_shard1_replica1] o.a.s.c.Config loaded config solrconfig.xml with version 0 
   [junit4]   2> 1216317 INFO  (qtp1767843328-28403) [n:127.0.0.1:63754_solr c:testschemaapi s:shard1  x:testschemaapi_shard1_replica2] o.a.s.s.IndexSchema [testschemaapi_shard1_replica2] Schema name=minimal
   [junit4]   2> 1216321 INFO  (qtp416395821-28393) [n:127.0.0.1:63749_solr c:testschemaapi s:shard1  x:testschemaapi_shard1_replica1] o.a.s.c.SolrConfig current version of requestparams : -1
   [junit4]   2> 1216325 INFO  (qtp416395821-28393) [n:127.0.0.1:63749_solr c:testschemaapi s:shard1  x:testschemaapi_shard1_replica1] o.a.s.c.SolrConfig Using Lucene MatchVersion: 6.2.0
   [junit4]   2> 1216325 INFO  (qtp1767843328-28403) [n:127.0.0.1:63754_solr c:testschemaapi s:shard1  x:testschemaapi_shard1_replica2] o.a.s.s.IndexSchema unique key field: id
   [junit4]   2> 1216329 INFO  (qtp1767843328-28403) [n:127.0.0.1:63754_solr c:testschemaapi s:shard1  x:testschemaapi_shard1_replica2] o.a.s.c.ConfigSetProperties Did not find ConfigSet properties, assuming default properties: Can't find resource 'configsetprops.json' in classpath or '/configs/conf1', cwd=C:\Users\jenkins\workspace\Lucene-Solr-6.x-Windows\solr\build\solr-core\test\J0
   [junit4]   2> 1216329 INFO  (qtp1767843328-28403) [n:127.0.0.1:63754_solr c:testschemaapi s:shard1  x:testschemaapi_shard1_replica2] o.a.s.c.CoreContainer Creating SolrCore 'testschemaapi_shard1_replica2' using configuration from collection testschemaapi
   [junit4]   2> 1216329 INFO  (qtp1767843328-28403) [n:127.0.0.1:63754_solr c:testschemaapi s:shard1 r:core_node1 x:testschemaapi_shard1_replica2] o.a.s.c.SolrCore org.apache.solr.core.MockDirectoryFactory
   [junit4]   2> 1216329 INFO  (qtp1767843328-28403) [n:127.0.0.1:63754_solr c:testschemaapi s:shard1 r:core_node1 x:testschemaapi_shard1_replica2] o.a.s.c.SolrCore [[testschemaapi_shard1_replica2] ] Opening new SolrCore at [C:\Users\jenkins\workspace\Lucene-Solr-6.x-Windows\solr\build\solr-core\test\J0\temp\solr.schema.TestManagedSchemaAPI_5635B27ECB49862A-001\tempDir-001\node2\testschemaapi_shard1_replica2], dataDir=[C:\Users\jenkins\workspace\Lucene-Solr-6.x-Windows\solr\build\solr-core\test\J0\temp\solr.schema.TestManagedSchemaAPI_5635B27ECB49862A-001\tempDir-001\node2\.\testschemaapi_shard1_replica2\data\]
   [junit4]   2> 1216329 INFO  (qtp1767843328-28403) [n:127.0.0.1:63754_solr c:testschemaapi s:shard1 r:core_node1 x:testschemaapi_shard1_replica2] o.a.s.c.SolrCore JMX monitoring not detected for core: testschemaapi_shard1_replica2
   [junit4]   2> 1216330 INFO  (qtp416395821-28393) [n:127.0.0.1:63749_solr c:testschemaapi s:shard1  x:testschemaapi_shard1_replica1] o.a.s.c.SolrConfig Loaded SolrConfig: solrconfig.xml
   [junit4]   2> 1216330 INFO  (qtp1767843328-28403) [n:127.0.0.1:63754_solr c:testschemaapi s:shard1 r:core_node1 x:testschemaapi_shard1_replica2] o.a.s.c.CachingDirectoryFactory return new directory for C:\Users\jenkins\workspace\Lucene-Solr-6.x-Windows\solr\build\solr-core\test\J0\temp\solr.schema.TestManagedSchemaAPI_5635B27ECB49862A-001\tempDir-001\node2\.\testschemaapi_shard1_replica2\data\
   [junit4]   2> 1216330 INFO  (qtp1767843328-28403) [n:127.0.0.1:63754_solr c:testschemaapi s:shard1 r:core_node1 x:testschemaapi_shard1_replica2] o.a.s.c.SolrCore New index directory detected: old=null new=C:\Users\jenkins\workspace\Lucene-Solr-6.x-Windows\solr\build\solr-core\test\J0\temp\solr.schema.TestManagedSchemaAPI_5635B27ECB49862A-001\tempDir-001\node2\.\testschemaapi_shard1_replica2\data\index/
   [junit4]   2> 1216331 WARN  (qtp1767843328-28403) [n:127.0.0.1:63754_solr c:testschemaapi s:shard1 r:core_node1 x:testschemaapi_shard1_replica2] o.a.s.c.SolrCore [testschemaapi_shard1_replica2] Solr index directory 'C:\Users\jenkins\workspace\Lucene-Solr-6.x-Windows\solr\build\solr-core\test\J0\temp\solr.schema.TestManagedSchemaAPI_5635B27ECB49862A-001\tempDir-001\node2\.\testschemaapi_shard1_replica2\data\index' doesn't exist. Creating new index...
   [junit4]   2> 1216331 INFO  (qtp1767843328-28403) [n:127.0.0.1:63754_solr c:testschemaapi s:shard1 r:core_node1 x:testschemaapi_shard1_replica2] o.a.s.c.CachingDirectoryFactory return new directory for C:\Users\jenkins\workspace\Lucene-Solr-6.x-Windows\solr\build\solr-core\test\J0\temp\solr.schema.TestManagedSchemaAPI_5635B27ECB49862A-001\tempDir-001\node2\.\testschemaapi_shard1_replica2\data\index
   [junit4]   2> 1216331 INFO  (qtp1767843328-28403) [n:127.0.0.1:63754_solr c:testschemaapi s:shard1 r:core_node1 x:testschemaapi_shard1_replica2] o.a.s.c.SolrDeletionPolicy SolrDeletionPolicy.onCommit: commits: num=1
   [junit4]   2> 	commit{dir=MockDirectoryWrapper(RAMDirectory@3416df31 lockFactory=org.apache.lucene.store.SingleInstanceLockFactory@4d475701),segFN=segments_1,generation=1}
   [junit4]   2> 1216331 INFO  (qtp1767843328-28403) [n:127.0.0.1:63754_solr c:testschemaapi s:shard1 r:core_node1 x:testschemaapi_shard1_replica2] o.a.s.c.SolrDeletionPolicy newest commit generation = 1
   [junit4]   2> 1216332 INFO  (OldIndexDirectoryCleanupThreadForCore-testschemaapi_shard1_replica2) [n:127.0.0.1:63754_solr c:testschemaapi s:shard1 r:core_node1 x:testschemaapi_shard1_replica2] o.a.s.c.SolrCore Looking for old index directories to cleanup for core testschemaapi_shard1_replica2 in C:\Users\jenkins\workspace\Lucene-Solr-6.x-Windows\solr\build\solr-core\test\J0\temp\solr.schema.TestManagedSchemaAPI_5635B27ECB49862A-001\tempDir-001\node2\.\testschemaapi_shard1_replica2\data\
   [junit4]   2> 1216333 INFO  (qtp1767843328-28403) [n:127.0.0.1:63754_solr c:testschemaapi s:shard1 r:core_node1 x:testschemaapi_shard1_replica2] o.a.s.c.SolrCore no updateRequestProcessorChain defined as default, creating implicit default
   [junit4]   2> 1216333 WARN  (OldIndexDirectoryCleanupThreadForCore-testschemaapi_shard1_replica2) [n:127.0.0.1:63754_solr c:testschemaapi s:shard1 r:core_node1 x:testschemaapi_shard1_replica2] o.a.s.c.DirectoryFactory C:\Users\jenkins\workspace\Lucene-Solr-6.x-Windows\solr\build\solr-core\test\J0\temp\solr.schema.TestManagedSchemaAPI_5635B27ECB49862A-001\tempDir-001\node2\.\testschemaapi_shard1_replica2\data\ does not point to a valid data directory; skipping clean-up of old index directories.
   [junit4]   2> 1216335 INFO  (qtp416395821-28393) [n:127.0.0.1:63749_solr c:testschemaapi s:shard1  x:testschemaapi_shard1_replica1] o.a.s.s.IndexSchema [testschemaapi_shard1_replica1] Schema name=minimal
   [junit4]   2> 1216337 INFO  (qtp416395821-28393) [n:127.0.0.1:63749_solr c:testschemaapi s:shard1  x:testschemaapi_shard1_replica1] o.a.s.s.IndexSchema unique key field: id
   [junit4]   2> 1216337 INFO  (qtp1767843328-28403) [n:127.0.0.1:63754_solr c:testschemaapi s:shard1 r:core_node1 x:testschemaapi_shard1_replica2] o.a.s.h.l.XMLLoader xsltCacheLifetimeSeconds=60
   [junit4]   2> 1216340 INFO  (qtp416395821-28393) [n:127.0.0.1:63749_solr c:testschemaapi s:shard1  x:testschemaapi_shard1_replica1] o.a.s.c.ConfigSetProperties Did not find ConfigSet properties, assuming default properties: Can't find resource 'configsetprops.json' in classpath or '/configs/conf1', cwd=C:\Users\jenkins\workspace\Lucene-Solr-6.x-Windows\solr\build\solr-core\test\J0
   [junit4]   2> 1216340 INFO  (qtp416395821-28393) [n:127.0.0.1:63749_solr c:testschemaapi s:shard1  x:testschemaapi_shard1_replica1] o.a.s.c.CoreContainer Creating SolrCore 'testschemaapi_shard1_replica1' using configuration from collection testschemaapi
   [junit4]   2> 1216340 INFO  (qtp1767843328-28403) [n:127.0.0.1:63754_solr c:testschemaapi s:shard1 r:core_node1 x:testschemaapi_shard1_replica2] o.a.s.h.l.XMLLoader xsltCacheLifetimeSeconds=60
   [junit4]   2> 1216340 INFO  (qtp416395821-28393) [n:127.0.0.1:63749_solr c:testschemaapi s:shard1 r:core_node2 x:testschemaapi_shard1_replica1] o.a.s.c.SolrCore org.apache.solr.core.MockDirectoryFactory
   [junit4]   2> 1216340 INFO  (qtp416395821-28393) [n:127.0.0.1:63749_solr c:testschemaapi s:shard1 r:core_node2 x:testschemaapi_shard1_replica1] o.a.s.c.SolrCore [[testschemaapi_shard1_replica1] ] Opening new SolrCore at [C:\Users\jenkins\workspace\Lucene-Solr-6.x-Windows\solr\build\solr-core\test\J0\temp\solr.schema.TestManagedSchemaAPI_5635B27ECB49862A-001\tempDir-001\node1\testschemaapi_shard1_replica1], dataDir=[C:\Users\jenkins\workspace\Lucene-Solr-6.x-Windows\solr\build\solr-core\test\J0\temp\solr.schema.TestManagedSchemaAPI_5635B27ECB49862A-001\tempDir-001\node1\.\testschemaapi_shard1_replica1\data\]
   [junit4]   2> 1216340 INFO  (qtp416395821-28393) [n:127.0.0.1:63749_solr c:testschemaapi s:shard1 r:core_node2 x:testschemaapi_shard1_replica1] o.a.s.c.SolrCore JMX monitoring not detected for core: testschemaapi_shard1_replica1
   [junit4]   2> 1216341 INFO  (qtp416395821-28393) [n:127.0.0.1:63749_solr c:testschemaapi s:shard1 r:core_node2 x:testschemaapi_shard1_replica1] o.a.s.c.CachingDirectoryFactory return new directory for C:\Users\jenkins\workspace\Lucene-Solr-6.x-Windows\solr\build\solr-core\test\J0\temp\solr.schema.TestManagedSchemaAPI_5635B27ECB49862A-001\tempDir-001\node1\.\testschemaapi_shard1_replica1\data\
   [junit4]   2> 1216341 INFO  (qtp416395821-28393) [n:127.0.0.1:63749_solr c:testschemaapi s:shard1 r:core_node2 x:testschemaapi_shard1_replica1] o.a.s.c.SolrCore New index directory detected: old=null new=C:\Users\jenkins\workspace\Lucene-Solr-6.x-Windows\solr\build\solr-core\test\J0\temp\solr.schema.TestManagedSchemaAPI_5635B27ECB49862A-001\tempDir-001\node1\.\testschemaapi_shard1_replica1\data\index/
   [junit4]   2> 1216341 WARN  (qtp416395821-28393) [n:127.0.0.1:63749_solr c:testschemaapi s:shard1 r:core_node2 x:testschemaapi_shard1_replica1] o.a.s.c.SolrCore [testschemaapi_shard1_replica1] Solr index directory 'C:\Users\jenkins\workspace\Lucene-Solr-6.x-Windows\solr\build\solr-core\test\J0\temp\solr.schema.TestManagedSchemaAPI_5635B27ECB49862A-001\tempDir-001\node1\.\testschemaapi_shard1_replica1\data\index' doesn't exist. Creating new index...
   [junit4]   2> 1216341 INFO  (qtp1767843328-28403) [n:127.0.0.1:63754_solr c:testschemaapi s:shard1 r:core_node1 x:testschemaapi_shard1_replica2] o.a.s.h.l.XMLLoader xsltCacheLifetimeSeconds=60
   [junit4]   2> 1216341 INFO  (qtp416395821-28393) [n:127.0.0.1:63749_solr c:testschemaapi s:shard1 r:core_node2 x:testschemaapi_shard1_replica1] o.a.s.c.CachingDirectoryFactory return new directory for C:\Users\jenkins\workspace\Lucene-Solr-6.x-Windows\solr\build\solr-core\test\J0\temp\solr.schema.TestManagedSchemaAPI_5635B27ECB49862A-001\tempDir-001\node1\.\testschemaapi_shard1_replica1\data\index
   [junit4]   2> 1216342 INFO  (qtp416395821-28393) [n:127.0.0.1:63749_solr c:testschemaapi s:shard1 r:core_node2 x:testschemaapi_shard1_replica1] o.a.s.c.SolrDeletionPolicy SolrDeletionPolicy.onCommit: commits: num=1
   [junit4]   2> 	commit{dir=MockDirectoryWrapper(RAMDirectory@2e906633 lockFactory=org.apache.lucene.store.SingleInstanceLockFactory@393e184e),segFN=segments_1,generation=1}
   [junit4]   2> 1216342 INFO  (qtp416395821-28393) [n:127.0.0.1:63749_solr c:testschemaapi s:shard1 r:core_node2 x:testschemaapi_shard1_replica1] o.a.s.c.SolrDeletionPolicy newest commit generation = 1
   [junit4]   2> 1216352 INFO  (qtp1767843328-28403) [n:127.0.0.1:63754_solr c:testschemaapi s:shard1 r:core_node1 x:testschemaapi_shard1_replica2] o.a.s.h.l.XMLLoader xsltCacheLifetimeSeconds=60
   [junit4]   2> 1216352 INFO  (OldIndexDirectoryCleanupThreadForCore-testschemaapi_shard1_replica1) [n:127.0.0.1:63749_solr c:testschemaapi s:shard1 r:core_node2 x:testschemaapi_shard1_replica1] o.a.s.c.SolrCore Looking for old index directories to cleanup for core testschemaapi_shard1_replica1 in C:\Users\jenkins\workspace\Lucene-Solr-6.x-Windows\solr\build\solr-core\test\J0\temp\solr.schema.TestManagedSchemaAPI_5635B27ECB49862A-001\tempDir-001\node1\.\testschemaapi_shard1_replica1\data\
   [junit4]   2> 1216352 WARN  (OldIndexDirectoryCleanupThreadForCore-testschemaapi_shard1_replica1) [n:127.0.0.1:63749_solr c:testschemaapi s:shard1 r:core_node2 x:testschemaapi_shard1_replica1] o.a.s.c.DirectoryFactory C:\Users\jenkins\workspace\Lucene-Solr-6.x-Windows\solr\build\solr-core\test\J0\temp\solr.schema.TestManagedSchemaAPI_5635B27ECB49862A-001\tempDir-001\node1\.\testschemaapi_shard1_replica1\data\ does not point to a valid data directory; skipping clean-up of old index directories.
   [junit4]   2> 1216352 INFO  (qtp416395821-28393) [n:127.0.0.1:63749_solr c:testschemaapi s:shard1 r:core_node2 x:testschemaapi_shard1_replica1] o.a.s.c.SolrCore no updateRequestProcessorChain defined as default, creating implicit default
   [junit4]   2> 1216354 INFO  (qtp1767843328-28403) [n:127.0.0.1:63754_solr c:testschemaapi s:shard1 r:core_node1 x:testschemaapi_shard1_replica2] o.a.s.c.RequestHandlers Registered paths: /admin/mbeans,/update/csv,/sql,/update/json/docs,/admin/luke,/graph,/export,/select,/admin/segments,/get,/admin/system,/replication,/admin/properties,/config,/stream,/schema,/admin/plugins,/admin/logging,/update/json,/admin/ping,/admin/threads,/update,/admin/file
   [junit4]   2> 1216354 INFO  (qtp1767843328-28403) [n:127.0.0.1:63754_solr c:testschemaapi s:shard1 r:core_node1 x:testschemaapi_shard1_replica2] o.a.s.c.SolrCore Using default statsCache cache: org.apache.solr.search.stats.LocalStatsCache
   [junit4]   2> 1216356 INFO  (qtp416395821-28393) [n:127.0.0.1:63749_solr c:testschemaapi s:shard1 r:core_node2 x:testschemaapi_shard1_replica1] o.a.s.h.l.XMLLoader xsltCacheLifetimeSeconds=60
   [junit4]   2> 1216357 INFO  (qtp1767843328-28403) [n:127.0.0.1:63754_solr c:testschemaapi s:shard1 r:core_node1 x:testschemaapi_shard1_replica2] o.a.s.u.UpdateHandler Using UpdateLog implementation: org.apache.solr.update.UpdateLog
   [junit4]   2> 1216357 INFO  (qtp1767843328-28403) [n:127.0.0.1:63754_solr c:testschemaapi s:shard1 r:core_node1 x:testschemaapi_shard1_replica2] o.a.s.u.UpdateLog Initializing UpdateLog: dataDir=null defaultSyncLevel=FLUSH numRecordsToKeep=100 maxNumLogsToKeep=10 numVersionBuckets=65536
   [junit4]   2> 1216358 INFO  (qtp416395821-28393) [n:127.0.0.1:63749_solr c:testschemaapi s:shard1 r:core_node2 x:testschemaapi_shard1_replica1] o.a.s.h.l.XMLLoader xsltCacheLifetimeSeconds=60
   [junit4]   2> 1216359 INFO  (qtp1767843328-28403) [n:127.0.0.1:63754_solr c:testschemaapi s:shard1 r:core_node1 x:testschemaapi_shard1_replica2] o.a.s.u.CommitTracker Hard AutoCommit: disabled
   [junit4]   2> 1216359 INFO  (qtp1767843328-28403) [n:127.0.0.1:63754_solr c:testschemaapi s:shard1 r:core_node1 x:testschemaapi_shard1_replica2] o.a.s.u.CommitTracker Soft AutoCommit: disabled
   [junit4]   2> 1216359 INFO  (qtp416395821-28393) [n:127.0.0.1:63749_solr c:testschemaapi s:shard1 r:core_node2 x:testschemaapi_shard1_replica1] o.a.s.h.l.XMLLoader xsltCacheLifetimeSeconds=60
   [junit4]   2> 1216359 INFO  (qtp1767843328-28403) [n:127.0.0.1:63754_solr c:testschemaapi s:shard1 r:core_node1 x:testschemaapi_shard1_replica2] o.a.s.c.SolrDeletionPolicy SolrDeletionPolicy.onInit: commits: num=1
   [junit4]   2> 	commit{dir=MockDirectoryWrapper(RAMDirectory@3416df31 lockFactory=org.apache.lucene.store.SingleInstanceLockFactory@4d475701),segFN=segments_1,generation=1}
   [junit4]   2> 1216359 INFO  (qtp1767843328-28403) [n:127.0.0.1:63754_solr c:testschemaapi s:shard1 r:core_node1 x:testschemaapi_shard1_replica2] o.a.s.c.SolrDeletionPolicy newest commit generation = 1
   [junit4]   2> 1216359 INFO  (qtp1767843328-28403) [n:127.0.0.1:63754_solr c:testschemaapi s:shard1 r:core_node1 x:testschemaapi_shard1_replica2] o.a.s.s.SolrIndexSearcher Opening [Searcher@779a524d[testschemaapi_shard1_replica2] main]
   [junit4]   2> 1216359 INFO  (qtp1767843328-28403) [n:127.0.0.1:63754_solr c:testschemaapi s:shard1 r:core_node1 x:testschemaapi_shard1_replica2] o.a.s.c.c.ZkStateReader Load collection config from: [/collections/testschemaapi]
   [junit4]   2> 1216365 INFO  (qtp416395821-28393) [n:127.0.0.1:63749_solr c:testschemaapi s:shard1 r:core_node2 x:testschemaapi_shard1_replica1] o.a.s.h.l.XMLLoader xsltCacheLifetimeSeconds=60
   [junit4]   2> 1216365 INFO  (qtp1767843328-28403) [n:127.0.0.1:63754_solr c:testschemaapi s:shard1 r:core_node1 x:testschemaapi_shard1_replica2] o.a.s.c.c.ZkStateReader path=[/collections/testschemaapi] [configName]=[conf1] specified config exists in ZooKeeper
   [junit4]   2> 1216365 INFO  (qtp1767843328-28403) [n:127.0.0.1:63754_solr c:testschemaapi s:shard1 r:core_node1 x:testschemaapi_shard1_replica2] o.a.s.r.ManagedResourceStorage Setting up ZooKeeper-based storage for the RestManager with znodeBase: /configs/conf1
   [junit4]   2> 1216366 INFO  (qtp416395821-28393) [n:127.0.0.1:63749_solr c:testschemaapi s:shard1 r:core_node2 x:testschemaapi_shard1_replica1] o.a.s.c.RequestHandlers Registered paths: /admin/mbeans,/update/csv,/sql,/update/json/docs,/admin/luke,/graph,/export,/select,/admin/segments,/get,/admin/system,/replication,/admin/properties,/config,/stream,/schema,/admin/plugins,/admin/logging,/update/json,/admin/ping,/admin/threads,/update,/admin/file
   [junit4]   2> 1216366 INFO  (qtp416395821-28393) [n:127.0.0.1:63749_solr c:testschemaapi s:shard1 r:core_node2 x:testschemaapi_shard1_replica1] o.a.s.c.SolrCore Using default statsCache cache: org.apache.solr.search.stats.LocalStatsCache
   [junit4]   2> 1216366 INFO  (qtp1767843328-28403) [n:127.0.0.1:63754_solr c:testschemaapi s:shard1 r:core_node1 x:testschemaapi_shard1_replica2] o.a.s.r.ManagedResourceStorage Configured ZooKeeperStorageIO with znodeBase: /configs/conf1
   [junit4]   2> 1216366 INFO  (qtp1767843328-28403) [n:127.0.0.1:63754_solr c:testschemaapi s:shard1 r:core_node1 x:testschemaapi_shard1_replica2] o.a.s.r.RestManager Initializing RestManager with initArgs: {}
   [junit4]   2> 1216366 INFO  (qtp1767843328-28403) [n:127.0.0.1:63754_solr c:testschemaapi s:shard1 r:core_node1 x:testschemaapi_shard1_replica2] o.a.s.r.ManagedResourceStorage Reading _rest_managed.json using ZooKeeperStorageIO:path=/configs/conf1
   [junit4]   2> 1216366 INFO  (qtp1767843328-28403) [n:127.0.0.1:63754_solr c:testschemaapi s:shard1 r:core_node1 x:testschemaapi_shard1_replica2] o.a.s.r.ManagedResourceStorage No data found for znode /configs/conf1/_rest_managed.json
   [junit4]   2> 1216367 INFO  (qtp1767843328-28403) [n:127.0.0.1:63754_solr c:testschemaapi s:shard1 r:core_node1 x:testschemaapi_shard1_replica2] o.a.s.r.ManagedResourceStorage Loaded null at path _rest_managed.json using ZooKeeperStorageIO:path=/configs/conf1
   [junit4]   2> 1216367 INFO  (qtp1767843328-28403) [n:127.0.0.1:63754_solr c:testschemaapi s:shard1 r:core_node1 x:testschemaapi_shard1_replica2] o.a.s.r.RestManager Initializing 0 registered ManagedResources
   [junit4]   2> 1216367 INFO  (qtp1767843328-28403) [n:127.0.0.1:63754_solr c:testschemaapi s:shard1 r:core_node1 x:testschemaapi_shard1_replica2] o.a.s.s.ZkIndexSchemaReader Creating ZooKeeper watch for the managed schema at /configs/conf1/managed-schema
   [junit4]   2> 1216367 INFO  (qtp1767843328-28403) [n:127.0.0.1:63754_solr c:testschemaapi s:shard1 r:core_node1 x:testschemaapi_shard1_replica2] o.a.s.c.ZkController Added new OnReconnect listener ZkIndexSchemaReader: /configs/conf1/managed-schema, uniqueCoreId: testschemaapi_shard1_replica2:740163525500183
   [junit4]   2> 1216367 INFO  (qtp416395821-28393) [n:127.0.0.1:63749_solr c:testschemaapi s:shard1 r:core_node2 x:testschemaapi_shard1_replica1] o.a.s.u.UpdateHandler Using UpdateLog implementation: org.apache.solr.update.UpdateLog
   [junit4]   2> 1216367 INFO  (qtp1767843328-28403) [n:127.0.0.1:63754_solr c:testschemaapi s:shard1 r:core_node1 x:testschemaapi_shard1_replica2] o.a.s.h.ReplicationHandler Commits will be reserved for  10000
   [junit4]   2> 1216367 INFO  (qtp416395821-28393) [n:127.0.0.1:63749_solr c:testschemaapi s:shard1 r:core_node2 x:testschemaapi_shard1_replica1] o.a.s.u.UpdateLog Initializing UpdateLog: dataDir=null defaultSyncLevel=FLUSH numRecordsToKeep=100 maxNumLogsToKeep=10 numVersionBuckets=65536
   [junit4]   2> 1216368 INFO  (searcherExecutor-4598-thread-1-processing-n:127.0.0.1:63754_solr x:testschemaapi_shard1_replica2 s:shard1 c:testschemaapi r:core_node1) [n:127.0.0.1:63754_solr c:testschemaapi s:shard1 r:core_node1 x:testschemaapi_shard1_replica2] o.a.s.c.SolrCore [testschemaapi_shard1_replica2] Registered new searcher Searcher@779a524d[testschemaapi_shard1_replica2] main{ExitableDirectoryReader(UninvertingDirectoryReader())}
   [junit4]   2> 1216368 INFO  (qtp1767843328-28403) [n:127.0.0.1:63754_solr c:testschemaapi s:shard1 r:core_node1 x:testschemaapi_shard1_replica2] o.a.s.u.UpdateLog Looking up max value of version field to seed version buckets
   [junit4]   2> 1216368 INFO  (qtp1767843328-28403) [n:127.0.0.1:63754_solr c:testschemaapi s:shard1 r:core_node1 x:testschemaapi_shard1_replica2] o.a.s.u.VersionInfo Refreshing highest value of _version_ for 65536 version buckets from index
   [junit4]   2> 1216368 INFO  (qtp1767843328-28403) [n:127.0.0.1:63754_solr c:testschemaapi s:shard1 r:core_node1 x:testschemaapi_shard1_replica2] o.a.s.u.VersionInfo No terms found for _version_, cannot seed version bucket highest value from index
   [junit4]   2> 1216368 INFO  (qtp1767843328-28403) [n:127.0.0.1:63754_solr c:testschemaapi s:shard1 r:core_node1 x:testschemaapi_shard1_replica2] o.a.s.u.UpdateLog Could not find max version in index or recent updates, using new clock 1538087913723527168
   [junit4]   2> 1216369 INFO  (qtp416395821-28393) [n:127.0.0.1:63749_solr c:testschemaapi s:shard1 r:core_node2 x:testschemaapi_shard1_replica1] o.a.s.u.CommitTracker Hard AutoCommit: disabled
   [junit4]   2> 1216369 INFO  (qtp416395821-28393) [n:127.0.0.1:63749_solr c:testschemaapi s:shard1 r:core_node2 x:testschemaapi_shard1_replica1] o.a.s.u.CommitTracker Soft AutoCommit: disabled
   [junit4]   2> 1216370 INFO  (qtp1767843328-28403) [n:127.0.0.1:63754_solr c:testschemaapi s:shard1 r:core_node1 x:testschemaapi_shard1_replica2] o.a.s.u.UpdateLog Took 1.0ms to seed version buckets with highest version 1538087913723527168
   [junit4]   2> 1216370 INFO  (qtp1767843328-28403) [n:127.0.0.1:63754_solr c:testschemaapi s:shard1 r:core_node1 x:testschemaapi_shard1_replica2] o.a.s.c.ZkController watch zkdir /configs/conf1
   [junit4]   2> 1216370 INFO  (qtp416395821-28393) [n:127.0.0.1:63749_solr c:testschemaapi s:shard1 r:core_node2 x:testschemaapi_shard1_replica1] o.a.s.c.SolrDeletionPolicy SolrDeletionPolicy.onInit: commits: num=1
   [junit4]   2> 	commit{dir=MockDirectoryWrapper(RAMDirectory@2e906633 lockFactory=org.apache.lucene.store.SingleInstanceLockFactory@393e184e),segFN=segments_1,generation=1}
   [junit4]   2> 1216370 INFO  (qtp416395821-28393) [n:127.0.0.1:63749_solr c:testschemaapi s:shard1 r:core_node2 x:testschemaapi_shard1_replica1] o.a.s.c.SolrDeletionPolicy newest commit generation = 1
   [junit4]   2> 1216370 INFO  (qtp416395821-28393) [n:127.0.0.1:63749_solr c:testschemaapi s:shard1 r:core_node2 x:testschemaapi_shard1_replica1] o.a.s.s.SolrIndexSearcher Opening [Searcher@382592cb[testschemaapi_shard1_replica1] main]
   [junit4]   2> 1216370 INFO  (qtp1767843328-28403) [n:127.0.0.1:63754_solr c:testschemaapi s:shard1 r:core_node1 x:testschemaapi_shard1_replica2] o.a.s.c.CoreContainer registering core: testschemaapi_shard1_replica2
   [junit4]   2> 1216370 INFO  (qtp416395821-28393) [n:127.0.0.1:63749_solr c:testschemaapi s:shard1 r:core_node2 x:testschemaapi_shard1_replica1] o.a.s.c.c.ZkStateReader Load collection config from: [/collections/testschemaapi]
   [junit4]   2> 1216370 INFO  (qtp1767843328-28403) [n:127.0.0.1:63754_solr c:testschemaapi s:shard1 r:core_node1 x:testschemaapi_shard1_replica2] o.a.s.c.ZkController Register replica - core:testschemaapi_shard1_replica2 address:https://127.0.0.1:63754/solr collection:testschemaapi shard:shard1
   [junit4]   2> 1216371 INFO  (qtp416395821-28393) [n:127.0.0.1:63749_solr c:testschemaapi s:shard1 r:core_node2 x:testschemaapi_shard1_replica1] o.a.s.c.c.ZkStateReader path=[/collections/testschemaapi] [configName]=[conf1] specified config exists in ZooKeeper
   [junit4]   2> 1216371 INFO  (qtp416395821-28393) [n:127.0.0.1:63749_solr c:testschemaapi s:shard1 r:core_node2 x:testschemaapi_shard1_replica1] o.a.s.r.ManagedResourceStorage Setting up ZooKeeper-based storage for the RestManager with znodeBase: /configs/conf1
   [junit4]   2> 1216371 INFO  (qtp1767843328-28403) [n:127.0.0.1:63754_solr c:testschemaapi s:shard1 r:core_node1 x:testschemaapi_shard1_replica2] o.a.s.c.c.SolrZkClient makePath: /collections/testschemaapi/leader_elect/shard1/election
   [junit4]   2> 1216371 INFO  (qtp416395821-28393) [n:127.0.0.1:63749_solr c:testschemaapi s:shard1 r:core_node2 x:testschemaapi_shard1_replica1] o.a.s.r.ManagedResourceStorage Configured ZooKeeperStorageIO with znodeBase: /configs/conf1
   [junit4]   2> 1216371 INFO  (qtp416395821-28393) [n:127.0.0.1:63749_solr c:testschemaapi s:shard1 r:core_node2 x:testschemaapi_shard1_replica1] o.a.s.r.RestManager Initializing RestManager with initArgs: {}
   [junit4]   2> 1216371 INFO  (qtp416395821-28393) [n:127.0.0.1:63749_solr c:testschemaapi s:shard1 r:core_node2 x:testschemaapi_shard1_replica1] o.a.s.r.ManagedResourceStorage Reading _rest_managed.json using ZooKeeperStorageIO:path=/configs/conf1
   [junit4]   2> 1216372 INFO  (qtp416395821-28393) [n:127.0.0.1:63749_solr c:testschemaapi s:shard1 r:core_node2 x:testschemaapi_shard1_replica1] o.a.s.r.ManagedResourceStorage No data found for znode /configs/conf1/_rest_managed.json
   [junit4]   2> 1216372 INFO  (qtp416395821-28393) [n:127.0.0.1:63749_solr c:testschemaapi s:shard1 r:core_node2 x:testschemaapi_shard1_replica1] o.a.s.r.ManagedResourceStorage Loaded null at path _rest_managed.json using ZooKeeperStorageIO:path=/configs/conf1
   [junit4]   2> 1216372 INFO  (qtp416395821-28393) [n:127.0.0.1:63749_solr c:testschemaapi s:shard1 r:core_node2 x:testschemaapi_shard1_replica1] o.a.s.r.RestManager Initializing 0 registered ManagedResources
   [junit4]   2> 1216372 INFO  (qtp416395821-28393) [n:127.0.0.1:63749_solr c:testschemaapi s:shard1 r:core_node2 x:testschemaapi_shard1_replica1] o.a.s.s.ZkIndexSchemaReader Creating ZooKeeper watch for the managed schema at /configs/conf1/managed-schema
   [junit4]   2> 1216373 INFO  (qtp416395821-28393) [n:127.0.0.1:63749_solr c:testschemaapi s:shard1 r:core_node2 x:testschemaapi_shard1_replica1] o.a.s.c.ZkController Added new OnReconnect listener ZkIndexSchemaReader: /configs/conf1/managed-schema, uniqueCoreId: testschemaapi_shard1_replica1:740163536750301
   [junit4]   2> 1216373 INFO  (qtp416395821-28393) [n:127.0.0.1:63749_solr c:testschemaapi s:shard1 r:core_node2 x:testschemaapi_shard1_replica1] o.a.s.h.ReplicationHandler Commits will be reserved for  10000
   [junit4]   2> 1216373 INFO  (searcherExecutor-4599-thread-1-processing-n:127.0.0.1:63749_solr x:testschemaapi_shard1_replica1 s:shard1 c:testschemaapi r:core_node2) [n:127.0.0.1:63749_solr c:testschemaapi s:shard1 r:core_node2 x:testschemaapi_shard1_replica1] o.a.s.c.SolrCore [testschemaapi_shard1_replica1] Registered new searcher Searcher@382592cb[testschemaapi_shard1_replica1] main{ExitableDirectoryReader(UninvertingDirectoryReader())}
   [junit4]   2> 1216373 INFO  (qtp416395821-28393) [n:127.0.0.1:63749_solr c:testschemaapi s:shard1 r:core_node2 x:testschemaapi_shard1_replica1] o.a.s.u.UpdateLog Looking up max value of version field to seed version buckets
   [junit4]   2> 1216373 INFO  (qtp416395821-28393) [n:127.0.0.1:63749_solr c:testschemaapi s:shard1 r:core_node2 x:testschemaapi_shard1_replica1] o.a.s.u.VersionInfo Refreshing highest value of _version_ for 65536 version buckets from index
   [junit4]   2> 1216373 INFO  (qtp416395821-28393) [n:127.0.0.1:63749_solr c:testschemaapi s:shard1 r:core_node2 x:testschemaapi_shard1_replica1] o.a.s.u.VersionInfo No terms found for _version_, cannot seed version bucket highest value from index
   [junit4]   2> 1216373 INFO  (qtp416395821-28393) [n:127.0.0.1:63749_solr c:testschemaapi s:shard1 r:core_node2 x:testschemaapi_shard1_replica1] o.a.s.u.UpdateLog Could not find max version in index or recent updates, using new clock 1538087913728770048
   [junit4]   2> 1216377 INFO  (qtp416395821-28393) [n:127.0.0.1:63749_solr c:testschemaapi s:shard1 r:core_node2 x:testschemaapi_shard1_replica1] o.a.s.u.UpdateLog Took 3.0ms to seed version buckets with highest version 1538087913728770048
   [junit4]   2> 1216378 INFO  (qtp416395821-28393) [n:127.0.0.1:63749_solr c:testschemaapi s:shard1 r:core_node2 x:testschemaapi_shard1_replica1] o.a.s.c.ZkController watch zkdir /configs/conf1
   [junit4]   2> 1216381 INFO  (qtp416395821-28393) [n:127.0.0.1:63749_solr c:testschemaapi s:shard1 r:core_node2 x:testschemaapi_shard1_replica1] o.a.s.c.CoreContainer registering core: testschemaapi_shard1_replica1
   [junit4]   2> 1216381 INFO  (qtp416395821-28393) [n:127.0.0.1:63749_solr c:testschemaapi s:shard1 r:core_node2 x:testschemaapi_shard1_replica1] o.a.s.c.ZkController Register replica - core:testschemaapi_shard1_replica1 address:https://127.0.0.1:63749/solr collection:testschemaapi shard:shard1
   [junit4]   2> 1216390 INFO  (qtp1767843328-28403) [n:127.0.0.1:63754_solr c:testschemaapi s:shard1 r:core_node1 x:testschemaapi_shard1_replica2] o.a.s.c.LeaderElector Joined leadership election with path: /collections/testschemaapi/leader_elect/shard1/election/96130494424416262-core_node1-n_0000000000
   [junit4]   2> 1216391 INFO  (qtp416395821-28393) [n:127.0.0.1:63749_solr c:testschemaapi s:shard1 r:core_node2 x:testschemaapi_shard1_replica1] o.a.s.c.LeaderElector Joined leadership election with path: /collections/testschemaapi/leader_elect/shard1/election/96130494424416261-core_node2-n_0000000001
   [junit4]   2> 1216391 INFO  (qtp1767843328-28403) [n:127.0.0.1:63754_solr c:testschemaapi s:shard1 r:core_node1 x:testschemaapi_shard1_replica2] o.a.s.c.ShardLeaderElectionContext Running the leader process for shard=shard1 and weAreReplacement=false and leaderVoteWait=10000
   [junit4]   2> 1216392 INFO  (qtp416395821-28393) [n:127.0.0.1:63749_solr c:testschemaapi s:shard1 r:core_node2 x:testschemaapi_shard1_replica1] o.a.s.c.LeaderElector Watching path /collections/testschemaapi/leader_elect/shard1/election/96130494424416262-core_node1-n_0000000000 to know if I could be the leader
   [junit4]   2> 1216393 INFO  (qtp1767843328-28403) [n:127.0.0.1:63754_solr c:testschemaapi s:shard1 r:core_node1 x:testschemaapi_shard1_replica2] o.a.s.c.ShardLeaderElectionContext Enough replicas found to continue.
   [junit4]   2> 1216393 INFO  (qtp1767843328-28403) [n:127.0.0.1:63754_solr c:testschemaapi s:shard1 r:core_node1 x:testschemaapi_shard1_replica2] o.a.s.c.ShardLeaderElectionContext I may be the new leader - try and sync
   [junit4]   2> 1216393 INFO  (qtp1767843328-28403) [n:127.0.0.1:63754_solr c:testschemaapi s:shard1 r:core_node1 x:testschemaapi_shard1_replica2] o.a.s.c.SyncStrategy Sync replicas to https://127.0.0.1:63754/solr/testschemaapi_shard1_replica2/
   [junit4]   2> 1216393 INFO  (qtp1767843328-28403) [n:127.0.0.1:63754_solr c:testschemaapi s:shard1 r:core_node1 x:testschemaapi_shard1_replica2] o.a.s.u.PeerSync PeerSync: core=testschemaapi_shard1_replica2 url=https://127.0.0.1:63754/solr START replicas=[https://127.0.0.1:63749/solr/testschemaapi_shard1_replica1/] nUpdates=100
   [junit4]   2> 1216393 INFO  (qtp1767843328-28403) [n:127.0.0.1:63754_solr c:testschemaapi s:shard1 r:core_node1 x:testschemaapi_shard1_replica2] o.a.s.u.PeerSync PeerSync: core=testschemaapi_shard1_replica2 url=https://127.0.0.1:63754/solr DONE.  We have no versions.  sync failed.
   [junit4]   2> 1216393 INFO  (qtp1767843328-28403) [n:127.0.0.1:63754_solr c:testschemaapi s:shard1 r:core_node1 x:testschemaapi_shard1_replica2] o.a.s.c.SyncStrategy Leader's attempt to sync with shard failed, moving to the next candidate
   [junit4]   2> 1216393 INFO  (OverseerStateUpdate-96130494424416261-127.0.0.1:63749_solr-n_0000000000) [n:127.0.0.1:63749_solr    ] o.a.s.c.Overseer processMessage: queueSize: 1, message = {
   [junit4]   2>   "operation":"leader",
   [junit4]   2>   "shard":"shard1",
   [junit4]   2>   "collection":"testschemaapi"} current state version: 0
   [junit4]   2> 1216393 INFO  (qtp1767843328-28403) [n:127.0.0.1:63754_solr c:testschemaapi s:shard1 r:core_node1 x:testschemaapi_shard1_replica2] o.a.s.c.ShardLeaderElectionContext We failed sync, but we have no versions - we can't sync in that case - we were active before, so become leader anyway
   [junit4]   2> 1216396 INFO  (qtp1767843328-28403) [n:127.0.0.1:63754_solr c:testschemaapi s:shard1 r:core_node1 x:testschemaapi_shard1_replica2] o.a.s.c.c.SolrZkClient makePath: /collections/testschemaapi/leaders/shard1
   [junit4]   2> 1216403 INFO  (qtp416395821-28413) [n:127.0.0.1:63749_solr c:testschemaapi s:shard1 r:core_node2 x:testschemaapi_shard1_replica1] o.a.s.c.S.Request [testschemaapi_shard1_replica1]  webapp=/solr path=/get params={distrib=false&qt=/get&fingerprint=false&getVersions=100&wt=javabin&version=2} status=0 QTime=1
   [junit4]   2> 1216404 INFO  (qtp1767843328-28403) [n:127.0.0.1:63754_solr c:testschemaapi s:shard1 r:core_node1 x:testschemaapi_shard1_replica2] o.a.s.c.ShardLeaderElectionContextBase Creating leader registration node /collections/testschemaapi/leaders/shard1/leader after winning as /collections/testschemaapi/leader_elect/shard1/election/96130494424416262-core_node1-n_0000000000
   [junit4]   2> 1216415 INFO  (qtp1767843328-28403) [n:127.0.0.1:63754_solr c:testschemaapi s:shard1 r:core_node1 x:testschemaapi_shard1_replica2] o.a.s.c.ShardLeaderElectionContext I am the new leader: https://127.0.0.1:63754/solr/testschemaapi_shard1_replica2/ shard1
   [junit4]   2> 1216418 INFO  (OverseerStateUpdate-96130494424416261-127.0.0.1:63749_solr-n_0000000000) [n:127.0.0.1:63749_solr    ] o.a.s.c.Overseer processMessage: queueSize: 1, message = {
   [junit4]   2>   "operation":"leader",
   [junit4]   2>   "shard":"shard1",
   [junit4]   2>   "collection":"testschemaapi",
   [junit4]   2>   "base_url":"https://127.0.0.1:63754/solr",
   [junit4]   2>   "core":"testschemaapi_shard1_replica2",
   [junit4]   2>   "state":"active"} current state version: 0
   [junit4]   2> 1216528 INFO  (OverseerStateUpdate-96130494424416261-127.0.0.1:63749_solr-n_0000000000) [n:127.0.0.1:63749_solr    ] o.a.s.c.o.ZkStateWriter going to update_collection /collections/testschemaapi/state.json version: 1
   [junit4]   2> 1216528 INFO  (zkCallback-6934-thread-1-processing-n:127.0.0.1:63754_solr) [n:127.0.0.1:63754_solr    ] o.a.s.c.c.ZkStateReader A cluster state change: [WatchedEvent state:SyncConnected type:NodeDataChanged path:/collections/testschemaapi/state.json] for collection [testschemaapi] has occurred - updating... (live nodes size: [2])
   [junit4]   2> 1216528 INFO  (zkCallback-6933-thread-1-processing-n:127.0.0.1:63749_solr) [n:127.0.0.1:63749_solr    ] o.a.s.c.c.ZkStateReader A cluster state change: [WatchedEvent state:SyncConnected type:NodeDataChanged path:/collections/testschemaapi/state.json] for collection [testschemaapi] has occurred - updating... (live nodes size: [2])
   [junit4]   2> 1216529 INFO  (zkCallback-6934-thread-1-processing-n:127.0.0.1:63754_solr) [n:127.0.0.1:63754_solr    ] o.a.s.c.c.ZkStateReader Updating data for [testschemaapi] from [1] to [2]
   [junit4]   2> 1216529 INFO  (zkCallback-6933-thread-1-processing-n:127.0.0.1:63749_solr) [n:127.0.0.1:63749_solr    ] o.a.s.c.c.ZkStateReader Updating data for [testschemaapi] from [1] to [2]
   [junit4]   2> 1216569 INFO  (qtp1767843328-28403) [n:127.0.0.1:63754_solr c:testschemaapi s:shard1 r:core_node1 x:testschemaapi_shard1_replica2] o.a.s.c.ZkController We are https://127.0.0.1:63754/solr/testschemaapi_shard1_replica2/ and leader is https://127.0.0.1:63754/solr/testschemaapi_shard1_replica2/
   [junit4]   2> 1216569 INFO  (qtp1767843328-28403) [n:127.0.0.1:63754_solr c:testschemaapi s:shard1 r:core_node1 x:testschemaapi_shard1_replica2] o.a.s.c.ZkController No LogReplay needed for core=testschemaapi_shard1_replica2 baseURL=https://127.0.0.1:63754/solr
   [junit4]   2> 1216569 INFO  (qtp1767843328-28403) [n:127.0.0.1:63754_solr c:testschemaapi s:shard1 r:core_node1 x:testschemaapi_shard1_replica2] o.a.s.c.ZkController I am the leader, no recovery necessary
   [junit4]   2> 1216569 INFO  (qtp1767843328-28403) [n:127.0.0.1:63754_solr c:testschemaapi s:shard1 r:core_node1 x:testschemaapi_shard1_replica2] o.a.s.c.ZkController publishing state=active
   [junit4]   2> 1216572 INFO  (OverseerStateUpdate-96130494424416261-127.0.0.1:63749_solr-n_0000000000) [n:127.0.0.1:63749_solr    ] o.a.s.c.Overseer processMessage: queueSize: 1, message = {
   [junit4]   2>   "core":"testschemaapi_shard1_replica2",
   [junit4]   2>   "core_node_name":"core_node1",
   [junit4]   2>   "roles":null,
   [junit4]   2>   "base_url":"https://127.0.0.1:63754/solr",
   [junit4]   2>   "node_name":"127.0.0.1:63754_solr",
   [junit4]   2>   "numShards":"1",
   [junit4]   2>   "state":"active",
   [junit4]   2>   "shard":"shard1",
   [junit4]   2>   "collection":"testschemaapi",
   [junit4]   2>   "operation":"state"} current state version: 0
   [junit4]   2> 1216572 INFO  (OverseerStateUpdate-96130494424416261-127.0.0.1:63749_solr-n_0000000000) [n:127.0.0.1:63749_solr    ] o.a.s.c.o.ReplicaMutator Update state numShards=1 message={
   [junit4]   2>   "core":"testschemaapi_shard1_replica2",
   [junit4]   2>   "core_node_name":"core_node1",
   [junit4]   2>   "roles":null,
   [junit4]   2>   "base_url":"https://127.0.0.1:63754/solr",
   [junit4]   2>   "node_name":"127.0.0.1:63754_solr",
   [junit4]   2>   "numShards":"1",
   [junit4]   2>   "state":"active",
   [junit4]   2>   "shard":"shard1",
   [junit4]   2>   "collection":"testschemaapi",
   [junit4]   2>   "operation":"state"}
   [junit4]   2> 1216576 INFO  (qtp1767843328-28403) [n:127.0.0.1:63754_solr c:testschemaapi s:shard1 r:core_node1 x:testschemaapi_shard1_replica2] o.a.s.s.HttpSolrCall [admin] webapp=null path=/admin/cores params={qt=/admin/cores&collection.configName=conf1&name=testschemaapi_shard1_replica2&action=CREATE&numShards=1&collection=testschemaapi&shard=shard1&wt=javabin&version=2} status=0 QTime=1342
   [junit4]   2> 1216688 INFO  (OverseerStateUpdate-96130494424416261-127.0.0.1:63749_solr-n_0000000000) [n:127.0.0.1:63749_solr    ] o.a.s.c.o.ZkStateWriter going to update_collection /collections/testschemaapi/state.json version: 2
   [junit4]   2> 1216688 INFO  (zkCallback-6933-thread-2-processing-n:127.0.0.1:63749_solr) [n:127.0.0.1:63749_solr    ] o.a.s.c.c.ZkStateReader A cluster state change: [WatchedEvent state:SyncConnected type:NodeDataChanged path:/collections/testschemaapi/state.json] for collection [testschemaapi] has occurred - updating... (live nodes size: [2])
   [junit4]   2> 1216688 INFO  (zkCallback-6934-thread-1-processing-n:127.0.0.1:63754_solr) [n:127.0.0.1:63754_solr    ] o.a.s.c.c.ZkStateReader A cluster state change: [WatchedEvent state:SyncConnected type:NodeDataChanged path:/collections/testschemaapi/state.json] for collection [testschemaapi] has occurred - updating... (live nodes size: [2])
   [junit4]   2> 1216689 INFO  (zkCallback-6934-thread-1-processing-n:127.0.0.1:63754_solr) [n:127.0.0.1:63754_solr    ] o.a.s.c.c.ZkStateReader Updating data for [testschemaapi] from [2] to [3]
   [junit4]   2> 1216689 INFO  (zkCallback-6933-thread-2-processing-n:127.0.0.1:63749_solr) [n:127.0.0.1:63749_solr    ] o.a.s.c.c.ZkStateReader Updating da

[...truncated too long message...]

ucene-Solr-6.x-Windows\solr\build\solr-core\test\J0\temp\solr.schema.TestManagedSchemaAPI_5635B27ECB49862A-001\tempDir-001\node2\.\testschemaapi_shard1_replica2\data\index;done=false>>]
   [junit4]   2> 1226938 INFO  (Thread-2711) [n:127.0.0.1:63754_solr c:testschemaapi s:shard1 r:core_node1 x:testschemaapi_shard1_replica2] o.a.s.c.CachingDirectoryFactory Closing directory, CoreContainer#isShutdown=true
   [junit4]   2> 1226938 INFO  (Thread-2711) [n:127.0.0.1:63754_solr c:testschemaapi s:shard1 r:core_node1 x:testschemaapi_shard1_replica2] o.a.s.c.CachingDirectoryFactory Closing directory: C:\Users\jenkins\workspace\Lucene-Solr-6.x-Windows\solr\build\solr-core\test\J0\temp\solr.schema.TestManagedSchemaAPI_5635B27ECB49862A-001\tempDir-001\node2\.\testschemaapi_shard1_replica2\data\index
   [junit4]   2> 1226938 INFO  (Thread-2711) [n:127.0.0.1:63754_solr c:testschemaapi s:shard1 r:core_node1 x:testschemaapi_shard1_replica2] o.a.s.c.CachingDirectoryFactory looking to close C:\Users\jenkins\workspace\Lucene-Solr-6.x-Windows\solr\build\solr-core\test\J0\temp\solr.schema.TestManagedSchemaAPI_5635B27ECB49862A-001\tempDir-001\node2\.\testschemaapi_shard1_replica2\data\ [CachedDir<<refCount=0;path=C:\Users\jenkins\workspace\Lucene-Solr-6.x-Windows\solr\build\solr-core\test\J0\temp\solr.schema.TestManagedSchemaAPI_5635B27ECB49862A-001\tempDir-001\node2\.\testschemaapi_shard1_replica2\data\;done=false>>]
   [junit4]   2> 1226938 INFO  (Thread-2711) [n:127.0.0.1:63754_solr c:testschemaapi s:shard1 r:core_node1 x:testschemaapi_shard1_replica2] o.a.s.c.CachingDirectoryFactory Closing directory, CoreContainer#isShutdown=true
   [junit4]   2> 1226938 INFO  (Thread-2711) [n:127.0.0.1:63754_solr c:testschemaapi s:shard1 r:core_node1 x:testschemaapi_shard1_replica2] o.a.s.c.CachingDirectoryFactory Closing directory: C:\Users\jenkins\workspace\Lucene-Solr-6.x-Windows\solr\build\solr-core\test\J0\temp\solr.schema.TestManagedSchemaAPI_5635B27ECB49862A-001\tempDir-001\node2\.\testschemaapi_shard1_replica2\data\
   [junit4]   2> 1226938 WARN  (Thread-2712) [n:127.0.0.1:63749_solr c:testschemaapi s:shard1 r:core_node2 x:testschemaapi_shard1_replica1] o.a.s.c.ZkController listener throws error
   [junit4]   2> org.apache.solr.common.SolrException: Unable to reload core [testschemaapi_shard1_replica1]
   [junit4]   2> 	at org.apache.solr.core.CoreContainer.reload(CoreContainer.java:928)
   [junit4]   2> 	at org.apache.solr.core.SolrCore.lambda$getConfListener$6(SolrCore.java:2509)
   [junit4]   2> 	at org.apache.solr.cloud.ZkController$4.run(ZkController.java:2405)
   [junit4]   2> Caused by: org.apache.solr.common.SolrException: Could not find config name for collection:testschemaapi
   [junit4]   2> 	at org.apache.solr.core.SolrCore.<init>(SolrCore.java:772)
   [junit4]   2> 	at org.apache.solr.core.SolrCore.reload(SolrCore.java:461)
   [junit4]   2> 	at org.apache.solr.core.CoreContainer.reload(CoreContainer.java:922)
   [junit4]   2> 	... 2 more
   [junit4]   2> Caused by: org.apache.solr.common.SolrException: Could not find config name for collection:testschemaapi
   [junit4]   2> 	at org.apache.solr.rest.ManagedResourceStorage.newStorageIO(ManagedResourceStorage.java:101)
   [junit4]   2> 	at org.apache.solr.core.SolrCore.initRestManager(SolrCore.java:2304)
   [junit4]   2> 	at org.apache.solr.core.SolrCore.<init>(SolrCore.java:748)
   [junit4]   2> 	... 4 more
   [junit4]   2> 1226943 WARN  (Thread-2711) [n:127.0.0.1:63754_solr c:testschemaapi s:shard1 r:core_node1 x:testschemaapi_shard1_replica2] o.a.s.c.ZkController listener throws error
   [junit4]   2> org.apache.solr.common.SolrException: Unable to reload core [testschemaapi_shard1_replica2]
   [junit4]   2> 	at org.apache.solr.core.CoreContainer.reload(CoreContainer.java:928)
   [junit4]   2> 	at org.apache.solr.core.SolrCore.lambda$getConfListener$6(SolrCore.java:2509)
   [junit4]   2> 	at org.apache.solr.cloud.ZkController$4.run(ZkController.java:2405)
   [junit4]   2> Caused by: org.apache.solr.common.SolrException: Could not find config name for collection:testschemaapi
   [junit4]   2> 	at org.apache.solr.core.SolrCore.<init>(SolrCore.java:772)
   [junit4]   2> 	at org.apache.solr.core.SolrCore.reload(SolrCore.java:461)
   [junit4]   2> 	at org.apache.solr.core.CoreContainer.reload(CoreContainer.java:922)
   [junit4]   2> 	... 2 more
   [junit4]   2> Caused by: org.apache.solr.common.SolrException: Could not find config name for collection:testschemaapi
   [junit4]   2> 	at org.apache.solr.rest.ManagedResourceStorage.newStorageIO(ManagedResourceStorage.java:101)
   [junit4]   2> 	at org.apache.solr.core.SolrCore.initRestManager(SolrCore.java:2304)
   [junit4]   2> 	at org.apache.solr.core.SolrCore.<init>(SolrCore.java:748)
   [junit4]   2> 	... 4 more
   [junit4]   2> Jun 25, 2016 6:09:10 AM com.carrotsearch.randomizedtesting.ThreadLeakControl checkThreadLeaks
   [junit4]   2> WARNING: Will linger awaiting termination of 4 leaked thread(s).
   [junit4]   2> NOTE: test params are: codec=Asserting(Lucene62): {_version_=PostingsFormat(name=Asserting), id=FST50, myNewField1=FST50, myNewField=PostingsFormat(name=Direct)}, docValues:{}, maxPointsInLeafNode=766, maxMBSortInHeap=6.870867851550235, sim=RandomSimilarity(queryNorm=true,coord=crazy): {}, locale=es-CU, timezone=America/St_Barthelemy
   [junit4]   2> NOTE: Windows 10 10.0 amd64/Oracle Corporation 1.8.0_92 (64-bit)/cpus=3,threads=1,free=114180992,total=350224384
   [junit4]   2> NOTE: All tests run in this JVM: [HdfsRecoverLeaseTest, DeleteLastCustomShardedReplicaTest, TestHdfsUpdateLog, TestEmbeddedSolrServerConstructors, CursorMarkTest, CoreAdminRequestStatusTest, DistributedQueryElevationComponentTest, TestJmxIntegration, TestConfigSets, TestCloudInspectUtil, HttpPartitionTest, PrimUtilsTest, TestDistributedSearch, TestIBSimilarityFactory, ResponseHeaderTest, FastVectorHighlighterTest, TestLuceneMatchVersion, TestQuerySenderNoQuery, HdfsCollectionsAPIDistributedZkTest, TestSubQueryTransformerCrossCore, MoreLikeThisHandlerTest, TestGroupingSearch, SolrRequestParserTest, DocumentBuilderTest, TestSchemaVersionResource, TestSurroundQueryParser, RegexBoostProcessorTest, RulesTest, SimpleCollectionCreateDeleteTest, TestAnalyzeInfixSuggestions, TestSolrDeletionPolicy1, TestCustomSort, BasicDistributedZkTest, TestCodecSupport, ClassificationUpdateProcessorFactoryTest, ParsingFieldUpdateProcessorsTest, UUIDUpdateProcessorFallbackTest, QueryEqualityTest, TestMergePolicyConfig, ZkControllerTest, CircularListTest, SolrXmlInZkTest, DirectSolrSpellCheckerTest, DistribCursorPagingTest, TestTrackingShardHandlerFactory, TestStressLiveNodes, InfoHandlerTest, TestFieldCacheSort, UpdateParamsTest, TestCollationFieldDocValues, HdfsDirectoryFactoryTest, DistributedSuggestComponentTest, TestFieldResource, TestArbitraryIndexDir, DeleteShardTest, CollectionStateFormat2Test, DirectUpdateHandlerTest, TestSolrFieldCacheMBean, BlockJoinFacetDistribTest, StatelessScriptUpdateProcessorFactoryTest, DocumentAnalysisRequestHandlerTest, EnumFieldTest, TestNamedUpdateProcessors, TestRandomDVFaceting, JsonLoaderTest, SpatialHeatmapFacetsTest, TestCoreContainer, TestExactStatsCache, TestCloudBackupRestore, RequiredFieldsTest, StressHdfsTest, TestGeoJSONResponseWriter, AnalysisAfterCoreReloadTest, TestStressLucene, TestExpandComponent, ReturnFieldsTest, TestFastLRUCache, TestHighFrequencyDictionaryFactory, TestUpdate, TestDFRSimilarityFactory, SimplePostToolTest, TestPerFieldSimilarityClassic, UnloadDistributedZkTest, HighlighterMaxOffsetTest, HardAutoCommitTest, IndexBasedSpellCheckerTest, ExternalFileFieldSortTest, TestMaxScoreQueryParser, SolrIndexConfigTest, TestFieldCacheVsDocValues, TestXIncludeConfig, TestManagedSchemaAPI]
   [junit4]   2> NOTE: reproduce with: ant test  -Dtestcase=TestManagedSchemaAPI -Dtests.seed=5635B27ECB49862A -Dtests.slow=true -Dtests.locale=es-CU -Dtests.timezone=America/St_Barthelemy -Dtests.asserts=true -Dtests.file.encoding=US-ASCII
   [junit4] ERROR   0.00s J0 | TestManagedSchemaAPI (suite) <<<
   [junit4]    > Throwable #1: java.lang.AssertionError: ObjectTracker found 8 object(s) that were not released!!! [MockDirectoryWrapper, MDCAwareThreadPoolExecutor, TransactionLog, TransactionLog, MockDirectoryWrapper, MockDirectoryWrapper, MDCAwareThreadPoolExecutor, MockDirectoryWrapper]
   [junit4]    > 	at __randomizedtesting.SeedInfo.seed([5635B27ECB49862A]:0)
   [junit4]    > 	at org.apache.solr.SolrTestCaseJ4.teardownTestCases(SolrTestCaseJ4.java:257)
   [junit4]    > 	at java.lang.Thread.run(Thread.java:745)
   [junit4] Completed [236/617 (1!)] on J0 in 14.19s, 1 test, 1 failure <<< FAILURES!

[...truncated 1273 lines...]
BUILD FAILED
C:\Users\jenkins\workspace\Lucene-Solr-6.x-Windows\build.xml:740: The following error occurred while executing this line:
C:\Users\jenkins\workspace\Lucene-Solr-6.x-Windows\build.xml:684: The following error occurred while executing this line:
C:\Users\jenkins\workspace\Lucene-Solr-6.x-Windows\build.xml:59: The following error occurred while executing this line:
C:\Users\jenkins\workspace\Lucene-Solr-6.x-Windows\solr\build.xml:233: The following error occurred while executing this line:
C:\Users\jenkins\workspace\Lucene-Solr-6.x-Windows\solr\common-build.xml:530: The following error occurred while executing this line:
C:\Users\jenkins\workspace\Lucene-Solr-6.x-Windows\lucene\common-build.xml:1427: The following error occurred while executing this line:
C:\Users\jenkins\workspace\Lucene-Solr-6.x-Windows\lucene\common-build.xml:984: There were test failures: 617 suites (10 ignored), 2597 tests, 1 suite-level error, 127 ignored (82 assumptions) [seed: 5635B27ECB49862A]

Total time: 84 minutes 45 seconds
Build step 'Invoke Ant' marked build as failure
Archiving artifacts
[WARNINGS] Skipping publisher since build result is FAILURE
Recording test results
Email was triggered for: Failure - Any
Sending email for trigger: Failure - Any



[JENKINS] Lucene-Solr-6.x-Windows (64bit/jdk1.8.0_92) - Build # 272 - Still Failing!

Posted by Policeman Jenkins Server <je...@thetaphi.de>.
Build: http://jenkins.thetaphi.de/job/Lucene-Solr-6.x-Windows/272/
Java: 64bit/jdk1.8.0_92 -XX:-UseCompressedOops -XX:+UseConcMarkSweepGC

2 tests failed.
FAILED:  junit.framework.TestSuite.org.apache.solr.schema.TestManagedSchemaAPI

Error Message:
ObjectTracker found 4 object(s) that were not released!!! [MockDirectoryWrapper, MockDirectoryWrapper, TransactionLog, MDCAwareThreadPoolExecutor]

Stack Trace:
java.lang.AssertionError: ObjectTracker found 4 object(s) that were not released!!! [MockDirectoryWrapper, MockDirectoryWrapper, TransactionLog, MDCAwareThreadPoolExecutor]
	at __randomizedtesting.SeedInfo.seed([24425B944C2AAEFC]:0)
	at org.junit.Assert.fail(Assert.java:93)
	at org.junit.Assert.assertTrue(Assert.java:43)
	at org.junit.Assert.assertNull(Assert.java:551)
	at org.apache.solr.SolrTestCaseJ4.teardownTestCases(SolrTestCaseJ4.java:257)
	at sun.reflect.GeneratedMethodAccessor61.invoke(Unknown Source)
	at sun.reflect.DelegatingMethodAccessorImpl.invoke(DelegatingMethodAccessorImpl.java:43)
	at java.lang.reflect.Method.invoke(Method.java:498)
	at com.carrotsearch.randomizedtesting.RandomizedRunner.invoke(RandomizedRunner.java:1764)
	at com.carrotsearch.randomizedtesting.RandomizedRunner$7.evaluate(RandomizedRunner.java:834)
	at com.carrotsearch.randomizedtesting.rules.StatementAdapter.evaluate(StatementAdapter.java:36)
	at com.carrotsearch.randomizedtesting.rules.SystemPropertiesRestoreRule$1.evaluate(SystemPropertiesRestoreRule.java:57)
	at org.apache.lucene.util.AbstractBeforeAfterRule$1.evaluate(AbstractBeforeAfterRule.java:45)
	at com.carrotsearch.randomizedtesting.rules.StatementAdapter.evaluate(StatementAdapter.java:36)
	at org.apache.lucene.util.TestRuleStoreClassName$1.evaluate(TestRuleStoreClassName.java:41)
	at com.carrotsearch.randomizedtesting.rules.NoShadowingOrOverridesOnMethodsRule$1.evaluate(NoShadowingOrOverridesOnMethodsRule.java:40)
	at com.carrotsearch.randomizedtesting.rules.NoShadowingOrOverridesOnMethodsRule$1.evaluate(NoShadowingOrOverridesOnMethodsRule.java:40)
	at com.carrotsearch.randomizedtesting.rules.StatementAdapter.evaluate(StatementAdapter.java:36)
	at com.carrotsearch.randomizedtesting.rules.StatementAdapter.evaluate(StatementAdapter.java:36)
	at com.carrotsearch.randomizedtesting.rules.StatementAdapter.evaluate(StatementAdapter.java:36)
	at org.apache.lucene.util.TestRuleAssertionsRequired$1.evaluate(TestRuleAssertionsRequired.java:53)
	at org.apache.lucene.util.TestRuleMarkFailure$1.evaluate(TestRuleMarkFailure.java:47)
	at org.apache.lucene.util.TestRuleIgnoreAfterMaxFailures$1.evaluate(TestRuleIgnoreAfterMaxFailures.java:64)
	at org.apache.lucene.util.TestRuleIgnoreTestSuites$1.evaluate(TestRuleIgnoreTestSuites.java:54)
	at com.carrotsearch.randomizedtesting.rules.StatementAdapter.evaluate(StatementAdapter.java:36)
	at com.carrotsearch.randomizedtesting.ThreadLeakControl$StatementRunner.run(ThreadLeakControl.java:367)
	at java.lang.Thread.run(Thread.java:745)


FAILED:  junit.framework.TestSuite.org.apache.solr.schema.TestManagedSchemaAPI

Error Message:
Could not remove the following files (in the order of attempts):    C:\Users\jenkins\workspace\Lucene-Solr-6.x-Windows\solr\build\solr-core\test\J0\temp\solr.schema.TestManagedSchemaAPI_24425B944C2AAEFC-001\tempDir-001\node1\testschemaapi_shard1_replica2\data\tlog\tlog.0000000000000000000: java.nio.file.FileSystemException: C:\Users\jenkins\workspace\Lucene-Solr-6.x-Windows\solr\build\solr-core\test\J0\temp\solr.schema.TestManagedSchemaAPI_24425B944C2AAEFC-001\tempDir-001\node1\testschemaapi_shard1_replica2\data\tlog\tlog.0000000000000000000: The process cannot access the file because it is being used by another process.     C:\Users\jenkins\workspace\Lucene-Solr-6.x-Windows\solr\build\solr-core\test\J0\temp\solr.schema.TestManagedSchemaAPI_24425B944C2AAEFC-001\tempDir-001\node1\testschemaapi_shard1_replica2\data\tlog: java.nio.file.DirectoryNotEmptyException: C:\Users\jenkins\workspace\Lucene-Solr-6.x-Windows\solr\build\solr-core\test\J0\temp\solr.schema.TestManagedSchemaAPI_24425B944C2AAEFC-001\tempDir-001\node1\testschemaapi_shard1_replica2\data\tlog    C:\Users\jenkins\workspace\Lucene-Solr-6.x-Windows\solr\build\solr-core\test\J0\temp\solr.schema.TestManagedSchemaAPI_24425B944C2AAEFC-001\tempDir-001\node1\testschemaapi_shard1_replica2\data: java.nio.file.DirectoryNotEmptyException: C:\Users\jenkins\workspace\Lucene-Solr-6.x-Windows\solr\build\solr-core\test\J0\temp\solr.schema.TestManagedSchemaAPI_24425B944C2AAEFC-001\tempDir-001\node1\testschemaapi_shard1_replica2\data    C:\Users\jenkins\workspace\Lucene-Solr-6.x-Windows\solr\build\solr-core\test\J0\temp\solr.schema.TestManagedSchemaAPI_24425B944C2AAEFC-001\tempDir-001\node1\testschemaapi_shard1_replica2: java.nio.file.DirectoryNotEmptyException: C:\Users\jenkins\workspace\Lucene-Solr-6.x-Windows\solr\build\solr-core\test\J0\temp\solr.schema.TestManagedSchemaAPI_24425B944C2AAEFC-001\tempDir-001\node1\testschemaapi_shard1_replica2    C:\Users\jenkins\workspace\Lucene-Solr-6.x-Windows\solr\build\solr-core\test\J0\temp\solr.schema.TestManagedSchemaAPI_24425B944C2AAEFC-001\tempDir-001\node1: java.nio.file.DirectoryNotEmptyException: C:\Users\jenkins\workspace\Lucene-Solr-6.x-Windows\solr\build\solr-core\test\J0\temp\solr.schema.TestManagedSchemaAPI_24425B944C2AAEFC-001\tempDir-001\node1    C:\Users\jenkins\workspace\Lucene-Solr-6.x-Windows\solr\build\solr-core\test\J0\temp\solr.schema.TestManagedSchemaAPI_24425B944C2AAEFC-001\tempDir-001: java.nio.file.DirectoryNotEmptyException: C:\Users\jenkins\workspace\Lucene-Solr-6.x-Windows\solr\build\solr-core\test\J0\temp\solr.schema.TestManagedSchemaAPI_24425B944C2AAEFC-001\tempDir-001    C:\Users\jenkins\workspace\Lucene-Solr-6.x-Windows\solr\build\solr-core\test\J0\temp\solr.schema.TestManagedSchemaAPI_24425B944C2AAEFC-001: java.nio.file.DirectoryNotEmptyException: C:\Users\jenkins\workspace\Lucene-Solr-6.x-Windows\solr\build\solr-core\test\J0\temp\solr.schema.TestManagedSchemaAPI_24425B944C2AAEFC-001 

Stack Trace:
java.io.IOException: Could not remove the following files (in the order of attempts):
   C:\Users\jenkins\workspace\Lucene-Solr-6.x-Windows\solr\build\solr-core\test\J0\temp\solr.schema.TestManagedSchemaAPI_24425B944C2AAEFC-001\tempDir-001\node1\testschemaapi_shard1_replica2\data\tlog\tlog.0000000000000000000: java.nio.file.FileSystemException: C:\Users\jenkins\workspace\Lucene-Solr-6.x-Windows\solr\build\solr-core\test\J0\temp\solr.schema.TestManagedSchemaAPI_24425B944C2AAEFC-001\tempDir-001\node1\testschemaapi_shard1_replica2\data\tlog\tlog.0000000000000000000: The process cannot access the file because it is being used by another process.

   C:\Users\jenkins\workspace\Lucene-Solr-6.x-Windows\solr\build\solr-core\test\J0\temp\solr.schema.TestManagedSchemaAPI_24425B944C2AAEFC-001\tempDir-001\node1\testschemaapi_shard1_replica2\data\tlog: java.nio.file.DirectoryNotEmptyException: C:\Users\jenkins\workspace\Lucene-Solr-6.x-Windows\solr\build\solr-core\test\J0\temp\solr.schema.TestManagedSchemaAPI_24425B944C2AAEFC-001\tempDir-001\node1\testschemaapi_shard1_replica2\data\tlog
   C:\Users\jenkins\workspace\Lucene-Solr-6.x-Windows\solr\build\solr-core\test\J0\temp\solr.schema.TestManagedSchemaAPI_24425B944C2AAEFC-001\tempDir-001\node1\testschemaapi_shard1_replica2\data: java.nio.file.DirectoryNotEmptyException: C:\Users\jenkins\workspace\Lucene-Solr-6.x-Windows\solr\build\solr-core\test\J0\temp\solr.schema.TestManagedSchemaAPI_24425B944C2AAEFC-001\tempDir-001\node1\testschemaapi_shard1_replica2\data
   C:\Users\jenkins\workspace\Lucene-Solr-6.x-Windows\solr\build\solr-core\test\J0\temp\solr.schema.TestManagedSchemaAPI_24425B944C2AAEFC-001\tempDir-001\node1\testschemaapi_shard1_replica2: java.nio.file.DirectoryNotEmptyException: C:\Users\jenkins\workspace\Lucene-Solr-6.x-Windows\solr\build\solr-core\test\J0\temp\solr.schema.TestManagedSchemaAPI_24425B944C2AAEFC-001\tempDir-001\node1\testschemaapi_shard1_replica2
   C:\Users\jenkins\workspace\Lucene-Solr-6.x-Windows\solr\build\solr-core\test\J0\temp\solr.schema.TestManagedSchemaAPI_24425B944C2AAEFC-001\tempDir-001\node1: java.nio.file.DirectoryNotEmptyException: C:\Users\jenkins\workspace\Lucene-Solr-6.x-Windows\solr\build\solr-core\test\J0\temp\solr.schema.TestManagedSchemaAPI_24425B944C2AAEFC-001\tempDir-001\node1
   C:\Users\jenkins\workspace\Lucene-Solr-6.x-Windows\solr\build\solr-core\test\J0\temp\solr.schema.TestManagedSchemaAPI_24425B944C2AAEFC-001\tempDir-001: java.nio.file.DirectoryNotEmptyException: C:\Users\jenkins\workspace\Lucene-Solr-6.x-Windows\solr\build\solr-core\test\J0\temp\solr.schema.TestManagedSchemaAPI_24425B944C2AAEFC-001\tempDir-001
   C:\Users\jenkins\workspace\Lucene-Solr-6.x-Windows\solr\build\solr-core\test\J0\temp\solr.schema.TestManagedSchemaAPI_24425B944C2AAEFC-001: java.nio.file.DirectoryNotEmptyException: C:\Users\jenkins\workspace\Lucene-Solr-6.x-Windows\solr\build\solr-core\test\J0\temp\solr.schema.TestManagedSchemaAPI_24425B944C2AAEFC-001

	at org.apache.lucene.util.IOUtils.rm(IOUtils.java:323)
	at org.apache.lucene.util.TestRuleTemporaryFilesCleanup.afterAlways(TestRuleTemporaryFilesCleanup.java:216)
	at com.carrotsearch.randomizedtesting.rules.TestRuleAdapter$1.afterAlways(TestRuleAdapter.java:31)
	at com.carrotsearch.randomizedtesting.rules.StatementAdapter.evaluate(StatementAdapter.java:43)
	at com.carrotsearch.randomizedtesting.rules.StatementAdapter.evaluate(StatementAdapter.java:36)
	at org.apache.lucene.util.TestRuleAssertionsRequired$1.evaluate(TestRuleAssertionsRequired.java:53)
	at org.apache.lucene.util.TestRuleMarkFailure$1.evaluate(TestRuleMarkFailure.java:47)
	at org.apache.lucene.util.TestRuleIgnoreAfterMaxFailures$1.evaluate(TestRuleIgnoreAfterMaxFailures.java:64)
	at org.apache.lucene.util.TestRuleIgnoreTestSuites$1.evaluate(TestRuleIgnoreTestSuites.java:54)
	at com.carrotsearch.randomizedtesting.rules.StatementAdapter.evaluate(StatementAdapter.java:36)
	at com.carrotsearch.randomizedtesting.ThreadLeakControl$StatementRunner.run(ThreadLeakControl.java:367)
	at java.lang.Thread.run(Thread.java:745)




Build Log:
[...truncated 12405 lines...]
   [junit4] Suite: org.apache.solr.schema.TestManagedSchemaAPI
   [junit4]   2> Creating dataDir: C:\Users\jenkins\workspace\Lucene-Solr-6.x-Windows\solr\build\solr-core\test\J0\temp\solr.schema.TestManagedSchemaAPI_24425B944C2AAEFC-001\init-core-data-001
   [junit4]   2> 3391727 INFO  (SUITE-TestManagedSchemaAPI-seed#[24425B944C2AAEFC]-worker) [    ] o.a.s.SolrTestCaseJ4 Randomized ssl (true) and clientAuth (false) via: @org.apache.solr.util.RandomizeSSL(reason=, value=NaN, ssl=NaN, clientAuth=NaN)
   [junit4]   2> 3391730 INFO  (SUITE-TestManagedSchemaAPI-seed#[24425B944C2AAEFC]-worker) [    ] o.a.s.c.ZkTestServer STARTING ZK TEST SERVER
   [junit4]   2> 3391730 INFO  (Thread-6640) [    ] o.a.s.c.ZkTestServer client port:0.0.0.0/0.0.0.0:0
   [junit4]   2> 3391730 INFO  (Thread-6640) [    ] o.a.s.c.ZkTestServer Starting server
   [junit4]   2> 3391831 INFO  (SUITE-TestManagedSchemaAPI-seed#[24425B944C2AAEFC]-worker) [    ] o.a.s.c.ZkTestServer start zk server on port:58325
   [junit4]   2> 3391831 INFO  (SUITE-TestManagedSchemaAPI-seed#[24425B944C2AAEFC]-worker) [    ] o.a.s.c.c.SolrZkClient Using default ZkCredentialsProvider
   [junit4]   2> 3391832 INFO  (SUITE-TestManagedSchemaAPI-seed#[24425B944C2AAEFC]-worker) [    ] o.a.s.c.c.ConnectionManager Waiting for client to connect to ZooKeeper
   [junit4]   2> 3391835 INFO  (zkCallback-11140-thread-1) [    ] o.a.s.c.c.ConnectionManager Watcher org.apache.solr.common.cloud.ConnectionManager@7bf89a3a name:ZooKeeperConnection Watcher:127.0.0.1:58325 got event WatchedEvent state:SyncConnected type:None path:null path:null type:None
   [junit4]   2> 3391835 INFO  (SUITE-TestManagedSchemaAPI-seed#[24425B944C2AAEFC]-worker) [    ] o.a.s.c.c.ConnectionManager Client is connected to ZooKeeper
   [junit4]   2> 3391835 INFO  (SUITE-TestManagedSchemaAPI-seed#[24425B944C2AAEFC]-worker) [    ] o.a.s.c.c.SolrZkClient Using default ZkACLProvider
   [junit4]   2> 3391835 INFO  (SUITE-TestManagedSchemaAPI-seed#[24425B944C2AAEFC]-worker) [    ] o.a.s.c.c.SolrZkClient makePath: /solr/solr.xml
   [junit4]   2> 3391838 INFO  (SUITE-TestManagedSchemaAPI-seed#[24425B944C2AAEFC]-worker) [    ] o.a.s.c.c.SolrZkClient makePath: /solr/clusterprops.json
   [junit4]   2> 3391848 INFO  (jetty-launcher-11139-thread-1) [    ] o.e.j.s.Server jetty-9.3.8.v20160314
   [junit4]   2> 3391848 INFO  (jetty-launcher-11139-thread-2) [    ] o.e.j.s.Server jetty-9.3.8.v20160314
   [junit4]   2> 3391850 INFO  (jetty-launcher-11139-thread-1) [    ] o.e.j.s.h.ContextHandler Started o.e.j.s.ServletContextHandler@56f4382f{/solr,null,AVAILABLE}
   [junit4]   2> 3391850 INFO  (jetty-launcher-11139-thread-2) [    ] o.e.j.s.h.ContextHandler Started o.e.j.s.ServletContextHandler@a07dcaf{/solr,null,AVAILABLE}
   [junit4]   2> 3391853 INFO  (jetty-launcher-11139-thread-2) [    ] o.e.j.s.ServerConnector Started ServerConnector@7ddcb2bc{SSL,[ssl, http/1.1]}{127.0.0.1:58330}
   [junit4]   2> 3391853 INFO  (jetty-launcher-11139-thread-1) [    ] o.e.j.s.ServerConnector Started ServerConnector@72020c0b{SSL,[ssl, http/1.1]}{127.0.0.1:58329}
   [junit4]   2> 3391854 INFO  (jetty-launcher-11139-thread-2) [    ] o.e.j.s.Server Started @3397087ms
   [junit4]   2> 3391854 INFO  (jetty-launcher-11139-thread-1) [    ] o.e.j.s.Server Started @3397087ms
   [junit4]   2> 3391854 INFO  (jetty-launcher-11139-thread-2) [    ] o.a.s.c.s.e.JettySolrRunner Jetty properties: {hostContext=/solr, hostPort=58330}
   [junit4]   2> 3391854 INFO  (jetty-launcher-11139-thread-1) [    ] o.a.s.c.s.e.JettySolrRunner Jetty properties: {hostContext=/solr, hostPort=58329}
   [junit4]   2> 3391854 INFO  (jetty-launcher-11139-thread-2) [    ] o.a.s.s.SolrDispatchFilter SolrDispatchFilter.init(): sun.misc.Launcher$AppClassLoader@73d16e93
   [junit4]   2> 3391854 INFO  (jetty-launcher-11139-thread-1) [    ] o.a.s.s.SolrDispatchFilter SolrDispatchFilter.init(): sun.misc.Launcher$AppClassLoader@73d16e93
   [junit4]   2> 3391854 INFO  (jetty-launcher-11139-thread-2) [    ] o.a.s.c.SolrResourceLoader new SolrResourceLoader for directory: 'C:\Users\jenkins\workspace\Lucene-Solr-6.x-Windows\solr\build\solr-core\test\J0\temp\solr.schema.TestManagedSchemaAPI_24425B944C2AAEFC-001\tempDir-001\node2'
   [junit4]   2> 3391854 INFO  (jetty-launcher-11139-thread-1) [    ] o.a.s.c.SolrResourceLoader new SolrResourceLoader for directory: 'C:\Users\jenkins\workspace\Lucene-Solr-6.x-Windows\solr\build\solr-core\test\J0\temp\solr.schema.TestManagedSchemaAPI_24425B944C2AAEFC-001\tempDir-001\node1'
   [junit4]   2> 3391854 INFO  (jetty-launcher-11139-thread-2) [    ] o.a.s.c.SolrResourceLoader JNDI not configured for solr (NoInitialContextEx)
   [junit4]   2> 3391855 INFO  (jetty-launcher-11139-thread-1) [    ] o.a.s.c.SolrResourceLoader JNDI not configured for solr (NoInitialContextEx)
   [junit4]   2> 3391855 INFO  (jetty-launcher-11139-thread-2) [    ] o.a.s.c.SolrResourceLoader solr home defaulted to 'solr/' (could not find system property or JNDI)
   [junit4]   2> 3391855 INFO  (jetty-launcher-11139-thread-1) [    ] o.a.s.c.SolrResourceLoader solr home defaulted to 'solr/' (could not find system property or JNDI)
   [junit4]   2> 3391855 INFO  (jetty-launcher-11139-thread-2) [    ] o.a.s.c.c.SolrZkClient Using default ZkCredentialsProvider
   [junit4]   2> 3391855 INFO  (jetty-launcher-11139-thread-1) [    ] o.a.s.c.c.SolrZkClient Using default ZkCredentialsProvider
   [junit4]   2> 3391856 INFO  (jetty-launcher-11139-thread-2) [    ] o.a.s.c.c.ConnectionManager Waiting for client to connect to ZooKeeper
   [junit4]   2> 3391856 INFO  (jetty-launcher-11139-thread-1) [    ] o.a.s.c.c.ConnectionManager Waiting for client to connect to ZooKeeper
   [junit4]   2> 3391857 INFO  (zkCallback-11141-thread-1) [    ] o.a.s.c.c.ConnectionManager Watcher org.apache.solr.common.cloud.ConnectionManager@2877ef1 name:ZooKeeperConnection Watcher:127.0.0.1:58325/solr got event WatchedEvent state:SyncConnected type:None path:null path:null type:None
   [junit4]   2> 3391857 INFO  (jetty-launcher-11139-thread-2) [    ] o.a.s.c.c.ConnectionManager Client is connected to ZooKeeper
   [junit4]   2> 3391858 INFO  (jetty-launcher-11139-thread-2) [    ] o.a.s.c.c.SolrZkClient Using default ZkACLProvider
   [junit4]   2> 3391858 INFO  (zkCallback-11142-thread-1) [    ] o.a.s.c.c.ConnectionManager Watcher org.apache.solr.common.cloud.ConnectionManager@69406ef1 name:ZooKeeperConnection Watcher:127.0.0.1:58325/solr got event WatchedEvent state:SyncConnected type:None path:null path:null type:None
   [junit4]   2> 3391858 INFO  (jetty-launcher-11139-thread-1) [    ] o.a.s.c.c.ConnectionManager Client is connected to ZooKeeper
   [junit4]   2> 3391858 INFO  (jetty-launcher-11139-thread-1) [    ] o.a.s.c.c.SolrZkClient Using default ZkACLProvider
   [junit4]   2> 3391858 INFO  (jetty-launcher-11139-thread-2) [    ] o.a.s.s.SolrDispatchFilter solr.xml found in ZooKeeper. Loading...
   [junit4]   2> 3391858 INFO  (jetty-launcher-11139-thread-1) [    ] o.a.s.s.SolrDispatchFilter solr.xml found in ZooKeeper. Loading...
   [junit4]   2> 3391872 WARN  (NIOServerCxn.Factory:0.0.0.0/0.0.0.0:0) [    ] o.a.z.s.NIOServerCnxn caught end of stream exception
   [junit4]   2> EndOfStreamException: Unable to read additional data from client sessionid 0x1558857d0c10002, likely client has closed socket
   [junit4]   2> 	at org.apache.zookeeper.server.NIOServerCnxn.doIO(NIOServerCnxn.java:228)
   [junit4]   2> 	at org.apache.zookeeper.server.NIOServerCnxnFactory.run(NIOServerCnxnFactory.java:208)
   [junit4]   2> 	at java.lang.Thread.run(Thread.java:745)
   [junit4]   2> 3391872 INFO  (jetty-launcher-11139-thread-1) [    ] o.a.s.c.CorePropertiesLocator Config-defined core root directory: C:\Users\jenkins\workspace\Lucene-Solr-6.x-Windows\solr\build\solr-core\test\J0\temp\solr.schema.TestManagedSchemaAPI_24425B944C2AAEFC-001\tempDir-001\node1\.
   [junit4]   2> 3391873 INFO  (jetty-launcher-11139-thread-1) [    ] o.a.s.c.CoreContainer New CoreContainer 2099069090
   [junit4]   2> 3391873 INFO  (jetty-launcher-11139-thread-1) [    ] o.a.s.c.CoreContainer Loading cores into CoreContainer [instanceDir=C:\Users\jenkins\workspace\Lucene-Solr-6.x-Windows\solr\build\solr-core\test\J0\temp\solr.schema.TestManagedSchemaAPI_24425B944C2AAEFC-001\tempDir-001\node1]
   [junit4]   2> 3391873 WARN  (jetty-launcher-11139-thread-1) [    ] o.a.s.c.CoreContainer Couldn't add files from C:\Users\jenkins\workspace\Lucene-Solr-6.x-Windows\solr\build\solr-core\test\J0\temp\solr.schema.TestManagedSchemaAPI_24425B944C2AAEFC-001\tempDir-001\node1\lib to classpath: C:\Users\jenkins\workspace\Lucene-Solr-6.x-Windows\solr\build\solr-core\test\J0\temp\solr.schema.TestManagedSchemaAPI_24425B944C2AAEFC-001\tempDir-001\node1\lib
   [junit4]   2> 3391873 INFO  (jetty-launcher-11139-thread-1) [    ] o.a.s.h.c.HttpShardHandlerFactory created with socketTimeout : 90000,urlScheme : https,connTimeout : 15000,maxConnectionsPerHost : 20,maxConnections : 10000,corePoolSize : 0,maximumPoolSize : 2147483647,maxThreadIdleTime : 5,sizeOfQueue : -1,fairnessPolicy : false,useRetries : false,
   [junit4]   2> 3391876 INFO  (jetty-launcher-11139-thread-2) [    ] o.a.s.c.CorePropertiesLocator Config-defined core root directory: C:\Users\jenkins\workspace\Lucene-Solr-6.x-Windows\solr\build\solr-core\test\J0\temp\solr.schema.TestManagedSchemaAPI_24425B944C2AAEFC-001\tempDir-001\node2\.
   [junit4]   2> 3391876 INFO  (jetty-launcher-11139-thread-2) [    ] o.a.s.c.CoreContainer New CoreContainer 1215253235
   [junit4]   2> 3391876 INFO  (jetty-launcher-11139-thread-2) [    ] o.a.s.c.CoreContainer Loading cores into CoreContainer [instanceDir=C:\Users\jenkins\workspace\Lucene-Solr-6.x-Windows\solr\build\solr-core\test\J0\temp\solr.schema.TestManagedSchemaAPI_24425B944C2AAEFC-001\tempDir-001\node2]
   [junit4]   2> 3391876 WARN  (jetty-launcher-11139-thread-2) [    ] o.a.s.c.CoreContainer Couldn't add files from C:\Users\jenkins\workspace\Lucene-Solr-6.x-Windows\solr\build\solr-core\test\J0\temp\solr.schema.TestManagedSchemaAPI_24425B944C2AAEFC-001\tempDir-001\node2\lib to classpath: C:\Users\jenkins\workspace\Lucene-Solr-6.x-Windows\solr\build\solr-core\test\J0\temp\solr.schema.TestManagedSchemaAPI_24425B944C2AAEFC-001\tempDir-001\node2\lib
   [junit4]   2> 3391876 INFO  (jetty-launcher-11139-thread-2) [    ] o.a.s.h.c.HttpShardHandlerFactory created with socketTimeout : 90000,urlScheme : https,connTimeout : 15000,maxConnectionsPerHost : 20,maxConnections : 10000,corePoolSize : 0,maximumPoolSize : 2147483647,maxThreadIdleTime : 5,sizeOfQueue : -1,fairnessPolicy : false,useRetries : false,
   [junit4]   2> 3391876 INFO  (jetty-launcher-11139-thread-1) [    ] o.a.s.u.UpdateShardHandler Creating UpdateShardHandler HTTP client with params: socketTimeout=340000&connTimeout=45000&retry=true
   [junit4]   2> 3391877 INFO  (jetty-launcher-11139-thread-2) [    ] o.a.s.u.UpdateShardHandler Creating UpdateShardHandler HTTP client with params: socketTimeout=340000&connTimeout=45000&retry=true
   [junit4]   2> 3391877 INFO  (jetty-launcher-11139-thread-1) [    ] o.a.s.l.LogWatcher SLF4J impl is org.slf4j.impl.Log4jLoggerFactory
   [junit4]   2> 3391877 INFO  (jetty-launcher-11139-thread-1) [    ] o.a.s.l.LogWatcher Registering Log Listener [Log4j (org.slf4j.impl.Log4jLoggerFactory)]
   [junit4]   2> 3391877 INFO  (jetty-launcher-11139-thread-1) [    ] o.a.s.c.ZkContainer Zookeeper client=127.0.0.1:58325/solr
   [junit4]   2> 3391877 INFO  (jetty-launcher-11139-thread-1) [    ] o.a.s.c.ZkController zkHost includes chroot
   [junit4]   2> 3391877 INFO  (jetty-launcher-11139-thread-1) [    ] o.a.s.c.c.SolrZkClient Using default ZkCredentialsProvider
   [junit4]   2> 3391877 INFO  (jetty-launcher-11139-thread-2) [    ] o.a.s.l.LogWatcher SLF4J impl is org.slf4j.impl.Log4jLoggerFactory
   [junit4]   2> 3391877 INFO  (jetty-launcher-11139-thread-2) [    ] o.a.s.l.LogWatcher Registering Log Listener [Log4j (org.slf4j.impl.Log4jLoggerFactory)]
   [junit4]   2> 3391877 INFO  (jetty-launcher-11139-thread-2) [    ] o.a.s.c.ZkContainer Zookeeper client=127.0.0.1:58325/solr
   [junit4]   2> 3391877 INFO  (jetty-launcher-11139-thread-2) [    ] o.a.s.c.ZkController zkHost includes chroot
   [junit4]   2> 3391878 INFO  (jetty-launcher-11139-thread-2) [    ] o.a.s.c.c.SolrZkClient Using default ZkCredentialsProvider
   [junit4]   2> 3391878 INFO  (jetty-launcher-11139-thread-1) [    ] o.a.s.c.c.ConnectionManager Waiting for client to connect to ZooKeeper
   [junit4]   2> 3391878 INFO  (jetty-launcher-11139-thread-2) [    ] o.a.s.c.c.ConnectionManager Waiting for client to connect to ZooKeeper
   [junit4]   2> 3391879 INFO  (zkCallback-11147-thread-1) [    ] o.a.s.c.c.ConnectionManager Watcher org.apache.solr.common.cloud.ConnectionManager@7aa7141d name:ZooKeeperConnection Watcher:127.0.0.1:58325 got event WatchedEvent state:SyncConnected type:None path:null path:null type:None
   [junit4]   2> 3391880 INFO  (jetty-launcher-11139-thread-1) [    ] o.a.s.c.c.ConnectionManager Client is connected to ZooKeeper
   [junit4]   2> 3391880 INFO  (jetty-launcher-11139-thread-1) [    ] o.a.s.c.c.SolrZkClient Using default ZkACLProvider
   [junit4]   2> 3391880 INFO  (zkCallback-11148-thread-1) [    ] o.a.s.c.c.ConnectionManager Watcher org.apache.solr.common.cloud.ConnectionManager@610602cf name:ZooKeeperConnection Watcher:127.0.0.1:58325 got event WatchedEvent state:SyncConnected type:None path:null path:null type:None
   [junit4]   2> 3391880 INFO  (jetty-launcher-11139-thread-2) [    ] o.a.s.c.c.ConnectionManager Client is connected to ZooKeeper
   [junit4]   2> 3391880 INFO  (jetty-launcher-11139-thread-2) [    ] o.a.s.c.c.SolrZkClient Using default ZkACLProvider
   [junit4]   2> 3391882 WARN  (NIOServerCxn.Factory:0.0.0.0/0.0.0.0:0) [    ] o.a.z.s.NIOServerCnxn caught end of stream exception
   [junit4]   2> EndOfStreamException: Unable to read additional data from client sessionid 0x1558857d0c10004, likely client has closed socket
   [junit4]   2> 	at org.apache.zookeeper.server.NIOServerCnxn.doIO(NIOServerCnxn.java:228)
   [junit4]   2> 	at org.apache.zookeeper.server.NIOServerCnxnFactory.run(NIOServerCnxnFactory.java:208)
   [junit4]   2> 	at java.lang.Thread.run(Thread.java:745)
   [junit4]   2> 3391882 INFO  (jetty-launcher-11139-thread-1) [n:127.0.0.1:58329_solr    ] o.a.s.c.ZkController Added new OnReconnect listener org.apache.solr.cloud.ZkController$$Lambda$13/1895325907@1fb6bc0d
   [junit4]   2> 3391886 INFO  (jetty-launcher-11139-thread-2) [n:127.0.0.1:58330_solr    ] o.a.s.c.ZkController Added new OnReconnect listener org.apache.solr.cloud.ZkController$$Lambda$13/1895325907@5db4f5d6
   [junit4]   2> 3391886 INFO  (jetty-launcher-11139-thread-1) [n:127.0.0.1:58329_solr    ] o.a.s.c.c.ConnectionManager Waiting for client to connect to ZooKeeper
   [junit4]   2> 3391886 INFO  (jetty-launcher-11139-thread-2) [n:127.0.0.1:58330_solr    ] o.a.s.c.c.ConnectionManager Waiting for client to connect to ZooKeeper
   [junit4]   2> 3391887 INFO  (zkCallback-11149-thread-1-processing-n:127.0.0.1:58329_solr) [n:127.0.0.1:58329_solr    ] o.a.s.c.c.ConnectionManager Watcher org.apache.solr.common.cloud.ConnectionManager@24e22f13 name:ZooKeeperConnection Watcher:127.0.0.1:58325/solr got event WatchedEvent state:SyncConnected type:None path:null path:null type:None
   [junit4]   2> 3391888 INFO  (jetty-launcher-11139-thread-1) [n:127.0.0.1:58329_solr    ] o.a.s.c.c.ConnectionManager Client is connected to ZooKeeper
   [junit4]   2> 3391888 INFO  (zkCallback-11150-thread-1-processing-n:127.0.0.1:58330_solr) [n:127.0.0.1:58330_solr    ] o.a.s.c.c.ConnectionManager Watcher org.apache.solr.common.cloud.ConnectionManager@55f7a51d name:ZooKeeperConnection Watcher:127.0.0.1:58325/solr got event WatchedEvent state:SyncConnected type:None path:null path:null type:None
   [junit4]   2> 3391888 INFO  (jetty-launcher-11139-thread-2) [n:127.0.0.1:58330_solr    ] o.a.s.c.c.ConnectionManager Client is connected to ZooKeeper
   [junit4]   2> 3391890 INFO  (jetty-launcher-11139-thread-1) [n:127.0.0.1:58329_solr    ] o.a.s.c.c.SolrZkClient makePath: /overseer/queue
   [junit4]   2> 3391890 INFO  (jetty-launcher-11139-thread-2) [n:127.0.0.1:58330_solr    ] o.a.s.c.c.SolrZkClient makePath: /overseer/queue
   [junit4]   2> 3391892 INFO  (jetty-launcher-11139-thread-2) [n:127.0.0.1:58330_solr    ] o.a.s.c.c.SolrZkClient makePath: /overseer/collection-queue-work
   [junit4]   2> 3391892 INFO  (jetty-launcher-11139-thread-1) [n:127.0.0.1:58329_solr    ] o.a.s.c.c.SolrZkClient makePath: /overseer/collection-queue-work
   [junit4]   2> 3391895 INFO  (jetty-launcher-11139-thread-1) [n:127.0.0.1:58329_solr    ] o.a.s.c.c.SolrZkClient makePath: /overseer/collection-map-running
   [junit4]   2> 3391895 INFO  (jetty-launcher-11139-thread-2) [n:127.0.0.1:58330_solr    ] o.a.s.c.c.SolrZkClient makePath: /overseer/collection-map-running
   [junit4]   2> 3391898 INFO  (jetty-launcher-11139-thread-1) [n:127.0.0.1:58329_solr    ] o.a.s.c.c.SolrZkClient makePath: /overseer/collection-map-completed
   [junit4]   2> 3391898 INFO  (jetty-launcher-11139-thread-2) [n:127.0.0.1:58330_solr    ] o.a.s.c.c.SolrZkClient makePath: /overseer/collection-map-completed
   [junit4]   2> 3391900 INFO  (jetty-launcher-11139-thread-2) [n:127.0.0.1:58330_solr    ] o.a.s.c.c.SolrZkClient makePath: /overseer/collection-map-failure
   [junit4]   2> 3391900 INFO  (jetty-launcher-11139-thread-1) [n:127.0.0.1:58329_solr    ] o.a.s.c.c.SolrZkClient makePath: /overseer/collection-map-failure
   [junit4]   2> 3391902 INFO  (jetty-launcher-11139-thread-1) [n:127.0.0.1:58329_solr    ] o.a.s.c.c.SolrZkClient makePath: /live_nodes
   [junit4]   2> 3391903 INFO  (jetty-launcher-11139-thread-2) [n:127.0.0.1:58330_solr    ] o.a.s.c.c.SolrZkClient makePath: /live_nodes
   [junit4]   2> 3391903 INFO  (jetty-launcher-11139-thread-1) [n:127.0.0.1:58329_solr    ] o.a.s.c.c.SolrZkClient makePath: /collections
   [junit4]   2> 3391903 INFO  (jetty-launcher-11139-thread-2) [n:127.0.0.1:58330_solr    ] o.a.s.c.c.SolrZkClient makePath: /collections
   [junit4]   2> 3391904 INFO  (jetty-launcher-11139-thread-1) [n:127.0.0.1:58329_solr    ] o.a.s.c.c.SolrZkClient makePath: /aliases.json
   [junit4]   2> 3391905 INFO  (jetty-launcher-11139-thread-2) [n:127.0.0.1:58330_solr    ] o.a.s.c.c.SolrZkClient makePath: /aliases.json
   [junit4]   2> 3391906 INFO  (jetty-launcher-11139-thread-2) [n:127.0.0.1:58330_solr    ] o.a.s.c.c.SolrZkClient makePath: /clusterstate.json
   [junit4]   2> 3391906 INFO  (jetty-launcher-11139-thread-1) [n:127.0.0.1:58329_solr    ] o.a.s.c.c.SolrZkClient makePath: /clusterstate.json
   [junit4]   2> 3391907 INFO  (jetty-launcher-11139-thread-2) [n:127.0.0.1:58330_solr    ] o.a.s.c.c.SolrZkClient makePath: /security.json
   [junit4]   2> 3391907 INFO  (jetty-launcher-11139-thread-1) [n:127.0.0.1:58329_solr    ] o.a.s.c.c.SolrZkClient makePath: /security.json
   [junit4]   2> 3391907 INFO  (jetty-launcher-11139-thread-1) [n:127.0.0.1:58329_solr    ] o.a.s.c.c.ZkStateReader Updating cluster state from ZooKeeper... 
   [junit4]   2> 3391908 INFO  (jetty-launcher-11139-thread-2) [n:127.0.0.1:58330_solr    ] o.a.s.c.c.ZkStateReader Updating cluster state from ZooKeeper... 
   [junit4]   2> 3391910 INFO  (jetty-launcher-11139-thread-1) [n:127.0.0.1:58329_solr    ] o.a.s.c.c.ZkStateReader Loaded cluster properties: {urlScheme=https}
   [junit4]   2> 3391910 INFO  (jetty-launcher-11139-thread-2) [n:127.0.0.1:58330_solr    ] o.a.s.c.c.ZkStateReader Loaded cluster properties: {urlScheme=https}
   [junit4]   2> 3391910 INFO  (jetty-launcher-11139-thread-2) [n:127.0.0.1:58330_solr    ] o.a.s.c.c.ZkStateReader Updated live nodes from ZooKeeper... (0) -> (0)
   [junit4]   2> 3391910 INFO  (jetty-launcher-11139-thread-1) [n:127.0.0.1:58329_solr    ] o.a.s.c.c.ZkStateReader Updated live nodes from ZooKeeper... (0) -> (0)
   [junit4]   2> 3391913 INFO  (jetty-launcher-11139-thread-2) [n:127.0.0.1:58330_solr    ] o.a.s.c.c.SolrZkClient makePath: /overseer_elect
   [junit4]   2> 3391913 INFO  (jetty-launcher-11139-thread-1) [n:127.0.0.1:58329_solr    ] o.a.s.c.c.SolrZkClient makePath: /overseer_elect
   [junit4]   2> 3391914 INFO  (jetty-launcher-11139-thread-1) [n:127.0.0.1:58329_solr    ] o.a.s.c.c.SolrZkClient makePath: /overseer_elect/election
   [junit4]   2> 3391914 INFO  (jetty-launcher-11139-thread-2) [n:127.0.0.1:58330_solr    ] o.a.s.c.c.SolrZkClient makePath: /overseer_elect/election
   [junit4]   2> 3391915 INFO  (jetty-launcher-11139-thread-2) [n:127.0.0.1:58330_solr    ] o.a.s.c.Overseer Overseer (id=null) closing
   [junit4]   2> 3391915 INFO  (jetty-launcher-11139-thread-1) [n:127.0.0.1:58329_solr    ] o.a.s.c.Overseer Overseer (id=null) closing
   [junit4]   2> 3391915 INFO  (jetty-launcher-11139-thread-2) [n:127.0.0.1:58330_solr    ] o.a.s.c.LeaderElector Joined leadership election with path: /overseer_elect/election/96132877804175366-127.0.0.1:58330_solr-n_0000000000
   [junit4]   2> 3391915 INFO  (jetty-launcher-11139-thread-1) [n:127.0.0.1:58329_solr    ] o.a.s.c.LeaderElector Joined leadership election with path: /overseer_elect/election/96132877804175365-127.0.0.1:58329_solr-n_0000000001
   [junit4]   2> 3391915 INFO  (jetty-launcher-11139-thread-2) [n:127.0.0.1:58330_solr    ] o.a.s.c.OverseerElectionContext I am going to be the leader 127.0.0.1:58330_solr
   [junit4]   2> 3391915 INFO  (jetty-launcher-11139-thread-2) [n:127.0.0.1:58330_solr    ] o.a.s.c.c.SolrZkClient makePath: /overseer_elect/leader
   [junit4]   2> 3391916 INFO  (jetty-launcher-11139-thread-1) [n:127.0.0.1:58329_solr    ] o.a.s.c.LeaderElector Watching path /overseer_elect/election/96132877804175366-127.0.0.1:58330_solr-n_0000000000 to know if I could be the leader
   [junit4]   2> 3391917 INFO  (jetty-launcher-11139-thread-1) [n:127.0.0.1:58329_solr    ] o.a.s.c.ZkController Register node as live in ZooKeeper:/live_nodes/127.0.0.1:58329_solr
   [junit4]   2> 3391917 INFO  (jetty-launcher-11139-thread-1) [n:127.0.0.1:58329_solr    ] o.a.s.c.c.SolrZkClient makePath: /live_nodes/127.0.0.1:58329_solr
   [junit4]   2> 3391918 INFO  (jetty-launcher-11139-thread-2) [n:127.0.0.1:58330_solr    ] o.a.s.c.Overseer Overseer (id=96132877804175366-127.0.0.1:58330_solr-n_0000000000) starting
   [junit4]   2> 3391918 INFO  (zkCallback-11150-thread-1-processing-n:127.0.0.1:58330_solr) [n:127.0.0.1:58330_solr    ] o.a.s.c.c.ZkStateReader A live node change: [WatchedEvent state:SyncConnected type:NodeChildrenChanged path:/live_nodes], has occurred - updating... (live nodes size: [0])
   [junit4]   2> 3391918 INFO  (zkCallback-11149-thread-1-processing-n:127.0.0.1:58329_solr) [n:127.0.0.1:58329_solr    ] o.a.s.c.c.ZkStateReader A live node change: [WatchedEvent state:SyncConnected type:NodeChildrenChanged path:/live_nodes], has occurred - updating... (live nodes size: [0])
   [junit4]   2> 3391919 INFO  (zkCallback-11149-thread-1-processing-n:127.0.0.1:58329_solr) [n:127.0.0.1:58329_solr    ] o.a.s.c.c.ZkStateReader Updated live nodes from ZooKeeper... (0) -> (1)
   [junit4]   2> 3391919 INFO  (zkCallback-11150-thread-1-processing-n:127.0.0.1:58330_solr) [n:127.0.0.1:58330_solr    ] o.a.s.c.c.ZkStateReader Updated live nodes from ZooKeeper... (0) -> (1)
   [junit4]   2> 3391919 INFO  (jetty-launcher-11139-thread-2) [n:127.0.0.1:58330_solr    ] o.a.s.c.c.SolrZkClient makePath: /overseer/queue-work
   [junit4]   2> 3391925 INFO  (jetty-launcher-11139-thread-1) [n:127.0.0.1:58329_solr    ] o.a.s.c.CoreContainer Security conf doesn't exist. Skipping setup for authorization module.
   [junit4]   2> 3391925 INFO  (jetty-launcher-11139-thread-1) [n:127.0.0.1:58329_solr    ] o.a.s.c.CoreContainer No authentication plugin used.
   [junit4]   2> 3391926 INFO  (jetty-launcher-11139-thread-2) [n:127.0.0.1:58330_solr    ] o.a.s.c.OverseerAutoReplicaFailoverThread Starting OverseerAutoReplicaFailoverThread autoReplicaFailoverWorkLoopDelay=10000 autoReplicaFailoverWaitAfterExpiration=30000 autoReplicaFailoverBadNodeExpiration=60000
   [junit4]   2> 3391926 INFO  (OverseerCollectionConfigSetProcessor-96132877804175366-127.0.0.1:58330_solr-n_0000000000) [n:127.0.0.1:58330_solr    ] o.a.s.c.OverseerTaskProcessor Process current queue of overseer operations
   [junit4]   2> 3391926 INFO  (jetty-launcher-11139-thread-1) [n:127.0.0.1:58329_solr    ] o.a.s.c.CorePropertiesLocator Looking for core definitions underneath C:\Users\jenkins\workspace\Lucene-Solr-6.x-Windows\solr\build\solr-core\test\J0\temp\solr.schema.TestManagedSchemaAPI_24425B944C2AAEFC-001\tempDir-001\node1\.
   [junit4]   2> 3391927 INFO  (jetty-launcher-11139-thread-2) [n:127.0.0.1:58330_solr    ] o.a.s.c.ZkController Publish node=127.0.0.1:58330_solr as DOWN
   [junit4]   2> 3391927 INFO  (OverseerStateUpdate-96132877804175366-127.0.0.1:58330_solr-n_0000000000) [n:127.0.0.1:58330_solr    ] o.a.s.c.Overseer Starting to work on the main queue
   [junit4]   2> 3391927 INFO  (jetty-launcher-11139-thread-1) [n:127.0.0.1:58329_solr    ] o.a.s.c.CorePropertiesLocator Found 0 core definitions
   [junit4]   2> 3391927 INFO  (jetty-launcher-11139-thread-1) [n:127.0.0.1:58329_solr    ] o.a.s.s.SolrDispatchFilter user.dir=C:\Users\jenkins\workspace\Lucene-Solr-6.x-Windows\solr\build\solr-core\test\J0
   [junit4]   2> 3391927 INFO  (jetty-launcher-11139-thread-1) [n:127.0.0.1:58329_solr    ] o.a.s.s.SolrDispatchFilter SolrDispatchFilter.init() done
   [junit4]   2> 3391929 INFO  (OverseerStateUpdate-96132877804175366-127.0.0.1:58330_solr-n_0000000000) [n:127.0.0.1:58330_solr    ] o.a.s.c.c.ZkStateReader Updated live nodes from ZooKeeper... (1) -> (1)
   [junit4]   2> 3391930 INFO  (OverseerStateUpdate-96132877804175366-127.0.0.1:58330_solr-n_0000000000) [n:127.0.0.1:58330_solr    ] o.a.s.c.Overseer processMessage: queueSize: 1, message = {
   [junit4]   2>   "operation":"downnode",
   [junit4]   2>   "node_name":"127.0.0.1:58330_solr"} current state version: 0
   [junit4]   2> 3391930 INFO  (OverseerStateUpdate-96132877804175366-127.0.0.1:58330_solr-n_0000000000) [n:127.0.0.1:58330_solr    ] o.a.s.c.o.NodeMutator DownNode state invoked for node: 127.0.0.1:58330_solr
   [junit4]   2> 3392928 INFO  (jetty-launcher-11139-thread-2) [n:127.0.0.1:58330_solr    ] o.a.s.c.ZkController Register node as live in ZooKeeper:/live_nodes/127.0.0.1:58330_solr
   [junit4]   2> 3392928 INFO  (jetty-launcher-11139-thread-2) [n:127.0.0.1:58330_solr    ] o.a.s.c.c.SolrZkClient makePath: /live_nodes/127.0.0.1:58330_solr
   [junit4]   2> 3392930 INFO  (zkCallback-11150-thread-1-processing-n:127.0.0.1:58330_solr) [n:127.0.0.1:58330_solr    ] o.a.s.c.c.ZkStateReader A live node change: [WatchedEvent state:SyncConnected type:NodeChildrenChanged path:/live_nodes], has occurred - updating... (live nodes size: [1])
   [junit4]   2> 3392930 INFO  (zkCallback-11149-thread-1-processing-n:127.0.0.1:58329_solr) [n:127.0.0.1:58329_solr    ] o.a.s.c.c.ZkStateReader A live node change: [WatchedEvent state:SyncConnected type:NodeChildrenChanged path:/live_nodes], has occurred - updating... (live nodes size: [1])
   [junit4]   2> 3392930 INFO  (zkCallback-11149-thread-1-processing-n:127.0.0.1:58329_solr) [n:127.0.0.1:58329_solr    ] o.a.s.c.c.ZkStateReader Updated live nodes from ZooKeeper... (1) -> (2)
   [junit4]   2> 3392930 INFO  (zkCallback-11150-thread-1-processing-n:127.0.0.1:58330_solr) [n:127.0.0.1:58330_solr    ] o.a.s.c.c.ZkStateReader Updated live nodes from ZooKeeper... (1) -> (2)
   [junit4]   2> 3392936 INFO  (jetty-launcher-11139-thread-2) [n:127.0.0.1:58330_solr    ] o.a.s.c.CoreContainer Security conf doesn't exist. Skipping setup for authorization module.
   [junit4]   2> 3392936 INFO  (jetty-launcher-11139-thread-2) [n:127.0.0.1:58330_solr    ] o.a.s.c.CoreContainer No authentication plugin used.
   [junit4]   2> 3392937 INFO  (jetty-launcher-11139-thread-2) [n:127.0.0.1:58330_solr    ] o.a.s.c.CorePropertiesLocator Looking for core definitions underneath C:\Users\jenkins\workspace\Lucene-Solr-6.x-Windows\solr\build\solr-core\test\J0\temp\solr.schema.TestManagedSchemaAPI_24425B944C2AAEFC-001\tempDir-001\node2\.
   [junit4]   2> 3392938 INFO  (jetty-launcher-11139-thread-2) [n:127.0.0.1:58330_solr    ] o.a.s.c.CorePropertiesLocator Found 0 core definitions
   [junit4]   2> 3392938 INFO  (jetty-launcher-11139-thread-2) [n:127.0.0.1:58330_solr    ] o.a.s.s.SolrDispatchFilter user.dir=C:\Users\jenkins\workspace\Lucene-Solr-6.x-Windows\solr\build\solr-core\test\J0
   [junit4]   2> 3392938 INFO  (jetty-launcher-11139-thread-2) [n:127.0.0.1:58330_solr    ] o.a.s.s.SolrDispatchFilter SolrDispatchFilter.init() done
   [junit4]   2> 3392939 INFO  (SUITE-TestManagedSchemaAPI-seed#[24425B944C2AAEFC]-worker) [    ] o.a.s.c.c.SolrZkClient Using default ZkCredentialsProvider
   [junit4]   2> 3392939 INFO  (SUITE-TestManagedSchemaAPI-seed#[24425B944C2AAEFC]-worker) [    ] o.a.s.c.c.ConnectionManager Waiting for client to connect to ZooKeeper
   [junit4]   2> 3392941 INFO  (zkCallback-11153-thread-1) [    ] o.a.s.c.c.ConnectionManager Watcher org.apache.solr.common.cloud.ConnectionManager@3df45865 name:ZooKeeperConnection Watcher:127.0.0.1:58325 got event WatchedEvent state:SyncConnected type:None path:null path:null type:None
   [junit4]   2> 3392941 INFO  (SUITE-TestManagedSchemaAPI-seed#[24425B944C2AAEFC]-worker) [    ] o.a.s.c.c.ConnectionManager Client is connected to ZooKeeper
   [junit4]   2> 3392941 INFO  (SUITE-TestManagedSchemaAPI-seed#[24425B944C2AAEFC]-worker) [    ] o.a.s.c.c.SolrZkClient Using default ZkACLProvider
   [junit4]   2> 3392942 INFO  (SUITE-TestManagedSchemaAPI-seed#[24425B944C2AAEFC]-worker) [    ] o.a.s.c.s.i.CloudSolrClient Final constructed zkHost string: 127.0.0.1:58325/solr
   [junit4]   2> 3392942 INFO  (SUITE-TestManagedSchemaAPI-seed#[24425B944C2AAEFC]-worker) [    ] o.a.s.c.c.SolrZkClient Using default ZkCredentialsProvider
   [junit4]   2> 3392945 INFO  (SUITE-TestManagedSchemaAPI-seed#[24425B944C2AAEFC]-worker) [    ] o.a.s.c.c.ConnectionManager Waiting for client to connect to ZooKeeper
   [junit4]   2> 3392946 INFO  (zkCallback-11156-thread-1) [    ] o.a.s.c.c.ConnectionManager Watcher org.apache.solr.common.cloud.ConnectionManager@16372de8 name:ZooKeeperConnection Watcher:127.0.0.1:58325/solr got event WatchedEvent state:SyncConnected type:None path:null path:null type:None
   [junit4]   2> 3392946 INFO  (SUITE-TestManagedSchemaAPI-seed#[24425B944C2AAEFC]-worker) [    ] o.a.s.c.c.ConnectionManager Client is connected to ZooKeeper
   [junit4]   2> 3392946 INFO  (SUITE-TestManagedSchemaAPI-seed#[24425B944C2AAEFC]-worker) [    ] o.a.s.c.c.SolrZkClient Using default ZkACLProvider
   [junit4]   2> 3392946 INFO  (SUITE-TestManagedSchemaAPI-seed#[24425B944C2AAEFC]-worker) [    ] o.a.s.c.c.ZkStateReader Updating cluster state from ZooKeeper... 
   [junit4]   2> 3392947 INFO  (SUITE-TestManagedSchemaAPI-seed#[24425B944C2AAEFC]-worker) [    ] o.a.s.c.c.ZkStateReader Loaded cluster properties: {urlScheme=https}
   [junit4]   2> 3392948 INFO  (SUITE-TestManagedSchemaAPI-seed#[24425B944C2AAEFC]-worker) [    ] o.a.s.c.c.ZkStateReader Updated live nodes from ZooKeeper... (0) -> (2)
   [junit4]   2> 3392950 INFO  (SUITE-TestManagedSchemaAPI-seed#[24425B944C2AAEFC]-worker) [    ] o.a.s.c.c.SolrZkClient makePath: /configs/conf1/managed-schema
   [junit4]   2> 3392953 INFO  (SUITE-TestManagedSchemaAPI-seed#[24425B944C2AAEFC]-worker) [    ] o.a.s.c.c.SolrZkClient makePath: /configs/conf1/solrconfig.xml
   [junit4]   2> 3392969 INFO  (TEST-TestManagedSchemaAPI.test-seed#[24425B944C2AAEFC]) [    ] o.a.s.SolrTestCaseJ4 ###Starting test
   [junit4]   2> 3392988 INFO  (qtp1265287132-47605) [n:127.0.0.1:58330_solr    ] o.a.s.h.a.CollectionsHandler Invoked Collection Action :create with params replicationFactor=2&collection.configName=conf1&name=testschemaapi&action=CREATE&numShards=1&wt=javabin&version=2 and sendToOCPQueue=true
   [junit4]   2> 3392991 INFO  (OverseerCollectionConfigSetProcessor-96132877804175366-127.0.0.1:58330_solr-n_0000000000) [n:127.0.0.1:58330_solr    ] o.a.s.c.OverseerTaskProcessor Overseer Collection Message Handler: Get the message id:/overseer/collection-queue-work/qn-0000000000 message:{
   [junit4]   2>   "name":"testschemaapi",
   [junit4]   2>   "fromApi":"true",
   [junit4]   2>   "replicationFactor":"2",
   [junit4]   2>   "collection.configName":"conf1",
   [junit4]   2>   "numShards":"1",
   [junit4]   2>   "stateFormat":"2",
   [junit4]   2>   "operation":"create"}
   [junit4]   2> 3392991 INFO  (OverseerThreadFactory-10384-thread-1-processing-n:127.0.0.1:58330_solr) [n:127.0.0.1:58330_solr    ] o.a.s.c.OverseerCollectionMessageHandler OverseerCollectionMessageHandler.processMessage : create , {
   [junit4]   2>   "name":"testschemaapi",
   [junit4]   2>   "fromApi":"true",
   [junit4]   2>   "replicationFactor":"2",
   [junit4]   2>   "collection.configName":"conf1",
   [junit4]   2>   "numShards":"1",
   [junit4]   2>   "stateFormat":"2",
   [junit4]   2>   "operation":"create"}
   [junit4]   2> 3392992 INFO  (OverseerThreadFactory-10384-thread-1-processing-n:127.0.0.1:58330_solr) [n:127.0.0.1:58330_solr    ] o.a.s.c.OverseerCollectionMessageHandler Create collection testschemaapi
   [junit4]   2> 3392992 INFO  (OverseerThreadFactory-10384-thread-1-processing-n:127.0.0.1:58330_solr) [n:127.0.0.1:58330_solr    ] o.a.s.c.OverseerCollectionMessageHandler creating collections conf node /collections/testschemaapi 
   [junit4]   2> 3392992 INFO  (OverseerThreadFactory-10384-thread-1-processing-n:127.0.0.1:58330_solr) [n:127.0.0.1:58330_solr    ] o.a.s.c.c.SolrZkClient makePath: /collections/testschemaapi
   [junit4]   2> 3392993 INFO  (zkCallback-11150-thread-1-processing-n:127.0.0.1:58330_solr) [n:127.0.0.1:58330_solr    ] o.a.s.c.c.ZkStateReader A collections change: [WatchedEvent state:SyncConnected type:NodeChildrenChanged path:/collections], has occurred - updating...
   [junit4]   2> 3392993 INFO  (zkCallback-11149-thread-1-processing-n:127.0.0.1:58329_solr) [n:127.0.0.1:58329_solr    ] o.a.s.c.c.ZkStateReader A collections change: [WatchedEvent state:SyncConnected type:NodeChildrenChanged path:/collections], has occurred - updating...
   [junit4]   2> 3392993 INFO  (zkCallback-11156-thread-1) [    ] o.a.s.c.c.ZkStateReader A collections change: [WatchedEvent state:SyncConnected type:NodeChildrenChanged path:/collections], has occurred - updating...
   [junit4]   2> 3392996 INFO  (OverseerStateUpdate-96132877804175366-127.0.0.1:58330_solr-n_0000000000) [n:127.0.0.1:58330_solr    ] o.a.s.c.Overseer processMessage: queueSize: 1, message = {
   [junit4]   2>   "name":"testschemaapi",
   [junit4]   2>   "fromApi":"true",
   [junit4]   2>   "replicationFactor":"2",
   [junit4]   2>   "collection.configName":"conf1",
   [junit4]   2>   "numShards":"1",
   [junit4]   2>   "stateFormat":"2",
   [junit4]   2>   "operation":"create"} current state version: 0
   [junit4]   2> 3392996 INFO  (OverseerStateUpdate-96132877804175366-127.0.0.1:58330_solr-n_0000000000) [n:127.0.0.1:58330_solr    ] o.a.s.c.o.ClusterStateMutator building a new cName: testschemaapi
   [junit4]   2> 3392997 INFO  (OverseerStateUpdate-96132877804175366-127.0.0.1:58330_solr-n_0000000000) [n:127.0.0.1:58330_solr    ] o.a.s.c.o.ZkStateWriter going to create_collection /collections/testschemaapi/state.json
   [junit4]   2> 3393096 INFO  (OverseerThreadFactory-10384-thread-1-processing-n:127.0.0.1:58330_solr) [n:127.0.0.1:58330_solr    ] o.a.s.c.OverseerCollectionMessageHandler Creating SolrCores for new collection testschemaapi, shardNames [shard1] , replicationFactor : 2
   [junit4]   2> 3393096 INFO  (OverseerThreadFactory-10384-thread-1-processing-n:127.0.0.1:58330_solr) [n:127.0.0.1:58330_solr    ] o.a.s.c.OverseerCollectionMessageHandler Creating core testschemaapi_shard1_replica1 as part of shard shard1 of collection testschemaapi on 127.0.0.1:58330_solr
   [junit4]   2> 3393096 INFO  (OverseerThreadFactory-10384-thread-1-processing-n:127.0.0.1:58330_solr) [n:127.0.0.1:58330_solr    ] o.a.s.c.OverseerCollectionMessageHandler Creating core testschemaapi_shard1_replica2 as part of shard shard1 of collection testschemaapi on 127.0.0.1:58329_solr
   [junit4]   2> 3393103 INFO  (qtp1265287132-47608) [n:127.0.0.1:58330_solr    ] o.a.s.h.a.CoreAdminOperation core create command qt=/admin/cores&collection.configName=conf1&name=testschemaapi_shard1_replica1&action=CREATE&numShards=1&collection=testschemaapi&shard=shard1&wt=javabin&version=2
   [junit4]   2> 3393104 INFO  (qtp1265287132-47608) [n:127.0.0.1:58330_solr    ] o.a.s.c.CoreDescriptor Created CoreDescriptor: {name=testschemaapi_shard1_replica1, collection.configName=conf1, config=solrconfig.xml, transient=false, schema=schema.xml, loadOnStartup=true, configSetProperties=configsetprops.json, collection=testschemaapi, numShards=1, dataDir=data\, shard=shard1}
   [junit4]   2> 3393105 INFO  (qtp1265287132-47608) [n:127.0.0.1:58330_solr c:testschemaapi s:shard1  x:testschemaapi_shard1_replica1] o.a.s.c.ZkController publishing state=down
   [junit4]   2> 3393107 INFO  (qtp1265287132-47608) [n:127.0.0.1:58330_solr c:testschemaapi s:shard1  x:testschemaapi_shard1_replica1] o.a.s.c.ZkController Registering watch for collection testschemaapi
   [junit4]   2> 3393109 INFO  (qtp1265287132-47608) [n:127.0.0.1:58330_solr c:testschemaapi s:shard1  x:testschemaapi_shard1_replica1] o.a.s.c.c.ZkStateReader Add data for [testschemaapi] ver [0]
   [junit4]   2> 3393109 INFO  (qtp1265287132-47608) [n:127.0.0.1:58330_solr c:testschemaapi s:shard1  x:testschemaapi_shard1_replica1] o.a.s.c.ZkController look for our core node name
   [junit4]   2> 3393109 INFO  (OverseerStateUpdate-96132877804175366-127.0.0.1:58330_solr-n_0000000000) [n:127.0.0.1:58330_solr    ] o.a.s.c.Overseer processMessage: queueSize: 1, message = {
   [junit4]   2>   "core":"testschemaapi_shard1_replica1",
   [junit4]   2>   "roles":null,
   [junit4]   2>   "base_url":"https://127.0.0.1:58330/solr",
   [junit4]   2>   "node_name":"127.0.0.1:58330_solr",
   [junit4]   2>   "numShards":"1",
   [junit4]   2>   "state":"down",
   [junit4]   2>   "shard":"shard1",
   [junit4]   2>   "collection":"testschemaapi",
   [junit4]   2>   "operation":"state"} current state version: 0
   [junit4]   2> 3393110 INFO  (OverseerStateUpdate-96132877804175366-127.0.0.1:58330_solr-n_0000000000) [n:127.0.0.1:58330_solr    ] o.a.s.c.o.ReplicaMutator Update state numShards=1 message={
   [junit4]   2>   "core":"testschemaapi_shard1_replica1",
   [junit4]   2>   "roles":null,
   [junit4]   2>   "base_url":"https://127.0.0.1:58330/solr",
   [junit4]   2>   "node_name":"127.0.0.1:58330_solr",
   [junit4]   2>   "numShards":"1",
   [junit4]   2>   "state":"down",
   [junit4]   2>   "shard":"shard1",
   [junit4]   2>   "collection":"testschemaapi",
   [junit4]   2>   "operation":"state"}
   [junit4]   2> 3393123 INFO  (qtp1267850386-47601) [n:127.0.0.1:58329_solr    ] o.a.s.h.a.CoreAdminOperation core create command qt=/admin/cores&collection.configName=conf1&name=testschemaapi_shard1_replica2&action=CREATE&numShards=1&collection=testschemaapi&shard=shard1&wt=javabin&version=2
   [junit4]   2> 3393125 INFO  (qtp1267850386-47601) [n:127.0.0.1:58329_solr    ] o.a.s.c.CoreDescriptor Created CoreDescriptor: {name=testschemaapi_shard1_replica2, collection.configName=conf1, config=solrconfig.xml, transient=false, schema=schema.xml, loadOnStartup=true, configSetProperties=configsetprops.json, collection=testschemaapi, numShards=1, dataDir=data\, shard=shard1}
   [junit4]   2> 3393126 INFO  (qtp1267850386-47601) [n:127.0.0.1:58329_solr c:testschemaapi s:shard1  x:testschemaapi_shard1_replica2] o.a.s.c.ZkController publishing state=down
   [junit4]   2> 3393127 INFO  (qtp1267850386-47601) [n:127.0.0.1:58329_solr c:testschemaapi s:shard1  x:testschemaapi_shard1_replica2] o.a.s.c.ZkController Registering watch for collection testschemaapi
   [junit4]   2> 3393128 INFO  (qtp1267850386-47601) [n:127.0.0.1:58329_solr c:testschemaapi s:shard1  x:testschemaapi_shard1_replica2] o.a.s.c.c.ZkStateReader Add data for [testschemaapi] ver [0]
   [junit4]   2> 3393128 INFO  (qtp1267850386-47601) [n:127.0.0.1:58329_solr c:testschemaapi s:shard1  x:testschemaapi_shard1_replica2] o.a.s.c.ZkController look for our core node name
   [junit4]   2> 3393128 INFO  (OverseerStateUpdate-96132877804175366-127.0.0.1:58330_solr-n_0000000000) [n:127.0.0.1:58330_solr    ] o.a.s.c.Overseer processMessage: queueSize: 1, message = {
   [junit4]   2>   "core":"testschemaapi_shard1_replica2",
   [junit4]   2>   "roles":null,
   [junit4]   2>   "base_url":"https://127.0.0.1:58329/solr",
   [junit4]   2>   "node_name":"127.0.0.1:58329_solr",
   [junit4]   2>   "numShards":"1",
   [junit4]   2>   "state":"down",
   [junit4]   2>   "shard":"shard1",
   [junit4]   2>   "collection":"testschemaapi",
   [junit4]   2>   "operation":"state"} current state version: 0
   [junit4]   2> 3393128 INFO  (OverseerStateUpdate-96132877804175366-127.0.0.1:58330_solr-n_0000000000) [n:127.0.0.1:58330_solr    ] o.a.s.c.o.ReplicaMutator Update state numShards=1 message={
   [junit4]   2>   "core":"testschemaapi_shard1_replica2",
   [junit4]   2>   "roles":null,
   [junit4]   2>   "base_url":"https://127.0.0.1:58329/solr",
   [junit4]   2>   "node_name":"127.0.0.1:58329_solr",
   [junit4]   2>   "numShards":"1",
   [junit4]   2>   "state":"down",
   [junit4]   2>   "shard":"shard1",
   [junit4]   2>   "collection":"testschemaapi",
   [junit4]   2>   "operation":"state"}
   [junit4]   2> 3393233 INFO  (OverseerStateUpdate-96132877804175366-127.0.0.1:58330_solr-n_0000000000) [n:127.0.0.1:58330_solr    ] o.a.s.c.o.ZkStateWriter going to update_collection /collections/testschemaapi/state.json version: 0
   [junit4]   2> 3393234 INFO  (zkCallback-11150-thread-1-processing-n:127.0.0.1:58330_solr) [n:127.0.0.1:58330_solr    ] o.a.s.c.c.ZkStateReader A cluster state change: [WatchedEvent state:SyncConnected type:NodeDataChanged path:/collections/testschemaapi/state.json] for collection [testschemaapi] has occurred - updating... (live nodes size: [2])
   [junit4]   2> 3393234 INFO  (zkCallback-11149-thread-1-processing-n:127.0.0.1:58329_solr) [n:127.0.0.1:58329_solr    ] o.a.s.c.c.ZkStateReader A cluster state change: [WatchedEvent state:SyncConnected type:NodeDataChanged path:/collections/testschemaapi/state.json] for collection [testschemaapi] has occurred - updating... (live nodes size: [2])
   [junit4]   2> 3393234 INFO  (zkCallback-11150-thread-1-processing-n:127.0.0.1:58330_solr) [n:127.0.0.1:58330_solr    ] o.a.s.c.c.ZkStateReader Updating data for [testschemaapi] from [0] to [1]
   [junit4]   2> 3393234 INFO  (zkCallback-11149-thread-1-processing-n:127.0.0.1:58329_solr) [n:127.0.0.1:58329_solr    ] o.a.s.c.c.ZkStateReader Updating data for [testschemaapi] from [0] to [1]
   [junit4]   2> 3394110 INFO  (qtp1265287132-47608) [n:127.0.0.1:58330_solr c:testschemaapi s:shard1  x:testschemaapi_shard1_replica1] o.a.s.c.ZkController waiting to find shard id in clusterstate for testschemaapi_shard1_replica1
   [junit4]   2> 3394110 INFO  (qtp1265287132-47608) [n:127.0.0.1:58330_solr c:testschemaapi s:shard1  x:testschemaapi_shard1_replica1] o.a.s.c.ZkController Check for collection zkNode:testschemaapi
   [junit4]   2> 3394111 INFO  (qtp1265287132-47608) [n:127.0.0.1:58330_solr c:testschemaapi s:shard1  x:testschemaapi_shard1_replica1] o.a.s.c.ZkController Collection zkNode exists
   [junit4]   2> 3394111 INFO  (qtp1265287132-47608) [n:127.0.0.1:58330_solr c:testschemaapi s:shard1  x:testschemaapi_shard1_replica1] o.a.s.c.c.ZkStateReader Load collection config from: [/collections/testschemaapi]
   [junit4]   2> 3394112 INFO  (qtp1265287132-47608) [n:127.0.0.1:58330_solr c:testschemaapi s:shard1  x:testschemaapi_shard1_replica1] o.a.s.c.c.ZkStateReader path=[/collections/testschemaapi] [configName]=[conf1] specified config exists in ZooKeeper
   [junit4]   2> 3394112 INFO  (qtp1265287132-47608) [n:127.0.0.1:58330_solr c:testschemaapi s:shard1  x:testschemaapi_shard1_replica1] o.a.s.c.SolrResourceLoader new SolrResourceLoader for directory: 'C:\Users\jenkins\workspace\Lucene-Solr-6.x-Windows\solr\build\solr-core\test\J0\temp\solr.schema.TestManagedSchemaAPI_24425B944C2AAEFC-001\tempDir-001\node2\testschemaapi_shard1_replica1'
   [junit4]   2> 3394112 INFO  (qtp1265287132-47608) [n:127.0.0.1:58330_solr c:testschemaapi s:shard1  x:testschemaapi_shard1_replica1] o.a.s.c.SolrResourceLoader JNDI not configured for solr (NoInitialContextEx)
   [junit4]   2> 3394112 INFO  (qtp1265287132-47608) [n:127.0.0.1:58330_solr c:testschemaapi s:shard1  x:testschemaapi_shard1_replica1] o.a.s.c.SolrResourceLoader solr home defaulted to 'solr/' (could not find system property or JNDI)
   [junit4]   2> 3394114 INFO  (qtp1265287132-47608) [n:127.0.0.1:58330_solr c:testschemaapi s:shard1  x:testschemaapi_shard1_replica1] o.a.s.c.Config loaded config solrconfig.xml with version 0 
   [junit4]   2> 3394120 INFO  (qtp1265287132-47608) [n:127.0.0.1:58330_solr c:testschemaapi s:shard1  x:testschemaapi_shard1_replica1] o.a.s.c.SolrConfig current version of requestparams : -1
   [junit4]   2> 3394123 INFO  (qtp1265287132-47608) [n:127.0.0.1:58330_solr c:testschemaapi s:shard1  x:testschemaapi_shard1_replica1] o.a.s.c.SolrConfig Using Lucene MatchVersion: 6.2.0
   [junit4]   2> 3394127 INFO  (qtp1265287132-47608) [n:127.0.0.1:58330_solr c:testschemaapi s:shard1  x:testschemaapi_shard1_replica1] o.a.s.c.SolrConfig Loaded SolrConfig: solrconfig.xml
   [junit4]   2> 3394128 INFO  (qtp1267850386-47601) [n:127.0.0.1:58329_solr c:testschemaapi s:shard1  x:testschemaapi_shard1_replica2] o.a.s.c.ZkController waiting to find shard id in clusterstate for testschemaapi_shard1_replica2
   [junit4]   2> 3394128 INFO  (qtp1267850386-47601) [n:127.0.0.1:58329_solr c:testschemaapi s:shard1  x:testschemaapi_shard1_replica2] o.a.s.c.ZkController Check for collection zkNode:testschemaapi
   [junit4]   2> 3394129 INFO  (qtp1267850386-47601) [n:127.0.0.1:58329_solr c:testschemaapi s:shard1  x:testschemaapi_shard1_replica2] o.a.s.c.ZkController Collection zkNode exists
   [junit4]   2> 3394129 INFO  (qtp1267850386-47601) [n:127.0.0.1:58329_solr c:testschemaapi s:shard1  x:testschemaapi_shard1_replica2] o.a.s.c.c.ZkStateReader Load collection config from: [/collections/testschemaapi]
   [junit4]   2> 3394129 INFO  (qtp1267850386-47601) [n:127.0.0.1:58329_solr c:testschemaapi s:shard1  x:testschemaapi_shard1_replica2] o.a.s.c.c.ZkStateReader path=[/collections/testschemaapi] [configName]=[conf1] specified config exists in ZooKeeper
   [junit4]   2> 3394129 INFO  (qtp1267850386-47601) [n:127.0.0.1:58329_solr c:testschemaapi s:shard1  x:testschemaapi_shard1_replica2] o.a.s.c.SolrResourceLoader new SolrResourceLoader for directory: 'C:\Users\jenkins\workspace\Lucene-Solr-6.x-Windows\solr\build\solr-core\test\J0\temp\solr.schema.TestManagedSchemaAPI_24425B944C2AAEFC-001\tempDir-001\node1\testschemaapi_shard1_replica2'
   [junit4]   2> 3394130 INFO  (qtp1267850386-47601) [n:127.0.0.1:58329_solr c:testschemaapi s:shard1  x:testschemaapi_shard1_replica2] o.a.s.c.SolrResourceLoader JNDI not configured for solr (NoInitialContextEx)
   [junit4]   2> 3394130 INFO  (qtp1267850386-47601) [n:127.0.0.1:58329_solr c:testschemaapi s:shard1  x:testschemaapi_shard1_replica2] o.a.s.c.SolrResourceLoader solr home defaulted to 'solr/' (could not find system property or JNDI)
   [junit4]   2> 3394132 INFO  (qtp1267850386-47601) [n:127.0.0.1:58329_solr c:testschemaapi s:shard1  x:testschemaapi_shard1_replica2] o.a.s.c.Config loaded config solrconfig.xml with version 0 
   [junit4]   2> 3394132 INFO  (qtp1265287132-47608) [n:127.0.0.1:58330_solr c:testschemaapi s:shard1  x:testschemaapi_shard1_replica1] o.a.s.s.IndexSchema [testschemaapi_shard1_replica1] Schema name=minimal
   [junit4]   2> 3394137 INFO  (qtp1267850386-47601) [n:127.0.0.1:58329_solr c:testschemaapi s:shard1  x:testschemaapi_shard1_replica2] o.a.s.c.SolrConfig current version of requestparams : -1
   [junit4]   2> 3394159 INFO  (qtp1267850386-47601) [n:127.0.0.1:58329_solr c:testschemaapi s:shard1  x:testschemaapi_shard1_replica2] o.a.s.c.SolrConfig Using Lucene MatchVersion: 6.2.0
   [junit4]   2> 3394159 INFO  (qtp1265287132-47608) [n:127.0.0.1:58330_solr c:testschemaapi s:shard1  x:testschemaapi_shard1_replica1] o.a.s.s.IndexSchema unique key field: id
   [junit4]   2> 3394163 INFO  (qtp1265287132-47608) [n:127.0.0.1:58330_solr c:testschemaapi s:shard1  x:testschemaapi_shard1_replica1] o.a.s.c.ConfigSetProperties Did not find ConfigSet properties, assuming default properties: Can't find resource 'configsetprops.json' in classpath or '/configs/conf1', cwd=C:\Users\jenkins\workspace\Lucene-Solr-6.x-Windows\solr\build\solr-core\test\J0
   [junit4]   2> 3394163 INFO  (qtp1265287132-47608) [n:127.0.0.1:58330_solr c:testschemaapi s:shard1  x:testschemaapi_shard1_replica1] o.a.s.c.CoreContainer Creating SolrCore 'testschemaapi_shard1_replica1' using configuration from collection testschemaapi
   [junit4]   2> 3394163 INFO  (qtp1265287132-47608) [n:127.0.0.1:58330_solr c:testschemaapi s:shard1 r:core_node1 x:testschemaapi_shard1_replica1] o.a.s.c.SolrCore org.apache.solr.core.MockDirectoryFactory
   [junit4]   2> 3394164 INFO  (qtp1265287132-47608) [n:127.0.0.1:58330_solr c:testschemaapi s:shard1 r:core_node1 x:testschemaapi_shard1_replica1] o.a.s.c.SolrCore [[testschemaapi_shard1_replica1] ] Opening new SolrCore at [C:\Users\jenkins\workspace\Lucene-Solr-6.x-Windows\solr\build\solr-core\test\J0\temp\solr.schema.TestManagedSchemaAPI_24425B944C2AAEFC-001\tempDir-001\node2\testschemaapi_shard1_replica1], dataDir=[C:\Users\jenkins\workspace\Lucene-Solr-6.x-Windows\solr\build\solr-core\test\J0\temp\solr.schema.TestManagedSchemaAPI_24425B944C2AAEFC-001\tempDir-001\node2\.\testschemaapi_shard1_replica1\data\]
   [junit4]   2> 3394164 INFO  (qtp1265287132-47608) [n:127.0.0.1:58330_solr c:testschemaapi s:shard1 r:core_node1 x:testschemaapi_shard1_replica1] o.a.s.c.SolrCore JMX monitoring not detected for core: testschemaapi_shard1_replica1
   [junit4]   2> 3394164 INFO  (qtp1267850386-47601) [n:127.0.0.1:58329_solr c:testschemaapi s:shard1  x:testschemaapi_shard1_replica2] o.a.s.c.SolrConfig Loaded SolrConfig: solrconfig.xml
   [junit4]   2> 3394164 INFO  (qtp1265287132-47608) [n:127.0.0.1:58330_solr c:testschemaapi s:shard1 r:core_node1 x:testschemaapi_shard1_replica1] o.a.s.c.CachingDirectoryFactory return new directory for C:\Users\jenkins\workspace\Lucene-Solr-6.x-Windows\solr\build\solr-core\test\J0\temp\solr.schema.TestManagedSchemaAPI_24425B944C2AAEFC-001\tempDir-001\node2\.\testschemaapi_shard1_replica1\data\
   [junit4]   2> 3394165 INFO  (qtp1265287132-47608) [n:127.0.0.1:58330_solr c:testschemaapi s:shard1 r:core_node1 x:testschemaapi_shard1_replica1] o.a.s.c.SolrCore New index directory detected: old=null new=C:\Users\jenkins\workspace\Lucene-Solr-6.x-Windows\solr\build\solr-core\test\J0\temp\solr.schema.TestManagedSchemaAPI_24425B944C2AAEFC-001\tempDir-001\node2\.\testschemaapi_shard1_replica1\data\index/
   [junit4]   2> 3394165 WARN  (qtp1265287132-47608) [n:127.0.0.1:58330_solr c:testschemaapi s:shard1 r:core_node1 x:testschemaapi_shard1_replica1] o.a.s.c.SolrCore [testschemaapi_shard1_replica1] Solr index directory 'C:\Users\jenkins\workspace\Lucene-Solr-6.x-Windows\solr\build\solr-core\test\J0\temp\solr.schema.TestManagedSchemaAPI_24425B944C2AAEFC-001\tempDir-001\node2\.\testschemaapi_shard1_replica1\data\index' doesn't exist. Creating new index...
   [junit4]   2> 3394166 INFO  (qtp1265287132-47608) [n:127.0.0.1:58330_solr c:testschemaapi s:shard1 r:core_node1 x:testschemaapi_shard1_replica1] o.a.s.c.CachingDirectoryFactory return new directory for C:\Users\jenkins\workspace\Lucene-Solr-6.x-Windows\solr\build\solr-core\test\J0\temp\solr.schema.TestManagedSchemaAPI_24425B944C2AAEFC-001\tempDir-001\node2\.\testschemaapi_shard1_replica1\data\index
   [junit4]   2> 3394167 INFO  (qtp1265287132-47608) [n:127.0.0.1:58330_solr c:testschemaapi s:shard1 r:core_node1 x:testschemaapi_shard1_replica1] o.a.s.c.SolrDeletionPolicy SolrDeletionPolicy.onCommit: commits: num=1
   [junit4]   2> 	commit{dir=MockDirectoryWrapper(RAMDirectory@4a8debe0 lockFactory=org.apache.lucene.store.SingleInstanceLockFactory@3802eca7),segFN=segments_1,generation=1}
   [junit4]   2> 3394167 INFO  (qtp1265287132-47608) [n:127.0.0.1:58330_solr c:testschemaapi s:shard1 r:core_node1 x:testschemaapi_shard1_replica1] o.a.s.c.SolrDeletionPolicy newest commit generation = 1
   [junit4]   2> 3394168 INFO  (qtp1267850386-47601) [n:127.0.0.1:58329_solr c:testschemaapi s:shard1  x:testschemaapi_shard1_replica2] o.a.s.s.IndexSchema [testschemaapi_shard1_replica2] Schema name=minimal
   [junit4]   2> 3394169 INFO  (qtp1265287132-47608) [n:127.0.0.1:58330_solr c:testschemaapi s:shard1 r:core_node1 x:testschemaapi_shard1_replica1] o.a.s.c.SolrCore no updateRequestProcessorChain defined as default, creating implicit default
   [junit4]   2> 3394171 INFO  (qtp1267850386-47601) [n:127.0.0.1:58329_solr c:testschemaapi s:shard1  x:testschemaapi_shard1_replica2] o.a.s.s.IndexSchema unique key field: id
   [junit4]   2> 3394172 INFO  (qtp1267850386-47601) [n:127.0.0.1:58329_solr c:testschemaapi s:shard1  x:testschemaapi_shard1_replica2] o.a.s.c.ConfigSetProperties Did not find ConfigSet properties, assuming default properties: Can't find resource 'configsetprops.json' in classpath or '/configs/conf1', cwd=C:\Users\jenkins\workspace\Lucene-Solr-6.x-Windows\solr\build\solr-core\test\J0
   [junit4]   2> 3394172 INFO  (qtp1267850386-47601) [n:127.0.0.1:58329_solr c:testschemaapi s:shard1  x:testschemaapi_shard1_replica2] o.a.s.c.CoreContainer Creating SolrCore 'testschemaapi_shard1_replica2' using configuration from collection testschemaapi
   [junit4]   2> 3394172 INFO  (qtp1267850386-47601) [n:127.0.0.1:58329_solr c:testschemaapi s:shard1 r:core_node2 x:testschemaapi_shard1_replica2] o.a.s.c.SolrCore org.apache.solr.core.MockDirectoryFactory
   [junit4]   2> 3394172 INFO  (qtp1267850386-47601) [n:127.0.0.1:58329_solr c:testschemaapi s:shard1 r:core_node2 x:testschemaapi_shard1_replica2] o.a.s.c.SolrCore [[testschemaapi_shard1_replica2] ] Opening new SolrCore at [C:\Users\jenkins\workspace\Lucene-Solr-6.x-Windows\solr\build\solr-core\test\J0\temp\solr.schema.TestManagedSchemaAPI_24425B944C2AAEFC-001\tempDir-001\node1\testschemaapi_shard1_replica2], dataDir=[C:\Users\jenkins\workspace\Lucene-Solr-6.x-Windows\solr\build\solr-core\test\J0\temp\solr.schema.TestManagedSchemaAPI_24425B944C2AAEFC-001\tempDir-001\node1\.\testschemaapi_shard1_replica2\data\]
   [junit4]   2> 3394172 INFO  (qtp1267850386-47601) [n:127.0.0.1:58329_solr c:testschemaapi s:shard1 r:core_node2 x:testschemaapi_shard1_replica2] o.a.s.c.SolrCore JMX monitoring not detected for core: testschemaapi_shard1_replica2
   [junit4]   2> 3394173 INFO  (qtp1267850386-47601) [n:127.0.0.1:58329_solr c:testschemaapi s:shard1 r:core_node2 x:testschemaapi_shard1_replica2] o.a.s.c.CachingDirectoryFactory return new directory for C:\Users\jenkins\workspace\Lucene-Solr-6.x-Windows\solr\build\solr-core\test\J0\temp\solr.schema.TestManagedSchemaAPI_24425B944C2AAEFC-001\tempDir-001\node1\.\testschemaapi_shard1_replica2\data\
   [junit4]   2> 3394173 INFO  (qtp1267850386-47601) [n:127.0.0.1:58329_solr c:testschemaapi s:shard1 r:core_node2 x:testschemaapi_shard1_replica2] o.a.s.c.SolrCore New index directory detected: old=null new=C:\Users\jenkins\workspace\Lucene-Solr-6.x-Windows\solr\build\solr-core\test\J0\temp\solr.schema.TestManagedSchemaAPI_24425B944C2AAEFC-001\tempDir-001\node1\.\testschemaapi_shard1_replica2\data\index/
   [junit4]   2> 3394173 WARN  (qtp1267850386-47601) [n:127.0.0.1:58329_solr c:testschemaapi s:shard1 r:core_node2 x:testschemaapi_shard1_replica2] o.a.s.c.SolrCore [testschemaapi_shard1_replica2] Solr index directory 'C:\Users\jenkins\workspace\Lucene-Solr-6.x-Windows\solr\build\solr-core\test\J0\temp\solr.schema.TestManagedSchemaAPI_24425B944C2AAEFC-001\tempDir-001\node1\.\testschemaapi_shard1_replica2\data\index' doesn't exist. Creating new index...
   [junit4]   2> 3394173 INFO  (qtp1267850386-47601) [n:127.0.0.1:58329_solr c:testschemaapi s:shard1 r:core_node2 x:testschemaapi_shard1_replica2] o.a.s.c.CachingDirectoryFactory return new directory for C:\Users\jenkins\workspace\Lucene-Solr-6.x-Windows\solr\build\solr-core\test\J0\temp\solr.schema.TestManagedSchemaAPI_24425B944C2AAEFC-001\tempDir-001\node1\.\testschemaapi_shard1_replica2\data\index
   [junit4]   2> 3394175 INFO  (OldIndexDirectoryCleanupThreadForCore-testschemaapi_shard1_replica1) [n:127.0.0.1:58330_solr c:testschemaapi s:shard1 r:core_node1 x:testschemaapi_shard1_replica1] o.a.s.c.SolrCore Looking for old index directories to cleanup for core testschemaapi_shard1_replica1 in C:\Users\jenkins\workspace\Lucene-Solr-6.x-Windows\solr\build\solr-core\test\J0\temp\solr.schema.TestManagedSchemaAPI_24425B944C2AAEFC-001\tempDir-001\node2\.\testschemaapi_shard1_replica1\data\
   [junit4]   2> 3394177 WARN  (OldIndexDirectoryCleanupThreadForCore-testschemaapi_shard1_replica1) [n:127.0.0.1:58330_solr c:testschemaapi s:shard1 r:core_node1 x:testschemaapi_shard1_replica1] o.a.s.c.DirectoryFactory C:\Users\jenkins\workspace\Lucene-Solr-6.x-Windows\solr\build\solr-core\test\J0\temp\solr.schema.TestManagedSchemaAPI_24425B944C2AAEFC-001\tempDir-001\node2\.\testschemaapi_shard1_replica1\data\ does not point to a valid data directory; skipping clean-up of old index directories.
   [junit4]   2> 3394177 INFO  (qtp1267850386-47601) [n:127.0.0.1:58329_solr c:testschemaapi s:shard1 r:core_node2 x:testschemaapi_shard1_replica2] o.a.s.c.SolrDeletionPolicy SolrDeletionPolicy.onCommit: commits: num=1
   [junit4]   2> 	commit{dir=MockDirectoryWrapper(RAMDirectory@20e85c1d lockFactory=org.apache.lucene.store.SingleInstanceLockFactory@4677f0c1),segFN=segments_1,generation=1}
   [junit4]   2> 3394178 INFO  (qtp1267850386-47601) [n:127.0.0.1:58329_solr c:testschemaapi s:shard1 r:core_node2 x:testschemaapi_shard1_replica2] o.a.s.c.SolrDeletionPolicy newest commit generation = 1
   [junit4]   2> 3394178 INFO  (qtp1265287132-47608) [n:127.0.0.1:58330_solr c:testschemaapi s:shard1 r:core_node1 x:testschemaapi_shard1_replica1] o.a.s.h.l.XMLLoader xsltCacheLifetimeSeconds=60
   [junit4]   2> 3394179 INFO  (qtp1265287132-47608) [n:127.0.0.1:58330_solr c:testschemaapi s:shard1 r:core_node1 x:testschemaapi_shard1_replica1] o.a.s.h.l.XMLLoader xsltCacheLifetimeSeconds=60
   [junit4]   2> 3394179 INFO  (OldIndexDirectoryCleanupThreadForCore-testschemaapi_shard1_replica2) [n:127.0.0.1:58329_solr c:testschemaapi s:shard1 r:core_node2 x:testschemaapi_shard1_replica2] o.a.s.c.SolrCore Looking for old index directories to cleanup for core testschemaapi_shard1_replica2 in C:\Users\jenkins\workspace\Lucene-Solr-6.x-Windows\solr\build\solr-core\test\J0\temp\solr.schema.TestManagedSchemaAPI_24425B944C2AAEFC-001\tempDir-001\node1\.\testschemaapi_shard1_replica2\data\
   [junit4]   2> 3394179 INFO  (qtp1267850386-47601) [n:127.0.0.1:58329_solr c:testschemaapi s:shard1 r:core_node2 x:testschemaapi_shard1_replica2] o.a.s.c.SolrCore no updateRequestProcessorChain defined as default, creating implicit default
   [junit4]   2> 3394181 WARN  (OldIndexDirectoryCleanupThreadForCore-testschemaapi_shard1_replica2) [n:127.0.0.1:58329_solr c:testschemaapi s:shard1 r:core_node2 x:testschemaapi_shard1_replica2] o.a.s.c.DirectoryFactory C:\Users\jenkins\workspace\Lucene-Solr-6.x-Windows\solr\build\solr-core\test\J0\temp\solr.schema.TestManagedSchemaAPI_24425B944C2AAEFC-001\tempDir-001\node1\.\testschemaapi_shard1_replica2\data\ does not point to a valid data directory; skipping clean-up of old index directories.
   [junit4]   2> 3394181 INFO  (qtp1265287132-47608) [n:127.0.0.1:58330_solr c:testschemaapi s:shard1 r:core_node1 x:testschemaapi_shard1_replica1] o.a.s.h.l.XMLLoader xsltCacheLifetimeSeconds=60
   [junit4]   2> 3394182 INFO  (qtp1265287132-47608) [n:127.0.0.1:58330_solr c:testschemaapi s:shard1 r:core_node1 x:testschemaapi_shard1_replica1] o.a.s.h.l.XMLLoader xsltCacheLifetimeSeconds=60
   [junit4]   2> 3394184 INFO  (qtp1265287132-47608) [n:127.0.0.1:58330_solr c:testschemaapi s:shard1 r:core_node1 x:testschemaapi_shard1_replica1] o.a.s.c.RequestHandlers Registered paths: /admin/mbeans,/update/csv,/sql,/update/json/docs,/admin/luke,/graph,/export,/select,/admin/segments,/get,/admin/system,/replication,/admin/properties,/config,/stream,/schema,/admin/plugins,/admin/logging,/update/json,/admin/ping,/admin/threads,/update,/admin/file
   [junit4]   2> 3394184 INFO  (qtp1265287132-47608) [n:127.0.0.1:58330_solr c:testschemaapi s:shard1 r:core_node1 x:testschemaapi_shard1_replica1] o.a.s.c.SolrCore Using default statsCache cache: org.apache.solr.search.stats.LocalStatsCache
   [junit4]   2> 3394185 INFO  (qtp1265287132-47608) [n:127.0.0.1:58330_solr c:testschemaapi s:shard1 r:core_node1 x:testschemaapi_shard1_replica1] o.a.s.u.UpdateHandler Using UpdateLog implementation: org.apache.solr.update.UpdateLog
   [junit4]   2> 3394186 INFO  (qtp1265287132-47608) [n:127.0.0.1:58330_solr c:testschemaapi s:shard1 r:core_node1 x:testschemaapi_shard1_replica1] o.a.s.u.UpdateLog Initializing UpdateLog: dataDir=null defaultSyncLevel=FLUSH numRecordsToKeep=100 maxNumLogsToKeep=10 numVersionBuckets=65536
   [junit4]   2> 3394186 INFO  (qtp1267850386-47601) [n:127.0.0.1:58329_solr c:testschemaapi s:shard1 r:core_node2 x:testschemaapi_shard1_replica2] o.a.s.h.l.XMLLoader xsltCacheLifetimeSeconds=60
   [junit4]   2> 3394188 INFO  (qtp1265287132-47608) [n:127.0.0.1:58330_solr c:testschemaapi s:shard1 r:core_node1 x:testschemaapi_shard1_replica1] o.a.s.u.CommitTracker Hard AutoCommit: disabled
   [junit4]   2> 3394188 INFO  (qtp1265287132-47608) [n:127.0.0.1:58330_solr c:testschemaapi s:shard1 r:core_node1 x:testschemaapi_shard1_replica1] o.a.s.u.CommitTracker Soft AutoCommit: disabled
   [junit4]   2> 3394188 INFO  (qtp1267850386-47601) [n:127.0.0.1:58329_solr c:testschemaapi s:shard1 r:core_node2 x:testschemaapi_shard1_replica2] o.a.s.h.l.XMLLoader xsltCacheLifetimeSeconds=60
   [junit4]   2> 3394188 INFO  (qtp1265287132-47608) [n:127.0.0.1:58330_solr c:testschemaapi s:shard1 r:core_node1 x:testschemaapi_shard1_replica1] o.a.s.c.SolrDeletionPolicy SolrDeletionPolicy.onInit: commits: num=1
   [junit4]   2> 	commit{dir=MockDirectoryWrapper(RAMDirectory@4a8debe0 lockFactory=org.apache.lucene.store.SingleInstanceLockFactory@3802eca7),segFN=segments_1,generation=1}
   [junit4]   2> 3394188 INFO  (qtp1265287132-47608) [n:127.0.0.1:58330_solr c:testschemaapi s:shard1 r:core_node1 x:testschemaapi_shard1_replica1] o.a.s.c.SolrDeletionPolicy newest commit generation = 1
   [junit4]   2> 3394188 INFO  (qtp1265287132-47608) [n:127.0.0.1:58330_solr c:testschemaapi s:shard1 r:core_node1 x:testschemaapi_shard1_replica1] o.a.s.s.SolrIndexSearcher Opening [Searcher@44587c67[testschemaapi_shard1_replica1] main]
   [junit4]   2> 3394189 INFO  (qtp1265287132-47608) [n:127.0.0.1:58330_solr c:testschemaapi s:shard1 r:core_node1 x:testschemaapi_shard1_replica1] o.a.s.c.c.ZkStateReader Load collection config from: [/collections/testschemaapi]
   [junit4]   2> 3394190 INFO  (qtp1265287132-47608) [n:127.0.0.1:58330_solr c:testschemaapi s:shard1 r:core_node1 x:testschemaapi_shard1_replica1] o.a.s.c.c.ZkStateReader path=[/collections/testschemaapi] [configName]=[conf1] specified config exists in ZooKeeper
   [junit4]   2> 3394190 INFO  (qtp1265287132-47608) [n:127.0.0.1:58330_solr c:testschemaapi s:shard1 r:core_node1 x:testschemaapi_shard1_replica1] o.a.s.r.ManagedResourceStorage Setting up ZooKeeper-based storage for the RestManager with znodeBase: /configs/conf1
   [junit4]   2> 3394191 INFO  (qtp1265287132-47608) [n:127.0.0.1:58330_solr c:testschemaapi s:shard1 r:core_node1 x:testschemaapi_shard1_replica1] o.a.s.r.ManagedResourceStorage Configured ZooKeeperStorageIO with znodeBase: /configs/conf1
   [junit4]   2> 3394191 INFO  (qtp1265287132-47608) [n:127.0.0.1:58330_solr c:testschemaapi s:shard1 r:core_node1 x:testschemaapi_shard1_replica1] o.a.s.r.RestManager Initializing RestManager with initArgs: {}
   [junit4]   2> 3394191 INFO  (qtp1265287132-47608) [n:127.0.0.1:58330_solr c:testschemaapi s:shard1 r:core_node1 x:testschemaapi_shard1_replica1] o.a.s.r.ManagedResourceStorage Reading _rest_managed.json using ZooKeeperStorageIO:path=/configs/conf1
   [junit4]   2> 3394191 INFO  (qtp1265287132-47608) [n:127.0.0.1:58330_solr c:testschemaapi s:shard1 r:core_node1 x:testschemaapi_shard1_replica1] o.a.s.r.ManagedResourceStorage No data found for znode /configs/conf1/_rest_managed.json
   [junit4]   2> 3394192 INFO  (qtp1265287132-47608) [n:127.0.0.1:58330_solr c:testschemaapi s:shard1 r:core_node1 x:testschemaapi_shard1_replica1] o.a.s.r.ManagedResourceStorage Loaded null at path _rest_managed.json using ZooKeeperStorageIO:path=/configs/conf1
   [junit4]   2> 3394192 INFO  (qtp1265287132-47608) [n:127.0.0.1:58330_solr c:testschemaapi s:shard1 r:core_node1 x:testschemaapi_shard1_replica1] o.a.s.r.RestManager Initializing 0 registered ManagedResources
   [junit4]   2> 3394192 INFO  (qtp1265287132-47608) [n:127.0.0.1:58330_solr c:testschemaapi s:shard1 r:core_node1 x:testschemaapi_shard1_replica1] o.a.s.s.ZkIndexSchemaReader Creating ZooKeeper watch for the managed schema at /configs/conf1/managed-schema
   [junit4]   2> 3394192 INFO  (qtp1267850386-47601) [n:127.0.0.1:58329_solr c:testschemaapi s:shard1 r:core_node2 x:testschemaapi_shard1_replica2] o.a.s.h.l.XMLLoader xsltCacheLifetimeSeconds=60
   [junit4]   2> 3394192 INFO  (qtp1265287132-47608) [n:127.0.0.1:58330_solr c:testschemaapi s:shard1 r:core_node1 x:testschemaapi_shard1_replica1] o.a.s.c.ZkController Added new OnReconnect listener ZkIndexSchemaReader: /configs/conf1/managed-schema, uniqueCoreId: testschemaapi_shard1_replica1:13956384443633
   [junit4]   2> 3394192 INFO  (qtp1265287132-47608) [n:127.0.0.1:58330_solr c:testschemaapi s:shard1 r:core_node1 x:testschemaapi_shard1_replica1] o.a.s.h.ReplicationHandler Commits will be reserved for  10000
   [junit4]   2> 3394192 INFO  (searcherExecutor-10387-thread-1-processing-n:127.0.0.1:58330_solr x:testschemaapi_shard1_replica1 s:shard1 c:testschemaapi r:core_node1) [n:127.0.0.1:58330_solr c:testschemaapi s:shard1 r:core_node1 x:testschemaapi_shard1_replica1] o.a.s.c.SolrCore [testschemaapi_shard1_replica1] Registered new searcher Searcher@44587c67[testschemaapi_shard1_replica1] main{ExitableDirectoryReader(UninvertingDirectoryReader())}
   [junit4]   2> 3394193 INFO  (qtp1265287132-47608) [n:127.0.0.1:58330_solr c:testschemaapi s:shard1 r:core_node1 x:testschemaapi_shard1_replica1] o.a.s.u.UpdateLog Looking up max value of version field to seed version buckets
   [junit4]   2> 3394193 INFO  (qtp1265287132-47608) [n:127.0.0.1:58330_solr c:testschemaapi s:shard1 r:core_node1 x:testschemaapi_shard1_replica1] o.a.s.u.VersionInfo Refreshing highest value of _version_ for 65536 version buckets from index
   [junit4]   2> 3394193 INFO  (qtp1265287132-47608) [n:127.0.0.1:58330_solr c:testschemaapi s:shard1 r:core_node1 x:testschemaapi_shard1_replica1] o.a.s.u.VersionInfo No terms found for _version_, cannot seed version bucket highest value from index
   [junit4]   2> 3394193 INFO  (qtp1265287132-47608) [n:127.0.0.1:58330_solr c:testschemaapi s:shard1 r:core_node1 x:testschemaapi_shard1_replica1] o.a.s.u.UpdateLog Could not find max version in index or recent updates, using new clock 1538126047445254144
   [junit4]   2> 3394194 INFO  (qtp1265287132-47608) [n:127.0.0.1:58330_solr c:testschemaapi s:shard1 r:core_node1 x:testschemaapi_shard1_replica1] o.a.s.u.UpdateLog Took 1.0ms to seed version buckets with highest version 1538126047445254144
   [junit4]   2> 3394194 INFO  (qtp1267850386-47601) [n:127.0.0.1:58329_solr c:testschemaapi s:shard1 r:core_node2 x:testschemaapi_shard1_replica2] o.a.s.h.l.XMLLoader xsltCacheLifetimeSeconds=60
   [junit4]   2> 3394195 INFO  (qtp1265287132-47608) [n:127.0.0.1:58330_solr c:testschemaapi s:shard1 r:core_node1 x:testschemaapi_shard1_replica1] o.a.s.c.ZkController watch zkdir /configs/conf1
   [junit4]   2> 3394195 INFO  (qtp1265287132-47608) [n:127.0.0.1:58330_solr c:testschemaapi s:shard1 r:core_node1 x:testschemaapi_shard1_replica1] o.a.s.c.CoreContainer registering core: testschemaapi_shard1_replica1
   [junit4]   2> 3394195 INFO  (qtp1265287132-47608) [n:127.0.0.1:58330_solr c:testschemaapi s:shard1 r:core_node1 x:testschemaapi_shard1_replica1] o.a.s.c.ZkController Register replica - core:testschemaapi_shard1_replica1 address:https://127.0.0.1:58330/solr collection:testschemaapi shard:shard1
   [junit4]   2> 3394197 INFO  (qtp1267850386-47601) [n:127.0.0.1:58329_solr c:testschemaapi s:shard1 r:core_node2 x:testschemaapi_shard1_replica2] o.a.s.c.RequestHandlers Registered paths: /admin/mbeans,/update/csv,/sql,/update/json/docs,/admin/luke,/graph,/export,/select,/admin/segments,/get,/admin/system,/replication,/admin/properties,/config,/stream,/schema,/admin/plugins,/admin/logging,/update/json,/admin/ping,/admin/threads,/update,/admin/file
   [junit4]   2> 3394197 INFO  (qtp1267850386-47601) [n:127.0.0.1:58329_solr c:testschemaapi s:shard1 r:core_node2 x:testschemaapi_shard1_replica2] o.a.s.c.SolrCore Using default statsCache cache: org.apache.solr.search.stats.LocalStatsCache
   [junit4]   2> 3394198 INFO  (qtp1265287132-47608) [n:127.0.0.1:58330_solr c:testschemaapi s:shard1 r:core_node1 x:testschemaapi_shard1_replica1] o.a.s.c.c.SolrZkClient makePath: /collections/testschemaapi/leader_elect/shard1/election
   [junit4]   2> 3394198 INFO  (qtp1267850386-47601) [n:127.0.0.1:58329_solr c:testschemaapi s:shard1 r:core_node2 x:testschemaapi_shard1_replica2] o.a.s.u.UpdateHandler Using UpdateLog implementation: org.apache.solr.update.UpdateLog
   [junit4]   2> 3394198 INFO  (qtp1267850386-47601) [n:127.0.0.1:58329_solr c:testschemaapi s:shard1 r:core_node2 x:testschemaapi_shard1_replica2] o.a.s.u.UpdateLog Initializing UpdateLog: dataDir=null defaultSyncLevel=FLUSH numRecordsToKeep=100 maxNumLogsToKeep=10 numVersionBuckets=65536
   [junit4]   2> 3394200 INFO  (qtp1267850386-47601) [n:127.0.0.1:58329_solr c:testschemaapi s:shard1 r:core_node2 x:testschemaapi_shard1_replica2] o.a.s.u.CommitTracker Hard AutoCommit: disabled
   [junit4]   2> 3394200 INFO  (qtp1267850386-47601) [n:127.0.0.1:58329_solr c:testschemaapi s:shard1 r:core_node2 x:testschemaapi_shard1_replica2] o.a.s.u.CommitTracker Soft AutoCommit: disabled
   [junit4]   2> 3394202 INFO  (qtp1267850386-47601) [n:127.0.0.1:58329_solr c:testschemaapi s:shard1 r:core_node2 x:testschemaapi_shard1_replica2] o.a.s.c.SolrDeletionPolicy SolrDeletionPolicy.onInit: commits: num=1
   [junit4]   2> 	commit{dir=MockDirectoryWrapper(RAMDirectory@20e85c1d lockFactory=org.apache.lucene.store.SingleInstanceLockFactory@4677f0c1),segFN=segments_1,generation=1}
   [junit4]   2> 3394202 INFO  (qtp1267850386-47601) [n:127.0.0.1:58329_solr c:testschemaapi s:shard1 r:core_node2 x:testschemaapi_shard1_replica2] o.a.s.c.SolrDeletionPolicy newest commit generation = 1
   [junit4]   2> 3394202 INFO  (qtp1267850386-47601) [n:127.0.0.1:58329_solr c:testschemaapi s:shard1 r:core_node2 x:testschemaapi_shard1_replica2] o.a.s.s.SolrIndexSearcher Opening [Searcher@edad9ef[testschemaapi_shard1_replica2] main]
   [junit4]   2> 3394202 INFO  (qtp1267850386-47601) [n:127.0.0.1:58329_solr c:testschemaapi s:shard1 r:core_node2 x:testschemaapi_shard1_replica2] o.a.s.c.c.ZkStateReader Load collection config from: [/collections/testschemaapi]
   [junit4]   2> 3394202 INFO  (qtp1267850386-47601) [n:127.0.0.1:58329_solr c:testschemaapi s:shard1 r:core_node2 x:testschemaapi_shard1_replica2] o.a.s.c.c.ZkStateReader path=[/collections/testschemaapi] [configName]=[conf1] specified config exists in ZooKeeper
   [junit4]   2> 3394202 INFO  (qtp1267850386-47601) [n:127.0.0.1:58329_solr c:testschemaapi s:shard1 r:core_node2 x:testschemaapi_shard1_replica2] o.a.s.r.ManagedResourceStorage Setting up ZooKeeper-based storage for the RestManager with znodeBase: /configs/conf1
   [junit4]   2> 3394204 INFO  (qtp1267850386-47601) [n:127.0.0.1:58329_solr c:testschemaapi s:shard1 r:core_node2 x:testschemaapi_shard1_replica2] o.a.s.r.ManagedResourceStorage Configured ZooKeeperStorageIO with znodeBase: /configs/conf1
   [junit4]   2> 3394204 INFO  (qtp1267850386-47601) [n:127.0.0.1:58329_solr c:testschemaapi s:shard1 r:core_node2 x:testschemaapi_shard1_replica2] o.a.s.r.RestManager Initializing RestManager with initArgs: {}
   [junit4]   2> 3394204 INFO  (qtp1267850386-47601) [n:127.0.0.1:58329_solr c:testschemaapi s:shard1 r:core_node2 x:testschemaapi_shard1_replica2] o.a.s.r.ManagedResourceStorage Reading _rest_managed.json using ZooKeeperStorageIO:path=/configs/conf1
   [junit4]   2> 3394205 INFO  (qtp1267850386-47601) [n:127.0.0.1:58329_solr c:testschemaapi s:shard1 r:core_node2 x:testschemaapi_shard1_replica2] o.a.s.r.ManagedResourceStorage No data found for znode /configs/conf1/_rest_managed.json
   [junit4]   2> 3394205 INFO  (qtp1267850386-47601) [n:127.0.0.1:58329_solr c:testschemaapi s:shard1 r:core_node2 x:testschemaapi_shard1_replica2] o.a.s.r.ManagedResourceStorage Loaded null at path _rest_managed.json using ZooKeeperStorageIO:path=/configs/conf1
   [junit4]   2> 3394205 INFO  (qtp1267850386-47601) [n:127.0.0.1:58329_solr c:testschemaapi s:shard1 r:core_node2 x:testschemaapi_shard1_replica2] o.a.s.r.RestManager Initializing 0 registered ManagedResources
   [junit4]   2> 3394205 INFO  (qtp1267850386-47601) [n:127.0.0.1:58329_solr c:testschemaapi s:shard1 r:core_node2 x:testschemaapi_shard1_replica2] o.a.s.s.ZkIndexSchemaReader Creating ZooKeeper watch for the managed schema at /configs/conf1/managed-schema
   [junit4]   2> 3394206 INFO  (qtp1265287132-47608) [n:127.0.0.1:58330_solr c:testschemaapi s:shard1 r:core_node1 x:testschemaapi_shard1_replica1] o.a.s.c.LeaderElector Joined leadership election with path: /collections/testschemaapi/leader_elect/shard1/election/96132877804175366-core_node1-n_0000000000
   [junit4]   2> 3394206 INFO  (qtp1267850386-47601) [n:127.0.0.1:58329_solr c:testschemaapi s:shard1 r:core_node2 x:testschemaapi_shard1_replica2] o.a.s.c.ZkController Added new OnReconnect listener ZkIndexSchemaReader: /configs/conf1/managed-schema, uniqueCoreId: testschemaapi_shard1_replica2:13956392994077
   [junit4]   2> 3394206 INFO  (qtp1267850386-47601) [n:127.0.0.1:58329_solr c:testschemaapi s:shard1 r:core_node2 x:testschemaapi_shard1_replica2] o.a.s.h.ReplicationHandler Commits will be reserved for  10000
   [junit4]   2> 3394206 INFO  (qtp1267850386-47601) [n:127.0.0.1:58329_solr c:testschemaapi s:shard1 r:core_node2 x:testschemaapi_shard1_replica2] o.a.s.u.UpdateLog Looking up max value of version field to seed version buckets
   [junit4]   2> 3394206 INFO  (qtp1267850386-47601) [n:127.0.0.1:58329_solr c:testschemaapi s:shard1 r:core_node2 x:testschemaapi_shard1_replica2] o.a.s.u.VersionInfo Refreshing highest value of _version_ for 65536 version buckets from index
   [junit4]   2> 3394206 INFO  (searcherExecutor-10388-thread-1-processing-n:127.0.0.1:58329_solr x:testschemaapi_shard1_replica2 s:shard1 c:testschemaapi r:core_node2) [n:127.0.0.1:58329_solr c:testschemaapi s:shard1 r:core_node2 x:testschemaapi_shard1_replica2] o.a.s.c.SolrCore [testschemaapi_shard1_replica2] Registered new searcher Searcher@edad9ef[testschemaapi_shard1_replica2] main{ExitableDirectoryReader(UninvertingDirectoryReader())}
   [junit4]   2> 3394206 INFO  (qtp1265287132-47608) [n:127.0.0.1:58330_solr c:testschemaapi s:shard1 r:core_node1 x:testschemaapi_shard1_replica1] o.a.s.c.ShardLeaderElectionContext Running the leader process for shard=shard1 and weAreReplacement=false and leaderVoteWait=10000
   [junit4]   2> 3394206 INFO  (qtp1267850386-47601) [n:127.0.0.1:58329_solr c:testschemaapi s:shard1 r:core_node2 x:testschemaapi_shard1_replica2] o.a.s.u.VersionInfo No terms found for _version_, cannot seed version bucket highest value from index
   [junit4]   2> 3394206 INFO  (qtp1267850386-47601) [n:127.0.0.1:58329_solr c:testschemaapi s:shard1 r:core_node2 x:testschemaapi_shard1_replica2] o.a.s.u.UpdateLog Could not find max version in index or recent updates, using new clock 1538126047458885632
   [junit4]   2> 3394207 INFO  (qtp1267850386-47601) [n:127.0.0.1:58329_solr c:testschemaapi s:shard1 r:core_node2 x:testschemaapi_shard1_replica2] o.a.s.u.UpdateLog Took 2.0ms to seed version buckets with highest version 1538126047458885632
   [junit4]   2> 3394207 INFO  (qtp1267850386-47601) [n:127.0.0.1:58329_solr c:testschemaapi s:shard1 r:core_node2 x:testschemaapi_shard1_replica2] o.a.s.c.ZkController watch zkdir /configs/conf1
   [junit4]   2> 3394209 INFO  (qtp1267850386-47601) [n:127.0.0.1:58329_solr c:testschemaapi s:shard1 r:core_node2 x:testschemaapi_shard1_replica2] o.a.s.c.CoreContainer registering core: testschemaapi_shard1_replica2
   [junit4]   2> 3394209 INFO  (qtp1267850386-47601) [n:127.0.0.1:58329_solr c:testschemaapi s:shard1 r:core_node2 x:testschemaapi_shard1_replica2] o.a.s.c.ZkController Register replica - core:testschemaapi_shard1_replica2 address:https://127.0.0.1:58329/solr collection:testschemaapi shard:shard1
   [junit4]   2> 3394210 INFO  (qtp1265287132-47608) [n:127.0.0.1:58330_solr c:testschemaapi s:shard1 r:core_node1 x:testschemaapi_shard1_replica1] o.a.s.c.ShardLeaderElectionContext Waiting until we see more replicas up for shard shard1: total=2 found=1 timeoutin=9999ms
   [junit4]   2> 3394211 INFO  (OverseerStateUpdate-96132877804175366-127.0.0.1:58330_solr-n_0000000000) [n:127.0.0.1:58330_solr    ] o.a.s.c.Overseer processMessage: queueSize: 1, message = {
   [junit4]   2>   "operation":"leader",
   [junit4]   2>   "shard":"shard1",
   [junit4]   2>   "collection":"testschemaapi"} current state version: 0
   [junit4]   2> 3394211 INFO  (qtp1267850386-47601) [n:127.0.0.1:58329_solr c:testschemaapi s:shard1 r:core_node2 x:testschemaapi_shard1_replica2] o.a.s.c.LeaderElector Joined leadership election with path: /collections/testschemaapi/leader_elect/shard1/election/96132877804175365-core_node2-n_0000000001
   [junit4]   2> 3394212 INFO  (qtp1267850386-47601) [n:127.0.0.1:58329_solr c:testschemaapi s:shard1 r:core_node2 x:testschemaapi_shard1_replica2] o.a.s.c.LeaderElector Watching path /collections/testschemaapi/leader_elect/shard1/election/96132877804175366-core_node1-n_0000000000 to know if I could be the leader
   [junit4]   2> 3394315 INFO  (OverseerStateUpdate-96132877804175366-127.0.0.1:58330_solr-n_0000000000) [n:127.0.0.1:58330_solr    ] o.a.s.c.o.ZkStateWriter going to update_collection /collections/testschemaapi/state.json version: 1
   [junit4]   2> 3394316 INFO  (zkCallback-11150-thread-3-processing-n:127.0.0.1:58330_solr) [n:127.0.0.1:58330_solr    ] o.a.s.c.c.ZkStateReader A cluster state change: [WatchedEvent state:SyncConnected type:NodeDataChanged path:/collections/testschemaapi/state.json] for collection [testschemaapi] has occurred - updating... (live nodes size: [2])
   [junit4]   2> 3394316 INFO  (zkCallback-11149-thread-1-processing-n:127.0.0.1:58329_solr) [n:127.0.0.1:58329_solr    ] o.a.s.c.c.ZkStateReader A cluster state change: [WatchedEvent state:SyncConnect

[...truncated too long message...]

ergeStrategyTest, HdfsBasicDistributedZk2Test, QueryEqualityTest, TestHdfsBackupRestoreCore, TestCollapseQParserPlugin, DirectoryFactoryTest, RegexBoostProcessorTest, BlockJoinFacetDistribTest, TestQuerySenderNoQuery, TestGroupingSearch, TimeZoneUtilsTest, TestCollationFieldDocValues, TestSQLHandler, TestRawResponseWriter, HdfsRecoverLeaseTest, DirectUpdateHandlerTest, HdfsDirectoryTest, AddBlockUpdateTest, TestReloadAndDeleteDocs, TestDocumentBuilder, TestFunctionQuery, CurrencyFieldXmlFileTest, ZkStateReaderTest, AlternateDirectoryTest, TestCollectionAPI, TestSurroundQueryParser, TestDFRSimilarityFactory, HighlighterTest, BitVectorTest, TestFilteredDocIdSet, TestStressVersions, TestUniqueKeyFieldResource, LeaderInitiatedRecoveryOnCommitTest, TestMiniSolrCloudClusterBase, SampleTest, CdcrRequestHandlerTest, TestSolrQueryResponse, TestSolrDeletionPolicy1, TestFieldCacheSort, TestLRUCache, EnumFieldTest, SimpleMLTQParserTest, TestDocSet, TestSubQueryTransformerCrossCore, TestNoOpRegenerator, HdfsDirectoryFactoryTest, TestUpdate, MigrateRouteKeyTest, TestLFUCache, TestSchemaResource, TestPartialUpdateDeduplication, WrapperMergePolicyFactoryTest, FullHLLTest, SliceStateTest, PolyFieldTest, OverseerTest, TestUseDocValuesAsStored, TestManagedSynonymFilterFactory, DistributedFacetPivotSmallTest, SyncSliceTest, TestMacros, DateRangeFieldTest, DistributedQueryComponentCustomSortTest, DistribJoinFromCollectionTest, TestLuceneMatchVersion, TestRequestStatusCollectionAPI, MBeansHandlerTest, TestGeoJSONResponseWriter, TestMinMaxOnMultiValuedField, BigEndianAscendingWordDeserializerTest, TestExpandComponent, ActionThrottleTest, TestRandomRequestDistribution, InfoHandlerTest, TestSearcherReuse, SimpleCollectionCreateDeleteTest, SystemInfoHandlerTest, AnalysisAfterCoreReloadTest, CursorMarkTest, TestCloudBackupRestore, CoreAdminRequestStatusTest, ClusterStateUpdateTest, TestRandomFaceting, TestZkChroot, ShardRoutingCustomTest, TestFaceting, TestRecovery, TestHashPartitioner, ZkControllerTest, TestJoin, DistributedTermsComponentTest, StatsComponentTest, TestFiltering, TestLazyCores, TestCoreDiscovery, SignatureUpdateProcessorFactoryTest, SuggesterFSTTest, CoreAdminHandlerTest, DocValuesTest, DirectUpdateHandlerOptimizeTest, TestRemoteStreaming, SolrInfoMBeanTest, DisMaxRequestHandlerTest, StandardRequestHandlerTest, DocumentAnalysisRequestHandlerTest, TestOmitPositions, TermsComponentTest, RequestHandlersTest, TestValueSourceCache, TestIndexingPerformance, TestArbitraryIndexDir, IndexSchemaRuntimeFieldTest, SolrPluginUtilsTest, TestJmxIntegration, TestCSVResponseWriter, TestAnalyzedSuggestions, TestComponentsName, SOLR749Test, TestQuerySenderListener, UpdateParamsTest, TestSolrIndexConfig, ResponseLogComponentTest, SolrIndexConfigTest, BadComponentTest, TestStressRecovery, TestBinaryField, MinimalSchemaTest, TestFuzzyAnalyzedSuggestions, ExternalFileFieldSortTest, TestPostingsSolrHighlighter, DirectSolrConnectionTest, TestPhraseSuggestions, SpellPossibilityIteratorTest, TestCharFilters, SynonymTokenizerTest, EchoParamsTest, TestSweetSpotSimilarityFactory, TestPerFieldSimilarity, TestLMDirichletSimilarityFactory, TestLMJelinekMercerSimilarityFactory, TestIBSimilarityFactory, TestJmxMonitoredMap, ResourceLoaderTest, ScriptEngineTest, URLClassifyProcessorTest, DateMathParserTest, ChaosMonkeyNothingIsSafeTest, BaseCdcrDistributedZkTest, CdcrReplicationHandlerTest, CleanupOldIndexTest, CollectionStateFormat2Test, ConcurrentDeleteAndCreateCollectionTest, ConnectionManagerTest, CreateCollectionCleanupTest, CustomCollectionTest, ForceLeaderTest, SharedFSAutoReplicaFailoverTest, TestConfigSetsAPI, TestConfigSetsAPIZkFailure, TestCryptoKeys, TestLeaderElectionZkExpiry, TestLeaderInitiatedRecoveryThread, TestLockTree, TestMiniSolrCloudCluster, TestReplicaProperties, TestStressCloudBlindAtomicUpdates, TestStressLiveNodes, TlogReplayBufferedWhileIndexingTest, TriLevelCompositeIdRoutingTest, ExitableDirectoryReaderTest, QueryResultKeyTest, TestBackupRepositoryFactory, TestConfigSetImmutable, TestDynamicLoading, TestInfoStreamLogging, TestInitParams, TestSolrConfigHandler, TestSolrXml, RequestLoggingTest, TestBlobHandler, TestConfigReload, CoreAdminCreateDiscoverTest, SegmentsInfoRequestHandlerTest, DistributedExpandComponentTest, DistributedFacetPivotLongTailTest, DistributedQueryComponentOptimizationTest, FacetPivotSmallTest, SuggestComponentTest, JavabinLoaderTest, HighlighterMaxOffsetTest, CheckHdfsIndexTest, SmileWriterTest, TestIntervalFaceting, TestRawTransformer, TestChildDocTransformer, TestSubQueryTransformer, TestSubQueryTransformerDistrib, TestManagedSchemaAPI]
   [junit4]   2> NOTE: reproduce with: ant test  -Dtestcase=TestManagedSchemaAPI -Dtests.seed=24425B944C2AAEFC -Dtests.slow=true -Dtests.locale=en-NZ -Dtests.timezone=BST -Dtests.asserts=true -Dtests.file.encoding=US-ASCII
   [junit4] ERROR   0.00s J0 | TestManagedSchemaAPI (suite) <<<
   [junit4]    > Throwable #1: java.lang.AssertionError: ObjectTracker found 4 object(s) that were not released!!! [MockDirectoryWrapper, MockDirectoryWrapper, TransactionLog, MDCAwareThreadPoolExecutor]
   [junit4]    > 	at __randomizedtesting.SeedInfo.seed([24425B944C2AAEFC]:0)
   [junit4]    > 	at org.apache.solr.SolrTestCaseJ4.teardownTestCases(SolrTestCaseJ4.java:257)
   [junit4]    > 	at java.lang.Thread.run(Thread.java:745)Throwable #2: java.io.IOException: Could not remove the following files (in the order of attempts):
   [junit4]    >    C:\Users\jenkins\workspace\Lucene-Solr-6.x-Windows\solr\build\solr-core\test\J0\temp\solr.schema.TestManagedSchemaAPI_24425B944C2AAEFC-001\tempDir-001\node1\testschemaapi_shard1_replica2\data\tlog\tlog.0000000000000000000: java.nio.file.FileSystemException: C:\Users\jenkins\workspace\Lucene-Solr-6.x-Windows\solr\build\solr-core\test\J0\temp\solr.schema.TestManagedSchemaAPI_24425B944C2AAEFC-001\tempDir-001\node1\testschemaapi_shard1_replica2\data\tlog\tlog.0000000000000000000: The process cannot access the file because it is being used by another process.
   [junit4]    >    C:\Users\jenkins\workspace\Lucene-Solr-6.x-Windows\solr\build\solr-core\test\J0\temp\solr.schema.TestManagedSchemaAPI_24425B944C2AAEFC-001\tempDir-001\node1\testschemaapi_shard1_replica2\data\tlog: java.nio.file.DirectoryNotEmptyException: C:\Users\jenkins\workspace\Lucene-Solr-6.x-Windows\solr\build\solr-core\test\J0\temp\solr.schema.TestManagedSchemaAPI_24425B944C2AAEFC-001\tempDir-001\node1\testschemaapi_shard1_replica2\data\tlog
   [junit4]    >    C:\Users\jenkins\workspace\Lucene-Solr-6.x-Windows\solr\build\solr-core\test\J0\temp\solr.schema.TestManagedSchemaAPI_24425B944C2AAEFC-001\tempDir-001\node1\testschemaapi_shard1_replica2\data: java.nio.file.DirectoryNotEmptyException: C:\Users\jenkins\workspace\Lucene-Solr-6.x-Windows\solr\build\solr-core\test\J0\temp\solr.schema.TestManagedSchemaAPI_24425B944C2AAEFC-001\tempDir-001\node1\testschemaapi_shard1_replica2\data
   [junit4]    >    C:\Users\jenkins\workspace\Lucene-Solr-6.x-Windows\solr\build\solr-core\test\J0\temp\solr.schema.TestManagedSchemaAPI_24425B944C2AAEFC-001\tempDir-001\node1\testschemaapi_shard1_replica2: java.nio.file.DirectoryNotEmptyException: C:\Users\jenkins\workspace\Lucene-Solr-6.x-Windows\solr\build\solr-core\test\J0\temp\solr.schema.TestManagedSchemaAPI_24425B944C2AAEFC-001\tempDir-001\node1\testschemaapi_shard1_replica2
   [junit4]    >    C:\Users\jenkins\workspace\Lucene-Solr-6.x-Windows\solr\build\solr-core\test\J0\temp\solr.schema.TestManagedSchemaAPI_24425B944C2AAEFC-001\tempDir-001\node1: java.nio.file.DirectoryNotEmptyException: C:\Users\jenkins\workspace\Lucene-Solr-6.x-Windows\solr\build\solr-core\test\J0\temp\solr.schema.TestManagedSchemaAPI_24425B944C2AAEFC-001\tempDir-001\node1
   [junit4]    >    C:\Users\jenkins\workspace\Lucene-Solr-6.x-Windows\solr\build\solr-core\test\J0\temp\solr.schema.TestManagedSchemaAPI_24425B944C2AAEFC-001\tempDir-001: java.nio.file.DirectoryNotEmptyException: C:\Users\jenkins\workspace\Lucene-Solr-6.x-Windows\solr\build\solr-core\test\J0\temp\solr.schema.TestManagedSchemaAPI_24425B944C2AAEFC-001\tempDir-001
   [junit4]    >    C:\Users\jenkins\workspace\Lucene-Solr-6.x-Windows\solr\build\solr-core\test\J0\temp\solr.schema.TestManagedSchemaAPI_24425B944C2AAEFC-001: java.nio.file.DirectoryNotEmptyException: C:\Users\jenkins\workspace\Lucene-Solr-6.x-Windows\solr\build\solr-core\test\J0\temp\solr.schema.TestManagedSchemaAPI_24425B944C2AAEFC-001
   [junit4]    > 	at org.apache.lucene.util.IOUtils.rm(IOUtils.java:323)
   [junit4]    > 	at java.lang.Thread.run(Thread.java:745)
   [junit4] Completed [559/617 (1!)] on J0 in 13.89s, 1 test, 1 failure, 1 error <<< FAILURES!

[...truncated 207 lines...]
BUILD FAILED
C:\Users\jenkins\workspace\Lucene-Solr-6.x-Windows\build.xml:740: The following error occurred while executing this line:
C:\Users\jenkins\workspace\Lucene-Solr-6.x-Windows\build.xml:684: The following error occurred while executing this line:
C:\Users\jenkins\workspace\Lucene-Solr-6.x-Windows\build.xml:59: The following error occurred while executing this line:
C:\Users\jenkins\workspace\Lucene-Solr-6.x-Windows\solr\build.xml:233: The following error occurred while executing this line:
C:\Users\jenkins\workspace\Lucene-Solr-6.x-Windows\solr\common-build.xml:530: The following error occurred while executing this line:
C:\Users\jenkins\workspace\Lucene-Solr-6.x-Windows\lucene\common-build.xml:1427: The following error occurred while executing this line:
C:\Users\jenkins\workspace\Lucene-Solr-6.x-Windows\lucene\common-build.xml:984: There were test failures: 617 suites (10 ignored), 2597 tests, 2 suite-level errors, 127 ignored (82 assumptions) [seed: 24425B944C2AAEFC]

Total time: 83 minutes 56 seconds
Build step 'Invoke Ant' marked build as failure
Archiving artifacts
[WARNINGS] Skipping publisher since build result is FAILURE
Recording test results
Email was triggered for: Failure - Any
Sending email for trigger: Failure - Any