You are viewing a plain text version of this content. The canonical link for it is here.
Posted to dev@kafka.apache.org by Apache Jenkins Server <je...@builds.apache.org> on 2016/08/16 20:27:01 UTC
Build failed in Jenkins: kafka-trunk-jdk8 #818
See <https://builds.apache.org/job/kafka-trunk-jdk8/818/changes>
Changes:
[me] HOTFIX: Re-inserted SimpleBenchmark output for system tests
------------------------------------------
[...truncated 6821 lines...]
kafka.security.auth.SimpleAclAuthorizerTest > testLoadCache STARTED
kafka.security.auth.SimpleAclAuthorizerTest > testLoadCache PASSED
kafka.integration.SaslPlaintextTopicMetadataTest > testIsrAfterBrokerShutDownAndJoinsBack STARTED
kafka.integration.SaslPlaintextTopicMetadataTest > testIsrAfterBrokerShutDownAndJoinsBack PASSED
kafka.integration.SaslPlaintextTopicMetadataTest > testAutoCreateTopicWithCollision STARTED
kafka.integration.SaslPlaintextTopicMetadataTest > testAutoCreateTopicWithCollision PASSED
kafka.integration.SaslPlaintextTopicMetadataTest > testAliveBrokerListWithNoTopics STARTED
kafka.integration.SaslPlaintextTopicMetadataTest > testAliveBrokerListWithNoTopics PASSED
kafka.integration.SaslPlaintextTopicMetadataTest > testAutoCreateTopic STARTED
kafka.integration.SaslPlaintextTopicMetadataTest > testAutoCreateTopic PASSED
kafka.integration.SaslPlaintextTopicMetadataTest > testGetAllTopicMetadata STARTED
kafka.integration.SaslPlaintextTopicMetadataTest > testGetAllTopicMetadata PASSED
kafka.integration.SaslPlaintextTopicMetadataTest > testAliveBrokersListWithNoTopicsAfterNewBrokerStartup STARTED
kafka.integration.SaslPlaintextTopicMetadataTest > testAliveBrokersListWithNoTopicsAfterNewBrokerStartup PASSED
kafka.integration.SaslPlaintextTopicMetadataTest > testBasicTopicMetadata STARTED
kafka.integration.SaslPlaintextTopicMetadataTest > testBasicTopicMetadata PASSED
kafka.integration.SaslPlaintextTopicMetadataTest > testAliveBrokersListWithNoTopicsAfterABrokerShutdown STARTED
kafka.integration.SaslPlaintextTopicMetadataTest > testAliveBrokersListWithNoTopicsAfterABrokerShutdown PASSED
kafka.integration.PrimitiveApiTest > testMultiProduce STARTED
kafka.integration.PrimitiveApiTest > testMultiProduce PASSED
kafka.integration.PrimitiveApiTest > testDefaultEncoderProducerAndFetch STARTED
kafka.integration.PrimitiveApiTest > testDefaultEncoderProducerAndFetch PASSED
kafka.integration.PrimitiveApiTest > testFetchRequestCanProperlySerialize STARTED
kafka.integration.PrimitiveApiTest > testFetchRequestCanProperlySerialize PASSED
kafka.integration.PrimitiveApiTest > testPipelinedProduceRequests STARTED
kafka.integration.PrimitiveApiTest > testPipelinedProduceRequests PASSED
kafka.integration.PrimitiveApiTest > testProduceAndMultiFetch STARTED
kafka.integration.PrimitiveApiTest > testProduceAndMultiFetch PASSED
kafka.integration.PrimitiveApiTest > testDefaultEncoderProducerAndFetchWithCompression STARTED
kafka.integration.PrimitiveApiTest > testDefaultEncoderProducerAndFetchWithCompression PASSED
kafka.integration.PrimitiveApiTest > testConsumerEmptyTopic STARTED
kafka.integration.PrimitiveApiTest > testConsumerEmptyTopic PASSED
kafka.integration.PrimitiveApiTest > testEmptyFetchRequest STARTED
kafka.integration.PrimitiveApiTest > testEmptyFetchRequest PASSED
kafka.integration.PlaintextTopicMetadataTest > testIsrAfterBrokerShutDownAndJoinsBack STARTED
kafka.integration.PlaintextTopicMetadataTest > testIsrAfterBrokerShutDownAndJoinsBack PASSED
kafka.integration.PlaintextTopicMetadataTest > testAutoCreateTopicWithCollision STARTED
kafka.integration.PlaintextTopicMetadataTest > testAutoCreateTopicWithCollision PASSED
kafka.integration.PlaintextTopicMetadataTest > testAliveBrokerListWithNoTopics STARTED
kafka.integration.PlaintextTopicMetadataTest > testAliveBrokerListWithNoTopics PASSED
kafka.integration.PlaintextTopicMetadataTest > testAutoCreateTopic STARTED
kafka.integration.PlaintextTopicMetadataTest > testAutoCreateTopic PASSED
kafka.integration.PlaintextTopicMetadataTest > testGetAllTopicMetadata STARTED
kafka.integration.PlaintextTopicMetadataTest > testGetAllTopicMetadata PASSED
kafka.integration.PlaintextTopicMetadataTest > testAliveBrokersListWithNoTopicsAfterNewBrokerStartup STARTED
kafka.integration.PlaintextTopicMetadataTest > testAliveBrokersListWithNoTopicsAfterNewBrokerStartup PASSED
kafka.integration.PlaintextTopicMetadataTest > testBasicTopicMetadata STARTED
kafka.integration.PlaintextTopicMetadataTest > testBasicTopicMetadata PASSED
kafka.integration.PlaintextTopicMetadataTest > testAliveBrokersListWithNoTopicsAfterABrokerShutdown STARTED
kafka.integration.PlaintextTopicMetadataTest > testAliveBrokersListWithNoTopicsAfterABrokerShutdown PASSED
kafka.integration.AutoOffsetResetTest > testResetToLatestWhenOffsetTooLow STARTED
kafka.integration.AutoOffsetResetTest > testResetToLatestWhenOffsetTooLow PASSED
kafka.integration.AutoOffsetResetTest > testResetToEarliestWhenOffsetTooLow STARTED
kafka.integration.AutoOffsetResetTest > testResetToEarliestWhenOffsetTooLow PASSED
kafka.integration.AutoOffsetResetTest > testResetToEarliestWhenOffsetTooHigh STARTED
kafka.integration.AutoOffsetResetTest > testResetToEarliestWhenOffsetTooHigh PASSED
kafka.integration.AutoOffsetResetTest > testResetToLatestWhenOffsetTooHigh STARTED
kafka.integration.AutoOffsetResetTest > testResetToLatestWhenOffsetTooHigh PASSED
kafka.integration.SslTopicMetadataTest > testIsrAfterBrokerShutDownAndJoinsBack STARTED
kafka.integration.SslTopicMetadataTest > testIsrAfterBrokerShutDownAndJoinsBack PASSED
kafka.integration.SslTopicMetadataTest > testAutoCreateTopicWithCollision STARTED
kafka.integration.SslTopicMetadataTest > testAutoCreateTopicWithCollision PASSED
kafka.integration.SslTopicMetadataTest > testAliveBrokerListWithNoTopics STARTED
kafka.integration.SslTopicMetadataTest > testAliveBrokerListWithNoTopics PASSED
kafka.integration.SslTopicMetadataTest > testAutoCreateTopic STARTED
kafka.integration.SslTopicMetadataTest > testAutoCreateTopic PASSED
kafka.integration.SslTopicMetadataTest > testGetAllTopicMetadata STARTED
kafka.integration.SslTopicMetadataTest > testGetAllTopicMetadata PASSED
kafka.integration.SslTopicMetadataTest > testAliveBrokersListWithNoTopicsAfterNewBrokerStartup STARTED
kafka.integration.SslTopicMetadataTest > testAliveBrokersListWithNoTopicsAfterNewBrokerStartup PASSED
kafka.integration.SslTopicMetadataTest > testBasicTopicMetadata STARTED
kafka.integration.SslTopicMetadataTest > testBasicTopicMetadata PASSED
kafka.integration.SslTopicMetadataTest > testAliveBrokersListWithNoTopicsAfterABrokerShutdown STARTED
kafka.integration.SslTopicMetadataTest > testAliveBrokersListWithNoTopicsAfterABrokerShutdown PASSED
kafka.integration.SaslSslTopicMetadataTest > testIsrAfterBrokerShutDownAndJoinsBack STARTED
kafka.integration.SaslSslTopicMetadataTest > testIsrAfterBrokerShutDownAndJoinsBack PASSED
kafka.integration.SaslSslTopicMetadataTest > testAutoCreateTopicWithCollision STARTED
kafka.integration.SaslSslTopicMetadataTest > testAutoCreateTopicWithCollision PASSED
kafka.integration.SaslSslTopicMetadataTest > testAliveBrokerListWithNoTopics STARTED
kafka.integration.SaslSslTopicMetadataTest > testAliveBrokerListWithNoTopics PASSED
kafka.integration.SaslSslTopicMetadataTest > testAutoCreateTopic STARTED
kafka.integration.SaslSslTopicMetadataTest > testAutoCreateTopic PASSED
kafka.integration.SaslSslTopicMetadataTest > testGetAllTopicMetadata STARTED
kafka.integration.SaslSslTopicMetadataTest > testGetAllTopicMetadata PASSED
kafka.integration.SaslSslTopicMetadataTest > testAliveBrokersListWithNoTopicsAfterNewBrokerStartup STARTED
kafka.integration.SaslSslTopicMetadataTest > testAliveBrokersListWithNoTopicsAfterNewBrokerStartup PASSED
kafka.integration.SaslSslTopicMetadataTest > testBasicTopicMetadata STARTED
kafka.integration.SaslSslTopicMetadataTest > testBasicTopicMetadata PASSED
kafka.integration.SaslSslTopicMetadataTest > testAliveBrokersListWithNoTopicsAfterABrokerShutdown STARTED
kafka.integration.SaslSslTopicMetadataTest > testAliveBrokersListWithNoTopicsAfterABrokerShutdown PASSED
kafka.integration.FetcherTest > testFetcher STARTED
kafka.integration.FetcherTest > testFetcher PASSED
kafka.integration.UncleanLeaderElectionTest > testUncleanLeaderElectionEnabled STARTED
kafka.integration.UncleanLeaderElectionTest > testUncleanLeaderElectionEnabled PASSED
kafka.integration.UncleanLeaderElectionTest > testCleanLeaderElectionDisabledByTopicOverride STARTED
kafka.integration.UncleanLeaderElectionTest > testCleanLeaderElectionDisabledByTopicOverride PASSED
kafka.integration.UncleanLeaderElectionTest > testUncleanLeaderElectionDisabled STARTED
kafka.integration.UncleanLeaderElectionTest > testUncleanLeaderElectionDisabled PASSED
kafka.integration.UncleanLeaderElectionTest > testUncleanLeaderElectionInvalidTopicOverride STARTED
kafka.integration.UncleanLeaderElectionTest > testUncleanLeaderElectionInvalidTopicOverride PASSED
kafka.integration.UncleanLeaderElectionTest > testUncleanLeaderElectionEnabledByTopicOverride STARTED
kafka.integration.UncleanLeaderElectionTest > testUncleanLeaderElectionEnabledByTopicOverride PASSED
kafka.integration.MinIsrConfigTest > testDefaultKafkaConfig STARTED
kafka.integration.MinIsrConfigTest > testDefaultKafkaConfig PASSED
unit.kafka.server.ApiVersionsTest > testApiVersions STARTED
unit.kafka.server.ApiVersionsTest > testApiVersions PASSED
unit.kafka.admin.ReassignPartitionsClusterTest > shouldExpandCluster STARTED
unit.kafka.admin.ReassignPartitionsClusterTest > shouldExpandCluster PASSED
unit.kafka.admin.ReassignPartitionsClusterTest > shouldMoveSinglePartition STARTED
unit.kafka.admin.ReassignPartitionsClusterTest > shouldMoveSinglePartition PASSED
unit.kafka.admin.ReassignPartitionsClusterTest > shouldShrinkCluster STARTED
unit.kafka.admin.ReassignPartitionsClusterTest > shouldShrinkCluster PASSED
integration.kafka.api.GroupCoordinatorIntegrationTest > testGroupCoordinatorPropagatesOfffsetsTopicCompressionCodec STARTED
integration.kafka.api.GroupCoordinatorIntegrationTest > testGroupCoordinatorPropagatesOfffsetsTopicCompressionCodec PASSED
825 tests completed, 1 failed
:kafka-trunk-jdk8:core:test FAILED
:test_core_2_11 FAILED
FAILURE: Build failed with an exception.
* What went wrong:
Execution failed for task ':core:test'.
> There were failing tests. See the report at: file://<https://builds.apache.org/job/kafka-trunk-jdk8/ws/core/build/reports/tests/index.html>
* Try:
Run with --stacktrace option to get the stack trace. Run with --info or --debug option to get more log output.
BUILD FAILED
Total time: 1 hrs 13 mins 50.767 secs
Build step 'Execute shell' marked build as failure
Recording test results
Setting GRADLE_2_4_RC_2_HOME=/home/jenkins/jenkins-slave/tools/hudson.plugins.gradle.GradleInstallation/Gradle_2.4-rc-2
Setting GRADLE_2_4_RC_2_HOME=/home/jenkins/jenkins-slave/tools/hudson.plugins.gradle.GradleInstallation/Gradle_2.4-rc-2
Jenkins build is back to normal : kafka-trunk-jdk8 #823
Posted by Apache Jenkins Server <je...@builds.apache.org>.
See <https://builds.apache.org/job/kafka-trunk-jdk8/823/changes>
Build failed in Jenkins: kafka-trunk-jdk8 #822
Posted by Apache Jenkins Server <je...@builds.apache.org>.
See <https://builds.apache.org/job/kafka-trunk-jdk8/822/changes>
Changes:
[me] KAFKA-4037: Make Connect REST API retries aware of 409 CONFLICT errors
------------------------------------------
[...truncated 11997 lines...]
org.apache.kafka.streams.kstream.internals.KTableKTableLeftJoinTest > testJoin PASSED
org.apache.kafka.streams.kstream.internals.KTableKTableLeftJoinTest > testNotSendingOldValue STARTED
org.apache.kafka.streams.kstream.internals.KTableKTableLeftJoinTest > testNotSendingOldValue PASSED
org.apache.kafka.streams.kstream.internals.KeyValuePrinterProcessorTest > testPrintKeyValueWithProvidedSerde STARTED
org.apache.kafka.streams.kstream.internals.KeyValuePrinterProcessorTest > testPrintKeyValueWithProvidedSerde PASSED
org.apache.kafka.streams.kstream.internals.KeyValuePrinterProcessorTest > testPrintKeyValuesWithName STARTED
org.apache.kafka.streams.kstream.internals.KeyValuePrinterProcessorTest > testPrintKeyValuesWithName PASSED
org.apache.kafka.streams.kstream.internals.KeyValuePrinterProcessorTest > testPrintKeyValueDefaultSerde STARTED
org.apache.kafka.streams.kstream.internals.KeyValuePrinterProcessorTest > testPrintKeyValueDefaultSerde PASSED
org.apache.kafka.streams.kstream.internals.KTableSourceTest > testSendingOldValue STARTED
org.apache.kafka.streams.kstream.internals.KTableSourceTest > testSendingOldValue PASSED
org.apache.kafka.streams.kstream.internals.KTableSourceTest > testNotSendingOldValue STARTED
org.apache.kafka.streams.kstream.internals.KTableSourceTest > testNotSendingOldValue PASSED
org.apache.kafka.streams.kstream.internals.KTableSourceTest > testKTable STARTED
org.apache.kafka.streams.kstream.internals.KTableSourceTest > testKTable PASSED
org.apache.kafka.streams.kstream.internals.KTableSourceTest > testValueGetter STARTED
org.apache.kafka.streams.kstream.internals.KTableSourceTest > testValueGetter PASSED
org.apache.kafka.streams.kstream.internals.KTableMapKeysTest > testMapKeysConvertingToStream STARTED
org.apache.kafka.streams.kstream.internals.KTableMapKeysTest > testMapKeysConvertingToStream PASSED
org.apache.kafka.streams.kstream.internals.KStreamForeachTest > testForeach STARTED
org.apache.kafka.streams.kstream.internals.KStreamForeachTest > testForeach PASSED
org.apache.kafka.streams.kstream.internals.KTableKTableOuterJoinTest > testSendingOldValue STARTED
org.apache.kafka.streams.kstream.internals.KTableKTableOuterJoinTest > testSendingOldValue PASSED
org.apache.kafka.streams.kstream.internals.KTableKTableOuterJoinTest > testJoin STARTED
org.apache.kafka.streams.kstream.internals.KTableKTableOuterJoinTest > testJoin PASSED
org.apache.kafka.streams.kstream.internals.KTableKTableOuterJoinTest > testNotSendingOldValue STARTED
org.apache.kafka.streams.kstream.internals.KTableKTableOuterJoinTest > testNotSendingOldValue PASSED
org.apache.kafka.streams.kstream.internals.KStreamKStreamJoinTest > testOuterJoin STARTED
org.apache.kafka.streams.kstream.internals.KStreamKStreamJoinTest > testOuterJoin PASSED
org.apache.kafka.streams.kstream.internals.KStreamKStreamJoinTest > testJoin STARTED
org.apache.kafka.streams.kstream.internals.KStreamKStreamJoinTest > testJoin PASSED
org.apache.kafka.streams.kstream.internals.KStreamKStreamJoinTest > testWindowing STARTED
org.apache.kafka.streams.kstream.internals.KStreamKStreamJoinTest > testWindowing PASSED
org.apache.kafka.streams.kstream.internals.KStreamFlatMapValuesTest > testFlatMapValues STARTED
org.apache.kafka.streams.kstream.internals.KStreamFlatMapValuesTest > testFlatMapValues PASSED
org.apache.kafka.streams.kstream.internals.KTableKTableJoinTest > testJoin STARTED
org.apache.kafka.streams.kstream.internals.KTableKTableJoinTest > testJoin PASSED
org.apache.kafka.streams.kstream.internals.KTableKTableJoinTest > testNotSendingOldValues STARTED
org.apache.kafka.streams.kstream.internals.KTableKTableJoinTest > testNotSendingOldValues PASSED
org.apache.kafka.streams.kstream.internals.KTableKTableJoinTest > testSendingOldValues STARTED
org.apache.kafka.streams.kstream.internals.KTableKTableJoinTest > testSendingOldValues PASSED
org.apache.kafka.streams.kstream.internals.KTableAggregateTest > testAggBasic STARTED
org.apache.kafka.streams.kstream.internals.KTableAggregateTest > testAggBasic PASSED
org.apache.kafka.streams.kstream.internals.KTableAggregateTest > testCount STARTED
org.apache.kafka.streams.kstream.internals.KTableAggregateTest > testCount PASSED
org.apache.kafka.streams.kstream.internals.KTableAggregateTest > testAggRepartition STARTED
org.apache.kafka.streams.kstream.internals.KTableAggregateTest > testAggRepartition PASSED
org.apache.kafka.streams.kstream.internals.KTableAggregateTest > testRemoveOldBeforeAddNew STARTED
org.apache.kafka.streams.kstream.internals.KTableAggregateTest > testRemoveOldBeforeAddNew PASSED
org.apache.kafka.streams.kstream.internals.KStreamFilterTest > testFilterNot STARTED
org.apache.kafka.streams.kstream.internals.KStreamFilterTest > testFilterNot PASSED
org.apache.kafka.streams.kstream.internals.KStreamFilterTest > testFilter STARTED
org.apache.kafka.streams.kstream.internals.KStreamFilterTest > testFilter PASSED
org.apache.kafka.streams.kstream.internals.KStreamFlatMapTest > testFlatMap STARTED
org.apache.kafka.streams.kstream.internals.KStreamFlatMapTest > testFlatMap PASSED
org.apache.kafka.streams.kstream.internals.KStreamWindowAggregateTest > testAggBasic STARTED
org.apache.kafka.streams.kstream.internals.KStreamWindowAggregateTest > testAggBasic PASSED
org.apache.kafka.streams.kstream.internals.KStreamWindowAggregateTest > testJoin STARTED
org.apache.kafka.streams.kstream.internals.KStreamWindowAggregateTest > testJoin PASSED
org.apache.kafka.streams.kstream.internals.KStreamSelectKeyTest > testSelectKey STARTED
org.apache.kafka.streams.kstream.internals.KStreamSelectKeyTest > testSelectKey PASSED
org.apache.kafka.streams.kstream.internals.KStreamMapTest > testMap STARTED
org.apache.kafka.streams.kstream.internals.KStreamMapTest > testMap PASSED
org.apache.kafka.streams.kstream.internals.KStreamTransformValuesTest > testTransform STARTED
org.apache.kafka.streams.kstream.internals.KStreamTransformValuesTest > testTransform PASSED
org.apache.kafka.streams.kstream.internals.KTableFilterTest > testSendingOldValue STARTED
org.apache.kafka.streams.kstream.internals.KTableFilterTest > testSendingOldValue PASSED
org.apache.kafka.streams.kstream.internals.KTableFilterTest > testNotSendingOldValue STARTED
org.apache.kafka.streams.kstream.internals.KTableFilterTest > testNotSendingOldValue PASSED
org.apache.kafka.streams.kstream.internals.KTableFilterTest > testSkipNullOnMaterialization STARTED
org.apache.kafka.streams.kstream.internals.KTableFilterTest > testSkipNullOnMaterialization PASSED
org.apache.kafka.streams.kstream.internals.KTableFilterTest > testKTable STARTED
org.apache.kafka.streams.kstream.internals.KTableFilterTest > testKTable PASSED
org.apache.kafka.streams.kstream.internals.KTableFilterTest > testValueGetter STARTED
org.apache.kafka.streams.kstream.internals.KTableFilterTest > testValueGetter PASSED
org.apache.kafka.streams.kstream.internals.KStreamTransformTest > testTransform STARTED
org.apache.kafka.streams.kstream.internals.KStreamTransformTest > testTransform PASSED
org.apache.kafka.streams.kstream.internals.KGroupedStreamImplTest > shouldNotHaveNullReducerOnReduce STARTED
org.apache.kafka.streams.kstream.internals.KGroupedStreamImplTest > shouldNotHaveNullReducerOnReduce PASSED
org.apache.kafka.streams.kstream.internals.KGroupedStreamImplTest > shouldNotHaveNullStoreNameOnReduce STARTED
org.apache.kafka.streams.kstream.internals.KGroupedStreamImplTest > shouldNotHaveNullStoreNameOnReduce PASSED
org.apache.kafka.streams.kstream.internals.KGroupedStreamImplTest > shouldNotHaveNullAdderOnWindowedAggregate STARTED
org.apache.kafka.streams.kstream.internals.KGroupedStreamImplTest > shouldNotHaveNullAdderOnWindowedAggregate PASSED
org.apache.kafka.streams.kstream.internals.KGroupedStreamImplTest > shouldNotHaveNullInitializerOnWindowedAggregate STARTED
org.apache.kafka.streams.kstream.internals.KGroupedStreamImplTest > shouldNotHaveNullInitializerOnWindowedAggregate PASSED
org.apache.kafka.streams.kstream.internals.KGroupedStreamImplTest > shouldNotHaveNullReducerWithWindowedReduce STARTED
org.apache.kafka.streams.kstream.internals.KGroupedStreamImplTest > shouldNotHaveNullReducerWithWindowedReduce PASSED
org.apache.kafka.streams.kstream.internals.KGroupedStreamImplTest > shouldNotHaveNullStoreNameOnAggregate STARTED
org.apache.kafka.streams.kstream.internals.KGroupedStreamImplTest > shouldNotHaveNullStoreNameOnAggregate PASSED
org.apache.kafka.streams.kstream.internals.KGroupedStreamImplTest > shouldNotHaveNullAdderOnAggregate STARTED
org.apache.kafka.streams.kstream.internals.KGroupedStreamImplTest > shouldNotHaveNullAdderOnAggregate PASSED
org.apache.kafka.streams.kstream.internals.KGroupedStreamImplTest > shouldNotHaveNullWindowsWithWindowedReduce STARTED
org.apache.kafka.streams.kstream.internals.KGroupedStreamImplTest > shouldNotHaveNullWindowsWithWindowedReduce PASSED
org.apache.kafka.streams.kstream.internals.KGroupedStreamImplTest > shouldNotHaveNullWindowsOnWindowedAggregate STARTED
org.apache.kafka.streams.kstream.internals.KGroupedStreamImplTest > shouldNotHaveNullWindowsOnWindowedAggregate PASSED
org.apache.kafka.streams.kstream.internals.KGroupedStreamImplTest > shouldNotHaveNullStoreNameOnWindowedAggregate STARTED
org.apache.kafka.streams.kstream.internals.KGroupedStreamImplTest > shouldNotHaveNullStoreNameOnWindowedAggregate PASSED
org.apache.kafka.streams.kstream.internals.KGroupedStreamImplTest > shouldNotHaveNullStoreNameWithWindowedReduce STARTED
org.apache.kafka.streams.kstream.internals.KGroupedStreamImplTest > shouldNotHaveNullStoreNameWithWindowedReduce PASSED
org.apache.kafka.streams.kstream.internals.KGroupedStreamImplTest > shouldNotHaveNullInitializerOnAggregate STARTED
org.apache.kafka.streams.kstream.internals.KGroupedStreamImplTest > shouldNotHaveNullInitializerOnAggregate PASSED
org.apache.kafka.streams.kstream.KStreamBuilderTest > shouldHaveCorrectSourceTopicsForTableFromMergedStream STARTED
org.apache.kafka.streams.kstream.KStreamBuilderTest > shouldHaveCorrectSourceTopicsForTableFromMergedStream PASSED
org.apache.kafka.streams.kstream.KStreamBuilderTest > shouldHaveCorrectSourceTopicsForTableFromMergedStreamWithProcessors STARTED
org.apache.kafka.streams.kstream.KStreamBuilderTest > shouldHaveCorrectSourceTopicsForTableFromMergedStreamWithProcessors PASSED
org.apache.kafka.streams.kstream.KStreamBuilderTest > testMerge STARTED
org.apache.kafka.streams.kstream.KStreamBuilderTest > testMerge PASSED
org.apache.kafka.streams.kstream.KStreamBuilderTest > testFrom STARTED
org.apache.kafka.streams.kstream.KStreamBuilderTest > testFrom PASSED
org.apache.kafka.streams.kstream.KStreamBuilderTest > shouldThrowExceptionWhenTopicNamesAreNull STARTED
org.apache.kafka.streams.kstream.KStreamBuilderTest > shouldThrowExceptionWhenTopicNamesAreNull PASSED
org.apache.kafka.streams.kstream.KStreamBuilderTest > shouldThrowExceptionWhenNoTopicPresent STARTED
org.apache.kafka.streams.kstream.KStreamBuilderTest > shouldThrowExceptionWhenNoTopicPresent PASSED
org.apache.kafka.streams.kstream.KStreamBuilderTest > testNewName STARTED
org.apache.kafka.streams.kstream.KStreamBuilderTest > testNewName PASSED
pure virtual method called
terminate called without an active exception
:streams:test FAILED
FAILURE: Build failed with an exception.
* What went wrong:
Execution failed for task ':streams:test'.
> Process 'Gradle Test Executor 4' finished with non-zero exit value 134
* Try:
Run with --stacktrace option to get the stack trace. Run with --info or --debug option to get more log output.
BUILD FAILED
Total time: 1 hrs 8 mins 9.135 secs
Build step 'Execute shell' marked build as failure
Recording test results
Setting GRADLE_2_4_RC_2_HOME=/home/jenkins/jenkins-slave/tools/hudson.plugins.gradle.GradleInstallation/Gradle_2.4-rc-2
Setting GRADLE_2_4_RC_2_HOME=/home/jenkins/jenkins-slave/tools/hudson.plugins.gradle.GradleInstallation/Gradle_2.4-rc-2
Build failed in Jenkins: kafka-trunk-jdk8 #821
Posted by Apache Jenkins Server <je...@builds.apache.org>.
See <https://builds.apache.org/job/kafka-trunk-jdk8/821/changes>
Changes:
[ismael] KAFKA-4038; Transient failure in
------------------------------------------
[...truncated 12008 lines...]
org.apache.kafka.streams.kstream.internals.KTableKTableLeftJoinTest > testJoin PASSED
org.apache.kafka.streams.kstream.internals.KTableKTableLeftJoinTest > testNotSendingOldValue STARTED
org.apache.kafka.streams.kstream.internals.KTableKTableLeftJoinTest > testNotSendingOldValue PASSED
org.apache.kafka.streams.kstream.internals.KeyValuePrinterProcessorTest > testPrintKeyValueWithProvidedSerde STARTED
org.apache.kafka.streams.kstream.internals.KeyValuePrinterProcessorTest > testPrintKeyValueWithProvidedSerde PASSED
org.apache.kafka.streams.kstream.internals.KeyValuePrinterProcessorTest > testPrintKeyValuesWithName STARTED
org.apache.kafka.streams.kstream.internals.KeyValuePrinterProcessorTest > testPrintKeyValuesWithName PASSED
org.apache.kafka.streams.kstream.internals.KeyValuePrinterProcessorTest > testPrintKeyValueDefaultSerde STARTED
org.apache.kafka.streams.kstream.internals.KeyValuePrinterProcessorTest > testPrintKeyValueDefaultSerde PASSED
org.apache.kafka.streams.kstream.internals.KTableSourceTest > testSendingOldValue STARTED
org.apache.kafka.streams.kstream.internals.KTableSourceTest > testSendingOldValue PASSED
org.apache.kafka.streams.kstream.internals.KTableSourceTest > testNotSendingOldValue STARTED
org.apache.kafka.streams.kstream.internals.KTableSourceTest > testNotSendingOldValue PASSED
org.apache.kafka.streams.kstream.internals.KTableSourceTest > testKTable STARTED
org.apache.kafka.streams.kstream.internals.KTableSourceTest > testKTable PASSED
org.apache.kafka.streams.kstream.internals.KTableSourceTest > testValueGetter STARTED
org.apache.kafka.streams.kstream.internals.KTableSourceTest > testValueGetter PASSED
org.apache.kafka.streams.kstream.internals.KTableMapKeysTest > testMapKeysConvertingToStream STARTED
org.apache.kafka.streams.kstream.internals.KTableMapKeysTest > testMapKeysConvertingToStream PASSED
org.apache.kafka.streams.kstream.internals.KStreamForeachTest > testForeach STARTED
org.apache.kafka.streams.kstream.internals.KStreamForeachTest > testForeach PASSED
org.apache.kafka.streams.kstream.internals.KTableKTableOuterJoinTest > testSendingOldValue STARTED
org.apache.kafka.streams.kstream.internals.KTableKTableOuterJoinTest > testSendingOldValue PASSED
org.apache.kafka.streams.kstream.internals.KTableKTableOuterJoinTest > testJoin STARTED
org.apache.kafka.streams.kstream.internals.KTableKTableOuterJoinTest > testJoin PASSED
org.apache.kafka.streams.kstream.internals.KTableKTableOuterJoinTest > testNotSendingOldValue STARTED
org.apache.kafka.streams.kstream.internals.KTableKTableOuterJoinTest > testNotSendingOldValue PASSED
org.apache.kafka.streams.kstream.internals.KStreamKStreamJoinTest > testOuterJoin STARTED
org.apache.kafka.streams.kstream.internals.KStreamKStreamJoinTest > testOuterJoin PASSED
org.apache.kafka.streams.kstream.internals.KStreamKStreamJoinTest > testJoin STARTED
org.apache.kafka.streams.kstream.internals.KStreamKStreamJoinTest > testJoin PASSED
org.apache.kafka.streams.kstream.internals.KStreamKStreamJoinTest > testWindowing STARTED
org.apache.kafka.streams.kstream.internals.KStreamKStreamJoinTest > testWindowing PASSED
org.apache.kafka.streams.kstream.internals.KStreamFlatMapValuesTest > testFlatMapValues STARTED
org.apache.kafka.streams.kstream.internals.KStreamFlatMapValuesTest > testFlatMapValues PASSED
org.apache.kafka.streams.kstream.internals.KTableKTableJoinTest > testJoin STARTED
org.apache.kafka.streams.kstream.internals.KTableKTableJoinTest > testJoin PASSED
org.apache.kafka.streams.kstream.internals.KTableKTableJoinTest > testNotSendingOldValues STARTED
org.apache.kafka.streams.kstream.internals.KTableKTableJoinTest > testNotSendingOldValues PASSED
org.apache.kafka.streams.kstream.internals.KTableKTableJoinTest > testSendingOldValues STARTED
org.apache.kafka.streams.kstream.internals.KTableKTableJoinTest > testSendingOldValues PASSED
org.apache.kafka.streams.kstream.internals.KTableAggregateTest > testAggBasic STARTED
org.apache.kafka.streams.kstream.internals.KTableAggregateTest > testAggBasic PASSED
org.apache.kafka.streams.kstream.internals.KTableAggregateTest > testCount STARTED
org.apache.kafka.streams.kstream.internals.KTableAggregateTest > testCount PASSED
org.apache.kafka.streams.kstream.internals.KTableAggregateTest > testAggRepartition STARTED
org.apache.kafka.streams.kstream.internals.KTableAggregateTest > testAggRepartition PASSED
org.apache.kafka.streams.kstream.internals.KTableAggregateTest > testRemoveOldBeforeAddNew STARTED
org.apache.kafka.streams.kstream.internals.KTableAggregateTest > testRemoveOldBeforeAddNew PASSED
org.apache.kafka.streams.kstream.internals.KStreamFilterTest > testFilterNot STARTED
org.apache.kafka.streams.kstream.internals.KStreamFilterTest > testFilterNot PASSED
org.apache.kafka.streams.kstream.internals.KStreamFilterTest > testFilter STARTED
org.apache.kafka.streams.kstream.internals.KStreamFilterTest > testFilter PASSED
org.apache.kafka.streams.kstream.internals.KStreamFlatMapTest > testFlatMap STARTED
org.apache.kafka.streams.kstream.internals.KStreamFlatMapTest > testFlatMap PASSED
org.apache.kafka.streams.kstream.internals.KStreamWindowAggregateTest > testAggBasic STARTED
org.apache.kafka.streams.kstream.internals.KStreamWindowAggregateTest > testAggBasic PASSED
org.apache.kafka.streams.kstream.internals.KStreamWindowAggregateTest > testJoin STARTED
org.apache.kafka.streams.kstream.internals.KStreamWindowAggregateTest > testJoin PASSED
org.apache.kafka.streams.kstream.internals.KStreamSelectKeyTest > testSelectKey STARTED
org.apache.kafka.streams.kstream.internals.KStreamSelectKeyTest > testSelectKey PASSED
org.apache.kafka.streams.kstream.internals.KStreamMapTest > testMap STARTED
org.apache.kafka.streams.kstream.internals.KStreamMapTest > testMap PASSED
org.apache.kafka.streams.kstream.internals.KStreamTransformValuesTest > testTransform STARTED
org.apache.kafka.streams.kstream.internals.KStreamTransformValuesTest > testTransform PASSED
org.apache.kafka.streams.kstream.internals.KTableFilterTest > testSendingOldValue STARTED
org.apache.kafka.streams.kstream.internals.KTableFilterTest > testSendingOldValue PASSED
org.apache.kafka.streams.kstream.internals.KTableFilterTest > testNotSendingOldValue STARTED
org.apache.kafka.streams.kstream.internals.KTableFilterTest > testNotSendingOldValue PASSED
org.apache.kafka.streams.kstream.internals.KTableFilterTest > testSkipNullOnMaterialization STARTED
org.apache.kafka.streams.kstream.internals.KTableFilterTest > testSkipNullOnMaterialization PASSED
org.apache.kafka.streams.kstream.internals.KTableFilterTest > testKTable STARTED
org.apache.kafka.streams.kstream.internals.KTableFilterTest > testKTable PASSED
org.apache.kafka.streams.kstream.internals.KTableFilterTest > testValueGetter STARTED
org.apache.kafka.streams.kstream.internals.KTableFilterTest > testValueGetter PASSED
org.apache.kafka.streams.kstream.internals.KStreamTransformTest > testTransform STARTED
org.apache.kafka.streams.kstream.internals.KStreamTransformTest > testTransform PASSED
org.apache.kafka.streams.kstream.internals.KGroupedStreamImplTest > shouldNotHaveNullReducerOnReduce STARTED
org.apache.kafka.streams.kstream.internals.KGroupedStreamImplTest > shouldNotHaveNullReducerOnReduce PASSED
org.apache.kafka.streams.kstream.internals.KGroupedStreamImplTest > shouldNotHaveNullStoreNameOnReduce STARTED
org.apache.kafka.streams.kstream.internals.KGroupedStreamImplTest > shouldNotHaveNullStoreNameOnReduce PASSED
org.apache.kafka.streams.kstream.internals.KGroupedStreamImplTest > shouldNotHaveNullAdderOnWindowedAggregate STARTED
org.apache.kafka.streams.kstream.internals.KGroupedStreamImplTest > shouldNotHaveNullAdderOnWindowedAggregate PASSED
org.apache.kafka.streams.kstream.internals.KGroupedStreamImplTest > shouldNotHaveNullInitializerOnWindowedAggregate STARTED
org.apache.kafka.streams.kstream.internals.KGroupedStreamImplTest > shouldNotHaveNullInitializerOnWindowedAggregate PASSED
org.apache.kafka.streams.kstream.internals.KGroupedStreamImplTest > shouldNotHaveNullReducerWithWindowedReduce STARTED
org.apache.kafka.streams.kstream.internals.KGroupedStreamImplTest > shouldNotHaveNullReducerWithWindowedReduce PASSED
org.apache.kafka.streams.kstream.internals.KGroupedStreamImplTest > shouldNotHaveNullStoreNameOnAggregate STARTED
org.apache.kafka.streams.kstream.internals.KGroupedStreamImplTest > shouldNotHaveNullStoreNameOnAggregate PASSED
org.apache.kafka.streams.kstream.internals.KGroupedStreamImplTest > shouldNotHaveNullAdderOnAggregate STARTED
org.apache.kafka.streams.kstream.internals.KGroupedStreamImplTest > shouldNotHaveNullAdderOnAggregate PASSED
org.apache.kafka.streams.kstream.internals.KGroupedStreamImplTest > shouldNotHaveNullWindowsWithWindowedReduce STARTED
org.apache.kafka.streams.kstream.internals.KGroupedStreamImplTest > shouldNotHaveNullWindowsWithWindowedReduce PASSED
org.apache.kafka.streams.kstream.internals.KGroupedStreamImplTest > shouldNotHaveNullWindowsOnWindowedAggregate STARTED
org.apache.kafka.streams.kstream.internals.KGroupedStreamImplTest > shouldNotHaveNullWindowsOnWindowedAggregate PASSED
org.apache.kafka.streams.kstream.internals.KGroupedStreamImplTest > shouldNotHaveNullStoreNameOnWindowedAggregate STARTED
org.apache.kafka.streams.kstream.internals.KGroupedStreamImplTest > shouldNotHaveNullStoreNameOnWindowedAggregate PASSED
org.apache.kafka.streams.kstream.internals.KGroupedStreamImplTest > shouldNotHaveNullStoreNameWithWindowedReduce STARTED
org.apache.kafka.streams.kstream.internals.KGroupedStreamImplTest > shouldNotHaveNullStoreNameWithWindowedReduce PASSED
org.apache.kafka.streams.kstream.internals.KGroupedStreamImplTest > shouldNotHaveNullInitializerOnAggregate STARTED
org.apache.kafka.streams.kstream.internals.KGroupedStreamImplTest > shouldNotHaveNullInitializerOnAggregate PASSED
org.apache.kafka.streams.kstream.KStreamBuilderTest > shouldHaveCorrectSourceTopicsForTableFromMergedStream STARTED
org.apache.kafka.streams.kstream.KStreamBuilderTest > shouldHaveCorrectSourceTopicsForTableFromMergedStream PASSED
org.apache.kafka.streams.kstream.KStreamBuilderTest > shouldHaveCorrectSourceTopicsForTableFromMergedStreamWithProcessors STARTED
org.apache.kafka.streams.kstream.KStreamBuilderTest > shouldHaveCorrectSourceTopicsForTableFromMergedStreamWithProcessors PASSED
org.apache.kafka.streams.kstream.KStreamBuilderTest > testMerge STARTED
org.apache.kafka.streams.kstream.KStreamBuilderTest > testMerge PASSED
org.apache.kafka.streams.kstream.KStreamBuilderTest > testFrom STARTED
org.apache.kafka.streams.kstream.KStreamBuilderTest > testFrom PASSED
org.apache.kafka.streams.kstream.KStreamBuilderTest > shouldThrowExceptionWhenTopicNamesAreNull STARTED
org.apache.kafka.streams.kstream.KStreamBuilderTest > shouldThrowExceptionWhenTopicNamesAreNull PASSED
org.apache.kafka.streams.kstream.KStreamBuilderTest > shouldThrowExceptionWhenNoTopicPresent STARTED
org.apache.kafka.streams.kstream.KStreamBuilderTest > shouldThrowExceptionWhenNoTopicPresent PASSED
org.apache.kafka.streams.kstream.KStreamBuilderTest > testNewName STARTED
org.apache.kafka.streams.kstream.KStreamBuilderTest > testNewName PASSED
354 tests completed, 1 failed
:streams:test FAILED
FAILURE: Build failed with an exception.
* What went wrong:
Execution failed for task ':streams:test'.
> There were failing tests. See the report at: file://<https://builds.apache.org/job/kafka-trunk-jdk8/ws/streams/build/reports/tests/index.html>
* Try:
Run with --stacktrace option to get the stack trace. Run with --info or --debug option to get more log output.
BUILD FAILED
Total time: 1 hrs 3 mins 1.851 secs
Build step 'Execute shell' marked build as failure
Recording test results
Setting GRADLE_2_4_RC_2_HOME=/home/jenkins/jenkins-slave/tools/hudson.plugins.gradle.GradleInstallation/Gradle_2.4-rc-2
Setting GRADLE_2_4_RC_2_HOME=/home/jenkins/jenkins-slave/tools/hudson.plugins.gradle.GradleInstallation/Gradle_2.4-rc-2
Build failed in Jenkins: kafka-trunk-jdk8 #820
Posted by Apache Jenkins Server <je...@builds.apache.org>.
See <https://builds.apache.org/job/kafka-trunk-jdk8/820/changes>
Changes:
[wangguoz] KAFKA-3888: send consumer heartbeats from a background thread (KIP-62)
------------------------------------------
[...truncated 5136 lines...]
kafka.api.PlaintextProducerSendTest > testWrongSerializer STARTED
kafka.api.PlaintextProducerSendTest > testWrongSerializer PASSED
kafka.api.PlaintextProducerSendTest > testSendNonCompressedMessageWithCreateTime STARTED
kafka.api.PlaintextProducerSendTest > testSendNonCompressedMessageWithCreateTime PASSED
kafka.api.PlaintextProducerSendTest > testSendCompressedMessageWithLogAppendTime STARTED
kafka.api.PlaintextProducerSendTest > testSendCompressedMessageWithLogAppendTime PASSED
kafka.api.PlaintextProducerSendTest > testClose STARTED
kafka.api.PlaintextProducerSendTest > testClose PASSED
kafka.api.PlaintextProducerSendTest > testFlush STARTED
kafka.api.PlaintextProducerSendTest > testFlush PASSED
kafka.api.PlaintextProducerSendTest > testSendToPartition STARTED
kafka.api.PlaintextProducerSendTest > testSendToPartition PASSED
kafka.api.PlaintextProducerSendTest > testSendOffset STARTED
kafka.api.PlaintextProducerSendTest > testSendOffset PASSED
kafka.api.PlaintextProducerSendTest > testAutoCreateTopic STARTED
kafka.api.PlaintextProducerSendTest > testAutoCreateTopic PASSED
kafka.api.PlaintextProducerSendTest > testSendWithInvalidCreateTime STARTED
kafka.api.PlaintextProducerSendTest > testSendWithInvalidCreateTime PASSED
kafka.api.PlaintextProducerSendTest > testSendCompressedMessageWithCreateTime STARTED
kafka.api.PlaintextProducerSendTest > testSendCompressedMessageWithCreateTime PASSED
kafka.api.PlaintextProducerSendTest > testCloseWithZeroTimeoutFromCallerThread STARTED
kafka.api.PlaintextProducerSendTest > testCloseWithZeroTimeoutFromCallerThread PASSED
kafka.api.PlaintextProducerSendTest > testCloseWithZeroTimeoutFromSenderThread STARTED
kafka.api.PlaintextProducerSendTest > testCloseWithZeroTimeoutFromSenderThread PASSED
kafka.api.PlaintextProducerSendTest > testSendNonCompressedMessageWithLogApendTime STARTED
kafka.api.PlaintextProducerSendTest > testSendNonCompressedMessageWithLogApendTime PASSED
kafka.api.PlaintextConsumerTest > testPartitionsForAutoCreate STARTED
kafka.api.PlaintextConsumerTest > testPartitionsForAutoCreate PASSED
kafka.api.PlaintextConsumerTest > testShrinkingTopicSubscriptions STARTED
kafka.api.PlaintextConsumerTest > testShrinkingTopicSubscriptions PASSED
kafka.api.PlaintextConsumerTest > testMaxPollIntervalMs STARTED
kafka.api.PlaintextConsumerTest > testMaxPollIntervalMs PASSED
kafka.api.PlaintextConsumerTest > testSubsequentPatternSubscription STARTED
kafka.api.PlaintextConsumerTest > testSubsequentPatternSubscription PASSED
kafka.api.PlaintextConsumerTest > testAsyncCommit STARTED
kafka.api.PlaintextConsumerTest > testAsyncCommit PASSED
kafka.api.PlaintextConsumerTest > testMultiConsumerSessionTimeoutOnStopPolling STARTED
kafka.api.PlaintextConsumerTest > testMultiConsumerSessionTimeoutOnStopPolling PASSED
kafka.api.PlaintextConsumerTest > testPartitionsForInvalidTopic STARTED
kafka.api.PlaintextConsumerTest > testPartitionsForInvalidTopic PASSED
kafka.api.PlaintextConsumerTest > testPauseStateNotPreservedByRebalance STARTED
kafka.api.PlaintextConsumerTest > testPauseStateNotPreservedByRebalance PASSED
kafka.api.PlaintextConsumerTest > testSeek STARTED
kafka.api.PlaintextConsumerTest > testSeek PASSED
kafka.api.PlaintextConsumerTest > testPositionAndCommit STARTED
kafka.api.PlaintextConsumerTest > testPositionAndCommit PASSED
kafka.api.PlaintextConsumerTest > testUnsubscribeTopic STARTED
kafka.api.PlaintextConsumerTest > testUnsubscribeTopic PASSED
kafka.api.PlaintextConsumerTest > testMultiConsumerSessionTimeoutOnClose STARTED
kafka.api.PlaintextConsumerTest > testMultiConsumerSessionTimeoutOnClose PASSED
kafka.api.PlaintextConsumerTest > testFetchRecordTooLarge STARTED
kafka.api.PlaintextConsumerTest > testFetchRecordTooLarge PASSED
kafka.api.PlaintextConsumerTest > testMultiConsumerDefaultAssignment STARTED
kafka.api.PlaintextConsumerTest > testMultiConsumerDefaultAssignment PASSED
kafka.api.PlaintextConsumerTest > testAutoCommitOnClose STARTED
kafka.api.PlaintextConsumerTest > testAutoCommitOnClose PASSED
kafka.api.PlaintextConsumerTest > testListTopics STARTED
kafka.api.PlaintextConsumerTest > testListTopics PASSED
kafka.api.PlaintextConsumerTest > testExpandingTopicSubscriptions STARTED
kafka.api.PlaintextConsumerTest > testExpandingTopicSubscriptions PASSED
kafka.api.PlaintextConsumerTest > testInterceptors STARTED
kafka.api.PlaintextConsumerTest > testInterceptors PASSED
kafka.api.PlaintextConsumerTest > testPatternUnsubscription STARTED
kafka.api.PlaintextConsumerTest > testPatternUnsubscription PASSED
kafka.api.PlaintextConsumerTest > testGroupConsumption STARTED
kafka.api.PlaintextConsumerTest > testGroupConsumption PASSED
kafka.api.PlaintextConsumerTest > testPartitionsFor STARTED
kafka.api.PlaintextConsumerTest > testPartitionsFor PASSED
kafka.api.PlaintextConsumerTest > testAutoCommitOnRebalance STARTED
kafka.api.PlaintextConsumerTest > testAutoCommitOnRebalance PASSED
kafka.api.PlaintextConsumerTest > testInterceptorsWithWrongKeyValue STARTED
kafka.api.PlaintextConsumerTest > testInterceptorsWithWrongKeyValue PASSED
kafka.api.PlaintextConsumerTest > testMultiConsumerRoundRobinAssignment STARTED
kafka.api.PlaintextConsumerTest > testMultiConsumerRoundRobinAssignment PASSED
kafka.api.PlaintextConsumerTest > testPartitionPauseAndResume STARTED
kafka.api.PlaintextConsumerTest > testPartitionPauseAndResume PASSED
kafka.api.PlaintextConsumerTest > testConsumeMessagesWithLogAppendTime STARTED
kafka.api.PlaintextConsumerTest > testConsumeMessagesWithLogAppendTime PASSED
kafka.api.PlaintextConsumerTest > testAutoCommitOnCloseAfterWakeup STARTED
kafka.api.PlaintextConsumerTest > testAutoCommitOnCloseAfterWakeup PASSED
kafka.api.PlaintextConsumerTest > testMaxPollRecords STARTED
kafka.api.PlaintextConsumerTest > testMaxPollRecords PASSED
kafka.api.PlaintextConsumerTest > testAutoOffsetReset STARTED
kafka.api.PlaintextConsumerTest > testAutoOffsetReset PASSED
kafka.api.PlaintextConsumerTest > testFetchInvalidOffset STARTED
kafka.api.PlaintextConsumerTest > testFetchInvalidOffset PASSED
kafka.api.PlaintextConsumerTest > testAutoCommitIntercept STARTED
kafka.api.PlaintextConsumerTest > testAutoCommitIntercept PASSED
kafka.api.PlaintextConsumerTest > testCommitSpecifiedOffsets STARTED
kafka.api.PlaintextConsumerTest > testCommitSpecifiedOffsets PASSED
kafka.api.PlaintextConsumerTest > testCommitMetadata STARTED
kafka.api.PlaintextConsumerTest > testCommitMetadata PASSED
kafka.api.PlaintextConsumerTest > testRoundRobinAssignment STARTED
kafka.api.PlaintextConsumerTest > testRoundRobinAssignment PASSED
kafka.api.PlaintextConsumerTest > testPatternSubscription STARTED
kafka.api.PlaintextConsumerTest > testPatternSubscription PASSED
kafka.api.PlaintextConsumerTest > testCoordinatorFailover STARTED
kafka.api.PlaintextConsumerTest > testCoordinatorFailover PASSED
kafka.api.PlaintextConsumerTest > testSimpleConsumption STARTED
kafka.api.PlaintextConsumerTest > testSimpleConsumption PASSED
kafka.api.ApiUtilsTest > testShortStringNonASCII STARTED
kafka.api.ApiUtilsTest > testShortStringNonASCII PASSED
kafka.api.ApiUtilsTest > testShortStringASCII STARTED
kafka.api.ApiUtilsTest > testShortStringASCII PASSED
kafka.api.ConsumerBounceTest > testSeekAndCommitWithBrokerFailures STARTED
kafka.api.ConsumerBounceTest > testSeekAndCommitWithBrokerFailures PASSED
kafka.api.ConsumerBounceTest > testConsumptionWithBrokerFailures STARTED
kafka.api.ConsumerBounceTest > testConsumptionWithBrokerFailures PASSED
kafka.api.QuotasTest > testProducerConsumerOverrideUnthrottled STARTED
kafka.api.QuotasTest > testProducerConsumerOverrideUnthrottled PASSED
kafka.api.QuotasTest > testThrottledProducerConsumer STARTED
kafka.api.QuotasTest > testThrottledProducerConsumer PASSED
kafka.api.SaslMultiMechanismConsumerTest > testMultipleBrokerMechanisms STARTED
kafka.api.SaslMultiMechanismConsumerTest > testMultipleBrokerMechanisms PASSED
kafka.api.SaslMultiMechanismConsumerTest > testCoordinatorFailover STARTED
:kafka-trunk-jdk8:core:test FAILED
:test_core_2_11 FAILED
FAILURE: Build failed with an exception.
* What went wrong:
Execution failed for task ':core:test'.
> Process 'Gradle Test Executor 2' finished with non-zero exit value 1
* Try:
Run with --stacktrace option to get the stack trace. Run with --info or --debug option to get more log output.
BUILD FAILED
Total time: 1 hrs 33 mins 6.931 secs
Build step 'Execute shell' marked build as failure
Recording test results
Setting GRADLE_2_4_RC_2_HOME=/home/jenkins/jenkins-slave/tools/hudson.plugins.gradle.GradleInstallation/Gradle_2.4-rc-2
Setting GRADLE_2_4_RC_2_HOME=/home/jenkins/jenkins-slave/tools/hudson.plugins.gradle.GradleInstallation/Gradle_2.4-rc-2
Build failed in Jenkins: kafka-trunk-jdk8 #819
Posted by Apache Jenkins Server <je...@builds.apache.org>.
See <https://builds.apache.org/job/kafka-trunk-jdk8/819/changes>
Changes:
[junrao] KAFKA-4044; log actual socket send/receive buffer size after connecting
------------------------------------------
[...truncated 12204 lines...]
org.apache.kafka.streams.processor.internals.MinTimestampTrackerTest > testTracking PASSED
org.apache.kafka.streams.processor.internals.StreamTaskTest > testProcessOrder STARTED
org.apache.kafka.streams.processor.internals.StreamTaskTest > testProcessOrder PASSED
org.apache.kafka.streams.processor.internals.StreamTaskTest > testPauseResume STARTED
org.apache.kafka.streams.processor.internals.StreamTaskTest > testPauseResume PASSED
org.apache.kafka.streams.processor.internals.StreamTaskTest > testMaybePunctuate STARTED
org.apache.kafka.streams.processor.internals.StreamTaskTest > testMaybePunctuate PASSED
org.apache.kafka.streams.processor.internals.assignment.AssignmentInfoTest > testEncodeDecode STARTED
org.apache.kafka.streams.processor.internals.assignment.AssignmentInfoTest > testEncodeDecode PASSED
org.apache.kafka.streams.processor.internals.assignment.AssignmentInfoTest > shouldDecodePreviousVersion STARTED
org.apache.kafka.streams.processor.internals.assignment.AssignmentInfoTest > shouldDecodePreviousVersion PASSED
org.apache.kafka.streams.processor.internals.assignment.SubscriptionInfoTest > testEncodeDecode STARTED
org.apache.kafka.streams.processor.internals.assignment.SubscriptionInfoTest > testEncodeDecode PASSED
org.apache.kafka.streams.processor.internals.assignment.SubscriptionInfoTest > shouldEncodeDecodeWithUserEndPoint STARTED
org.apache.kafka.streams.processor.internals.assignment.SubscriptionInfoTest > shouldEncodeDecodeWithUserEndPoint PASSED
org.apache.kafka.streams.processor.internals.assignment.SubscriptionInfoTest > shouldBeBackwardCompatible STARTED
org.apache.kafka.streams.processor.internals.assignment.SubscriptionInfoTest > shouldBeBackwardCompatible PASSED
org.apache.kafka.streams.processor.internals.assignment.TaskAssignorTest > testStickiness STARTED
org.apache.kafka.streams.processor.internals.assignment.TaskAssignorTest > testStickiness PASSED
org.apache.kafka.streams.processor.internals.assignment.TaskAssignorTest > testAssignWithStandby STARTED
org.apache.kafka.streams.processor.internals.assignment.TaskAssignorTest > testAssignWithStandby PASSED
org.apache.kafka.streams.processor.internals.assignment.TaskAssignorTest > testAssignWithoutStandby STARTED
org.apache.kafka.streams.processor.internals.assignment.TaskAssignorTest > testAssignWithoutStandby PASSED
org.apache.kafka.streams.processor.internals.ProcessorTopologyTest > testDrivingMultiplexingTopology STARTED
org.apache.kafka.streams.processor.internals.ProcessorTopologyTest > testDrivingMultiplexingTopology PASSED
org.apache.kafka.streams.processor.internals.ProcessorTopologyTest > testDrivingStatefulTopology STARTED
org.apache.kafka.streams.processor.internals.ProcessorTopologyTest > testDrivingStatefulTopology PASSED
org.apache.kafka.streams.processor.internals.ProcessorTopologyTest > testDrivingSimpleTopology STARTED
org.apache.kafka.streams.processor.internals.ProcessorTopologyTest > testDrivingSimpleTopology PASSED
org.apache.kafka.streams.processor.internals.ProcessorTopologyTest > testTopologyMetadata STARTED
org.apache.kafka.streams.processor.internals.ProcessorTopologyTest > testTopologyMetadata PASSED
org.apache.kafka.streams.processor.internals.ProcessorTopologyTest > testDrivingMultiplexByNameTopology STARTED
org.apache.kafka.streams.processor.internals.ProcessorTopologyTest > testDrivingMultiplexByNameTopology PASSED
org.apache.kafka.streams.processor.internals.RecordCollectorTest > testSpecificPartition STARTED
org.apache.kafka.streams.processor.internals.RecordCollectorTest > testSpecificPartition PASSED
org.apache.kafka.streams.processor.internals.RecordCollectorTest > testStreamPartitioner STARTED
org.apache.kafka.streams.processor.internals.RecordCollectorTest > testStreamPartitioner PASSED
org.apache.kafka.streams.processor.internals.PunctuationQueueTest > testPunctuationInterval STARTED
org.apache.kafka.streams.processor.internals.PunctuationQueueTest > testPunctuationInterval PASSED
org.apache.kafka.streams.processor.internals.StreamPartitionAssignorTest > shouldThrowExceptionIfApplicationServerConfigIsNotHostPortPair STARTED
org.apache.kafka.streams.processor.internals.StreamPartitionAssignorTest > shouldThrowExceptionIfApplicationServerConfigIsNotHostPortPair PASSED
org.apache.kafka.streams.processor.internals.StreamPartitionAssignorTest > shouldMapUserEndPointToTopicPartitions STARTED
org.apache.kafka.streams.processor.internals.StreamPartitionAssignorTest > shouldMapUserEndPointToTopicPartitions PASSED
org.apache.kafka.streams.processor.internals.StreamPartitionAssignorTest > shouldAddUserDefinedEndPointToSubscription STARTED
org.apache.kafka.streams.processor.internals.StreamPartitionAssignorTest > shouldAddUserDefinedEndPointToSubscription PASSED
org.apache.kafka.streams.processor.internals.StreamPartitionAssignorTest > testAssignWithStandbyReplicas STARTED
org.apache.kafka.streams.processor.internals.StreamPartitionAssignorTest > testAssignWithStandbyReplicas PASSED
org.apache.kafka.streams.processor.internals.StreamPartitionAssignorTest > testAssignWithNewTasks STARTED
org.apache.kafka.streams.processor.internals.StreamPartitionAssignorTest > testAssignWithNewTasks PASSED
org.apache.kafka.streams.processor.internals.StreamPartitionAssignorTest > shouldExposeHostStateToTopicPartitionsOnAssignment STARTED
org.apache.kafka.streams.processor.internals.StreamPartitionAssignorTest > shouldExposeHostStateToTopicPartitionsOnAssignment PASSED
org.apache.kafka.streams.processor.internals.StreamPartitionAssignorTest > testAssignWithStates STARTED
org.apache.kafka.streams.processor.internals.StreamPartitionAssignorTest > testAssignWithStates PASSED
org.apache.kafka.streams.processor.internals.StreamPartitionAssignorTest > shouldThrowExceptionIfApplicationServerConfigPortIsNotAnInteger STARTED
org.apache.kafka.streams.processor.internals.StreamPartitionAssignorTest > shouldThrowExceptionIfApplicationServerConfigPortIsNotAnInteger PASSED
org.apache.kafka.streams.processor.internals.StreamPartitionAssignorTest > testAssignBasic STARTED
org.apache.kafka.streams.processor.internals.StreamPartitionAssignorTest > testAssignBasic PASSED
org.apache.kafka.streams.processor.internals.StreamPartitionAssignorTest > testOnAssignment STARTED
org.apache.kafka.streams.processor.internals.StreamPartitionAssignorTest > testOnAssignment PASSED
org.apache.kafka.streams.processor.internals.StreamPartitionAssignorTest > testAssignWithInternalTopicThatsSourceIsAnotherInternalTopic STARTED
org.apache.kafka.streams.processor.internals.StreamPartitionAssignorTest > testAssignWithInternalTopicThatsSourceIsAnotherInternalTopic PASSED
org.apache.kafka.streams.processor.internals.StreamPartitionAssignorTest > testSubscription STARTED
org.apache.kafka.streams.processor.internals.StreamPartitionAssignorTest > testSubscription PASSED
org.apache.kafka.streams.processor.internals.StreamPartitionAssignorTest > testAssignWithInternalTopics STARTED
org.apache.kafka.streams.processor.internals.StreamPartitionAssignorTest > testAssignWithInternalTopics PASSED
org.apache.kafka.streams.processor.internals.StreamsMetadataStateTest > shouldGetInstancesForStoreName STARTED
org.apache.kafka.streams.processor.internals.StreamsMetadataStateTest > shouldGetInstancesForStoreName PASSED
org.apache.kafka.streams.processor.internals.StreamsMetadataStateTest > shouldThrowWhenSerializerIsNull STARTED
org.apache.kafka.streams.processor.internals.StreamsMetadataStateTest > shouldThrowWhenSerializerIsNull PASSED
org.apache.kafka.streams.processor.internals.StreamsMetadataStateTest > shouldGetAllStreamInstances STARTED
org.apache.kafka.streams.processor.internals.StreamsMetadataStateTest > shouldGetAllStreamInstances PASSED
org.apache.kafka.streams.processor.internals.StreamsMetadataStateTest > shouldGetInstanceWithKey STARTED
org.apache.kafka.streams.processor.internals.StreamsMetadataStateTest > shouldGetInstanceWithKey PASSED
org.apache.kafka.streams.processor.internals.StreamsMetadataStateTest > shouldGetAllStreamsInstancesWithNoStores STARTED
org.apache.kafka.streams.processor.internals.StreamsMetadataStateTest > shouldGetAllStreamsInstancesWithNoStores PASSED
org.apache.kafka.streams.processor.internals.StreamsMetadataStateTest > shouldThrowWhenKeyIsNull STARTED
org.apache.kafka.streams.processor.internals.StreamsMetadataStateTest > shouldThrowWhenKeyIsNull PASSED
org.apache.kafka.streams.processor.internals.StreamsMetadataStateTest > shouldGetInstanceWithKeyWithMergedStreams STARTED
org.apache.kafka.streams.processor.internals.StreamsMetadataStateTest > shouldGetInstanceWithKeyWithMergedStreams PASSED
org.apache.kafka.streams.processor.internals.StreamsMetadataStateTest > shouldThrowIfStoreNameIsNull STARTED
org.apache.kafka.streams.processor.internals.StreamsMetadataStateTest > shouldThrowIfStoreNameIsNull PASSED
org.apache.kafka.streams.processor.internals.StreamsMetadataStateTest > shouldReturnEmptyCollectionOnGetAllInstancesWithStoreWhenStoreDoesntExist STARTED
org.apache.kafka.streams.processor.internals.StreamsMetadataStateTest > shouldReturnEmptyCollectionOnGetAllInstancesWithStoreWhenStoreDoesntExist PASSED
org.apache.kafka.streams.processor.internals.StreamsMetadataStateTest > shouldReturnNullOnGetWithKeyWhenStoreDoesntExist STARTED
org.apache.kafka.streams.processor.internals.StreamsMetadataStateTest > shouldReturnNullOnGetWithKeyWhenStoreDoesntExist PASSED
org.apache.kafka.streams.processor.internals.StreamsMetadataStateTest > shouldThrowIfStreamPartitionerIsNull STARTED
org.apache.kafka.streams.processor.internals.StreamsMetadataStateTest > shouldThrowIfStreamPartitionerIsNull PASSED
org.apache.kafka.streams.processor.internals.StreamsMetadataStateTest > shouldGetInstanceWithKeyAndCustomPartitioner STARTED
org.apache.kafka.streams.processor.internals.StreamsMetadataStateTest > shouldGetInstanceWithKeyAndCustomPartitioner PASSED
org.apache.kafka.streams.processor.internals.StreamsMetadataStateTest > shouldThrowIfStoreNameIsNullOnGetAllInstancesWithStore STARTED
org.apache.kafka.streams.processor.internals.StreamsMetadataStateTest > shouldThrowIfStoreNameIsNullOnGetAllInstancesWithStore PASSED
org.apache.kafka.streams.KafkaStreamsTest > shouldNotGetAllTasksWhenNotRunning STARTED
org.apache.kafka.streams.KafkaStreamsTest > shouldNotGetAllTasksWhenNotRunning PASSED
org.apache.kafka.streams.KafkaStreamsTest > shouldNotGetTaskWithKeyAndPartitionerWhenNotRunning STARTED
org.apache.kafka.streams.KafkaStreamsTest > shouldNotGetTaskWithKeyAndPartitionerWhenNotRunning PASSED
org.apache.kafka.streams.KafkaStreamsTest > shouldNotGetTaskWithKeyAndSerializerWhenNotRunning STARTED
org.apache.kafka.streams.KafkaStreamsTest > shouldNotGetTaskWithKeyAndSerializerWhenNotRunning PASSED
org.apache.kafka.streams.KafkaStreamsTest > shouldNotGetAllTasksWithStoreWhenNotRunning STARTED
org.apache.kafka.streams.KafkaStreamsTest > shouldNotGetAllTasksWithStoreWhenNotRunning PASSED
org.apache.kafka.streams.KafkaStreamsTest > testCannotStartOnceClosed STARTED
org.apache.kafka.streams.KafkaStreamsTest > testCannotStartOnceClosed PASSED
org.apache.kafka.streams.KafkaStreamsTest > testCleanup STARTED
org.apache.kafka.streams.KafkaStreamsTest > testCleanup PASSED
org.apache.kafka.streams.KafkaStreamsTest > testCleanupIsolation STARTED
org.apache.kafka.streams.KafkaStreamsTest > testCleanupIsolation PASSED
org.apache.kafka.streams.KafkaStreamsTest > testStartAndClose STARTED
org.apache.kafka.streams.KafkaStreamsTest > testStartAndClose PASSED
org.apache.kafka.streams.KafkaStreamsTest > testCloseIsIdempotent STARTED
org.apache.kafka.streams.KafkaStreamsTest > testCloseIsIdempotent PASSED
org.apache.kafka.streams.KafkaStreamsTest > testCannotCleanupWhileRunning STARTED
org.apache.kafka.streams.KafkaStreamsTest > testCannotCleanupWhileRunning PASSED
org.apache.kafka.streams.KafkaStreamsTest > testCannotStartTwice STARTED
org.apache.kafka.streams.KafkaStreamsTest > testCannotStartTwice PASSED
org.apache.kafka.streams.KeyValueTest > shouldHaveSaneEqualsAndHashCode STARTED
org.apache.kafka.streams.KeyValueTest > shouldHaveSaneEqualsAndHashCode PASSED
354 tests completed, 1 failed
:streams:test FAILED
FAILURE: Build failed with an exception.
* What went wrong:
Execution failed for task ':streams:test'.
> There were failing tests. See the report at: file://<https://builds.apache.org/job/kafka-trunk-jdk8/ws/streams/build/reports/tests/index.html>
* Try:
Run with --stacktrace option to get the stack trace. Run with --info or --debug option to get more log output.
BUILD FAILED
Total time: 2 hrs 20 mins 21.841 secs
Build step 'Execute shell' marked build as failure
Recording test results
Setting GRADLE_2_4_RC_2_HOME=/home/jenkins/jenkins-slave/tools/hudson.plugins.gradle.GradleInstallation/Gradle_2.4-rc-2
Setting GRADLE_2_4_RC_2_HOME=/home/jenkins/jenkins-slave/tools/hudson.plugins.gradle.GradleInstallation/Gradle_2.4-rc-2