You are viewing a plain text version of this content. The canonical link for it is here.
Posted to commits@sling.apache.org by Apache Jenkins Server <je...@builds.apache.org> on 2017/03/09 14:32:39 UTC
Build failed in Jenkins: sling-contrib-scripting-freemarker-1.8 #17
See <https://builds.apache.org/job/sling-contrib-scripting-freemarker-1.8/17/display/redirect?page=changes>
Changes:
[olli] SLING-5689 Use Version (incompatible improvements)
use Version from FreeMarker's Configuration also for Scripting's language version
[olli] fix assertions
------------------------------------------
Started by an SCM change
Started by an SCM change
[EnvInject] - Loading node environment variables.
Building remotely on H22 (ubuntu) in workspace <https://builds.apache.org/job/sling-contrib-scripting-freemarker-1.8/ws/>
Updating https://svn.apache.org/repos/asf/sling/trunk/contrib/scripting/freemarker at revision '2017-03-09T14:31:06.352 +0000'
U src/test/java/org/apache/sling/scripting/freemarker/it/tests/FreemarkerScriptEngineFactoryIT.java
U src/main/java/org/apache/sling/scripting/freemarker/internal/FreemarkerScriptEngine.java
U src/main/java/org/apache/sling/scripting/freemarker/internal/FreemarkerScriptEngineFactory.java
At revision 1786183
Parsing POMs
Established TCP socket on 41739
maven33-agent.jar already up to date
maven33-interceptor.jar already up to date
maven3-interceptor-commons.jar already up to date
[sling-contrib-scripting-freemarker-1.8] $ /home/jenkins/tools/java/latest1.8/bin/java -Xmx2g -Xms256m -cp /home/jenkins/jenkins-slave/maven33-agent.jar:/home/jenkins/tools/maven/apache-maven-3.3.9/boot/plexus-classworlds-2.5.2.jar:/home/jenkins/tools/maven/apache-maven-3.3.9/conf/logging jenkins.maven3.agent.Maven33Main /home/jenkins/tools/maven/apache-maven-3.3.9 /home/jenkins/jenkins-slave/slave.jar /home/jenkins/jenkins-slave/maven33-interceptor.jar /home/jenkins/jenkins-slave/maven3-interceptor-commons.jar 41739
<===[JENKINS REMOTING CAPACITY]===> channel started
Executing Maven: -B -f <https://builds.apache.org/job/sling-contrib-scripting-freemarker-1.8/ws/pom.xml> -Dmaven.repo.local=/home/jenkins/jenkins-slave/maven-repositories/1 -U clean deploy
[INFO] Scanning for projects...
[INFO]
[INFO] ------------------------------------------------------------------------
[INFO] Building Apache Sling Scripting FreeMarker 1.0.0-SNAPSHOT
[INFO] ------------------------------------------------------------------------
[INFO] Downloading: http://repository.apache.org/snapshots/org/apache/sling/org.apache.sling.resource.presence/0.0.1-SNAPSHOT/maven-metadata.xml
[INFO] Downloading: http://repository.apache.org/snapshots/org/apache/sling/org.apache.sling.resource.presence/0.0.1-SNAPSHOT/org.apache.sling.resource.presence-0.0.1-SNAPSHOT.pom
[WARNING] The POM for org.apache.sling:org.apache.sling.resource.presence:jar:0.0.1-SNAPSHOT is missing, no dependency information available
[INFO] Downloading: http://repository.apache.org/snapshots/org/apache/sling/org.apache.sling.testing.paxexam/0.0.3-SNAPSHOT/maven-metadata.xml
[INFO] Downloaded: http://repository.apache.org/snapshots/org/apache/sling/org.apache.sling.testing.paxexam/0.0.3-SNAPSHOT/maven-metadata.xml (1016 B at 2.6 KB/sec)
[INFO] Downloading: http://repository.apache.org/snapshots/org/apache/sling/org.apache.sling.testing.paxexam/0.0.3-SNAPSHOT/org.apache.sling.testing.paxexam-0.0.3-20170304.141325-19.pom
[INFO] Downloaded: http://repository.apache.org/snapshots/org/apache/sling/org.apache.sling.testing.paxexam/0.0.3-SNAPSHOT/org.apache.sling.testing.paxexam-0.0.3-20170304.141325-19.pom (6 KB at 12.9 KB/sec)
[INFO] Downloading: http://repository.apache.org/snapshots/org/apache/sling/org.apache.sling.resource.presence/0.0.1-SNAPSHOT/org.apache.sling.resource.presence-0.0.1-SNAPSHOT.jar
[INFO] Downloading: http://repository.apache.org/snapshots/org/apache/sling/org.apache.sling.testing.paxexam/0.0.3-SNAPSHOT/org.apache.sling.testing.paxexam-0.0.3-20170304.141325-19.jar
[INFO] Downloaded: http://repository.apache.org/snapshots/org/apache/sling/org.apache.sling.testing.paxexam/0.0.3-SNAPSHOT/org.apache.sling.testing.paxexam-0.0.3-20170304.141325-19.jar (30 KB at 63.4 KB/sec)
[JENKINS] Archiving disabled
[JENKINS] Archiving disabled
[INFO] ------------------------------------------------------------------------
[INFO] BUILD FAILURE
[INFO] ------------------------------------------------------------------------
[INFO] Total time: 19.546 s
[INFO] Finished at: 2017-03-09T14:32:32+00:00
[INFO] Final Memory: 20M/299M
[INFO] ------------------------------------------------------------------------
Waiting for Jenkins to finish collecting data
[ERROR] Failed to execute goal on project org.apache.sling.scripting.freemarker: Could not resolve dependencies for project org.apache.sling:org.apache.sling.scripting.freemarker:bundle:1.0.0-SNAPSHOT: Could not find artifact org.apache.sling:org.apache.sling.resource.presence:jar:0.0.1-SNAPSHOT in Nexus (http://repository.apache.org/snapshots) -> [Help 1]
[ERROR]
[ERROR] To see the full stack trace of the errors, re-run Maven with the -e switch.
[ERROR] Re-run Maven using the -X switch to enable full debug logging.
[ERROR]
[ERROR] For more information about the errors and possible solutions, please read the following articles:
[ERROR] [Help 1] http://cwiki.apache.org/confluence/display/MAVEN/DependencyResolutionException
channel stopped
Recording test results
Jenkins build is back to normal :
sling-contrib-scripting-freemarker-1.8 #18
Posted by Apache Jenkins Server <je...@builds.apache.org>.
See <https://builds.apache.org/job/sling-contrib-scripting-freemarker-1.8/18/display/redirect>