You are viewing a plain text version of this content. The canonical link for it is here.
Posted to dev@geode.apache.org by Apache Jenkins Server <je...@builds.apache.org> on 2016/01/18 13:11:17 UTC

Build failed in Jenkins: Geode-nightly #350

See <https://builds.apache.org/job/Geode-nightly/350/>

------------------------------------------
[...truncated 388 lines...]
:gemfire-lucene:processResources
:gemfire-lucene:classes
:gemfire-lucene:jar
:gemfire-lucene:javadoc<https://builds.apache.org/job/Geode-nightly/ws/gemfire-lucene/src/main/java/com/gemstone/gemfire/cache/lucene/LuceneQueryFactory.java>:85: warning - @param argument "K" is not a parameter name.
<https://builds.apache.org/job/Geode-nightly/ws/gemfire-lucene/src/main/java/com/gemstone/gemfire/cache/lucene/LuceneQueryFactory.java>:85: warning - @param argument "V" is not a parameter name.
<https://builds.apache.org/job/Geode-nightly/ws/gemfire-lucene/src/main/java/com/gemstone/gemfire/cache/lucene/LuceneQueryFactory.java>:100: warning - Tag @link: reference not found: QueryDeserializer
<https://builds.apache.org/job/Geode-nightly/ws/gemfire-lucene/src/main/java/com/gemstone/gemfire/cache/lucene/LuceneQueryFactory.java>:100: warning - @param argument "K" is not a parameter name.
<https://builds.apache.org/job/Geode-nightly/ws/gemfire-lucene/src/main/java/com/gemstone/gemfire/cache/lucene/LuceneQueryFactory.java>:100: warning - @param argument "V" is not a parameter name.
<https://builds.apache.org/job/Geode-nightly/ws/gemfire-lucene/src/main/java/com/gemstone/gemfire/cache/lucene/LuceneQueryProvider.java>:44: warning - @param argument "The" is not a parameter name.
<https://builds.apache.org/job/Geode-nightly/ws/gemfire-lucene/src/main/java/com/gemstone/gemfire/cache/lucene/LuceneService.java>:72: warning - Tag @link: can't find getLuceneService() in com.gemstone.gemfire.cache.GemFireCache
<https://builds.apache.org/job/Geode-nightly/ws/gemfire-lucene/src/main/java/com/gemstone/gemfire/cache/lucene/LuceneService.java>:82: warning - @return tag cannot be used in method with void return type.
<https://builds.apache.org/job/Geode-nightly/ws/gemfire-lucene/src/main/java/com/gemstone/gemfire/cache/lucene/LuceneService.java>:94: warning - @return tag cannot be used in method with void return type.
<https://builds.apache.org/job/Geode-nightly/ws/gemfire-lucene/src/main/java/com/gemstone/gemfire/cache/lucene/LuceneQueryFactory.java>:100: warning - Tag @link: reference not found: QueryDeserializer
<https://builds.apache.org/job/Geode-nightly/ws/gemfire-lucene/src/main/java/com/gemstone/gemfire/cache/lucene/internal/repository/RepositoryManager.java>:44: warning - @param argument "localDataSet" is not a parameter name.

11 warnings
:gemfire-lucene:javadocJar
:gemfire-lucene:sourcesJar
:gemfire-lucene:signArchives SKIPPED
:gemfire-web:compileJava UP-TO-DATE
:gemfire-web:processResources UP-TO-DATE
:gemfire-web:classes UP-TO-DATE
:gemfire-web:javadoc UP-TO-DATE
:gemfire-web:javadocJar
:gemfire-web:sourcesJar
:gemfire-web:war
:gemfire-web:signArchives SKIPPED
:gemfire-web-api:compileJavaNote: Some input files use unchecked or unsafe operations.
Note: Recompile with -Xlint:unchecked for details.

:gemfire-web-api:processResources UP-TO-DATE
:gemfire-web-api:classes
:gemfire-web-api:jar
:gemfire-web-api:javadoc
:gemfire-web-api:javadocJar
:gemfire-web-api:sourcesJar
:gemfire-web-api:war
:gemfire-web-api:signArchives SKIPPED
:gemfire-assembly:distTar
:gemfire-assembly:distZip
:gemfire-assembly:srcDistTar
:gemfire-assembly:srcDistZip
:gemfire-assembly:signArchives SKIPPED
:gemfire-assembly:assemble
:rat
:gemfire-core:compileTestJava<https://builds.apache.org/job/Geode-nightly/ws/gemfire-core/src/test/java/com/gemstone/gemfire/cache30/MemLRUEvictionControllerDUnitTest.java>:22: warning: Unsafe is internal proprietary API and may be removed in a future release
import sun.misc.Unsafe;
               ^
<https://builds.apache.org/job/Geode-nightly/ws/gemfire-core/src/test/java/com/gemstone/gemfire/cache30/MemLRUEvictionControllerDUnitTest.java>:22: warning: Unsafe is internal proprietary API and may be removed in a future release
import sun.misc.Unsafe;
               ^
<https://builds.apache.org/job/Geode-nightly/ws/gemfire-core/src/test/java/com/gemstone/gemfire/cache30/MemLRUEvictionControllerDUnitTest.java>:22: warning: Unsafe is internal proprietary API and may be removed in a future release
import sun.misc.Unsafe;
               ^
Note: Some input files use or override a deprecated API.
Note: Recompile with -Xlint:deprecation for details.
Note: Some input files use unchecked or unsafe operations.
Note: Recompile with -Xlint:unchecked for details.
3 warnings

:gemfire-core:processTestResources
:gemfire-core:testClasses
:gemfire-core:jarTest
:gemfire-assembly:compileTestJavaNote: <https://builds.apache.org/job/Geode-nightly/ws/gemfire-assembly/src/test/java/com/gemstone/gemfire/management/internal/configuration/SharedConfigurationEndToEndDUnitTest.java> uses or overrides a deprecated API.
Note: Recompile with -Xlint:deprecation for details.

:gemfire-assembly:processTestResources UP-TO-DATE
:gemfire-assembly:testClasses
:gemfire-assembly:checkMissedTests
:gemfire-assembly:installDist
:gemfire-assembly:test
Build file '<https://builds.apache.org/job/Geode-nightly/ws/build.gradle'>: line 90
AvailablePortFinder has been deprecated and is scheduled to be removed in Gradle 3.0
:gemfire-assembly:check
:gemfire-assembly:build
:gemfire-assembly:distributedTest
:gemfire-assembly:integrationTest
:gemfire-common:assemble
:gemfire-common:compileTestJava
:gemfire-common:processTestResources UP-TO-DATE
:gemfire-common:testClasses
:gemfire-common:checkMissedTests
:gemfire-common:test
:gemfire-common:check
:gemfire-common:build
:gemfire-common:distributedTest
:gemfire-common:integrationTest
:gemfire-core:assemble
:gemfire-core:checkMissedTests
:gemfire-core:test

com.gemstone.gemfire.internal.offheap.LifecycleListenerJUnitTest > testCallbacksAreCalledAfterReuse FAILED
    java.lang.AssertionError: expected:<false> but was:<true>
        at org.junit.Assert.fail(Assert.java:88)
        at org.junit.Assert.failNotEquals(Assert.java:834)
        at org.junit.Assert.assertEquals(Assert.java:118)
        at org.junit.Assert.assertEquals(Assert.java:144)
        at com.gemstone.gemfire.internal.offheap.LifecycleListenerJUnitTest.testCallbacksAreCalledAfterReuse(LifecycleListenerJUnitTest.java:103)

com.gemstone.gemfire.internal.offheap.LifecycleListenerJUnitTest > testCallbacksAreCalledAfterReuseWithFreeTrue FAILED
    java.lang.AssertionError: expected:<false> but was:<true>
        at org.junit.Assert.fail(Assert.java:88)
        at org.junit.Assert.failNotEquals(Assert.java:834)
        at org.junit.Assert.assertEquals(Assert.java:118)
        at org.junit.Assert.assertEquals(Assert.java:144)
        at com.gemstone.gemfire.internal.offheap.LifecycleListenerJUnitTest.closeAndFree(LifecycleListenerJUnitTest.java:147)
        at com.gemstone.gemfire.internal.offheap.LifecycleListenerJUnitTest.testCallbacksAreCalledAfterReuseWithFreeTrue(LifecycleListenerJUnitTest.java:168)

com.gemstone.gemfire.internal.offheap.LifecycleListenerJUnitTest > testCallbacksAreCalledAfterCreate FAILED
    java.lang.AssertionError: expected:<false> but was:<true>
        at org.junit.Assert.fail(Assert.java:88)
        at org.junit.Assert.failNotEquals(Assert.java:834)
        at org.junit.Assert.assertEquals(Assert.java:118)
        at org.junit.Assert.assertEquals(Assert.java:144)
        at com.gemstone.gemfire.internal.offheap.LifecycleListenerJUnitTest.closeAndFree(LifecycleListenerJUnitTest.java:147)
        at com.gemstone.gemfire.internal.offheap.LifecycleListenerJUnitTest.testCallbacksAreCalledAfterCreate(LifecycleListenerJUnitTest.java:89)

1870 tests completed, 3 failed, 34 skipped
:gemfire-core:test FAILED
:gemfire-core:distributedTest
:gemfire-core:integrationTest
:gemfire-joptsimple:assemble
:gemfire-joptsimple:compileTestJava UP-TO-DATE
:gemfire-joptsimple:processTestResources UP-TO-DATE
:gemfire-joptsimple:testClasses UP-TO-DATE
:gemfire-joptsimple:checkMissedTests UP-TO-DATE
:gemfire-joptsimple:test UP-TO-DATE
:gemfire-joptsimple:check
:gemfire-joptsimple:build
:gemfire-joptsimple:distributedTest UP-TO-DATE
:gemfire-joptsimple:integrationTest UP-TO-DATE
:gemfire-json:assemble
:gemfire-json:compileTestJava UP-TO-DATE
:gemfire-json:processTestResources UP-TO-DATE
:gemfire-json:testClasses UP-TO-DATE
:gemfire-json:checkMissedTests UP-TO-DATE
:gemfire-json:test UP-TO-DATE
:gemfire-json:check
:gemfire-json:build
:gemfire-json:distributedTest UP-TO-DATE
:gemfire-json:integrationTest UP-TO-DATE
:gemfire-junit:jar
:gemfire-junit:javadoc UP-TO-DATE
:gemfire-junit:javadocJar
:gemfire-junit:sourcesJar
:gemfire-junit:signArchives SKIPPED
:gemfire-junit:assemble
:gemfire-junit:checkMissedTests
:gemfire-junit:test
:gemfire-junit:check
:gemfire-junit:build
:gemfire-junit:distributedTest
:gemfire-junit:integrationTest
:gemfire-lucene:assemble
:gemfire-lucene:compileTestJavaNote: <https://builds.apache.org/job/Geode-nightly/ws/gemfire-lucene/src/test/java/com/gemstone/gemfire/cache/lucene/internal/distributed/LuceneFunctionJUnitTest.java> uses or overrides a deprecated API.
Note: Recompile with -Xlint:deprecation for details.
Note: Some input files use unchecked or unsafe operations.
Note: Recompile with -Xlint:unchecked for details.

:gemfire-lucene:processTestResources
:gemfire-lucene:testClasses
:gemfire-lucene:checkMissedTests
:gemfire-lucene:test
:gemfire-lucene:check
:gemfire-lucene:build
:gemfire-lucene:distributedTest
:gemfire-lucene:integrationTest
:gemfire-rebalancer:compileJava
:gemfire-rebalancer:processResources UP-TO-DATE
:gemfire-rebalancer:classes
:gemfire-rebalancer:jar
:gemfire-rebalancer:javadoc<https://builds.apache.org/job/Geode-nightly/ws/gemfire-rebalancer/src/main/java/com/gemstone/gemfire/cache/util/AutoBalancer.java>:103: warning - AutoBalancer#DEFAULT_SIZE_THRESHOLD_PERCENT (referenced by @value tag) is an unknown reference.
<https://builds.apache.org/job/Geode-nightly/ws/gemfire-rebalancer/src/main/java/com/gemstone/gemfire/cache/util/AutoBalancer.java>:121: warning - AutoBalancer#DEFAULT_MINIMUM_SIZE (referenced by @value tag) is an unknown reference.

2 warnings
:gemfire-rebalancer:javadocJar
:gemfire-rebalancer:sourcesJar
:gemfire-rebalancer:signArchives SKIPPED
:gemfire-rebalancer:assemble
:gemfire-rebalancer:compileTestJava
:gemfire-rebalancer:processTestResources UP-TO-DATE
:gemfire-rebalancer:testClasses
:gemfire-rebalancer:checkMissedTests
:gemfire-rebalancer:test
:gemfire-rebalancer:check
:gemfire-rebalancer:build
:gemfire-rebalancer:distributedTest
:gemfire-rebalancer:integrationTest
:gemfire-web:assemble
:gemfire-web:compileTestJavaNote: <https://builds.apache.org/job/Geode-nightly/ws/gemfire-web/src/test/java/com/gemstone/gemfire/management/internal/web/AbstractWebTestCase.java> uses unchecked or unsafe operations.
Note: Recompile with -Xlint:unchecked for details.

:gemfire-web:processTestResources UP-TO-DATE
:gemfire-web:testClasses
:gemfire-web:checkMissedTests
:gemfire-web:test
:gemfire-web:check
:gemfire-web:build
:gemfire-web:distributedTest
:gemfire-web:integrationTest
:gemfire-web-api:assemble
:gemfire-web-api:compileTestJava UP-TO-DATE
:gemfire-web-api:processTestResources UP-TO-DATE
:gemfire-web-api:testClasses UP-TO-DATE
:gemfire-web-api:checkMissedTests UP-TO-DATE
:gemfire-web-api:test UP-TO-DATE
:gemfire-web-api:check
:gemfire-web-api:build
:gemfire-web-api:distributedTest UP-TO-DATE
:gemfire-web-api:integrationTest UP-TO-DATE
:combineReports
All test reports at <https://builds.apache.org/job/Geode-nightly/ws/build/reports/combined>
:gemfire-assembly:precheckin
:gemfire-common:precheckin
:gemfire-joptsimple:precheckin
:gemfire-json:precheckin
:gemfire-junit:precheckin
:gemfire-lucene:precheckin
:gemfire-rebalancer:precheckin
:gemfire-web:precheckin
:gemfire-web-api:precheckin
:gemfire-assembly:uploadArchives
:gemfire-common:uploadArchives
:gemfire-core:uploadArchives
:gemfire-joptsimple:uploadArchives
:gemfire-json:uploadArchives
:gemfire-junit:uploadArchives
:gemfire-lucene:uploadArchives
:gemfire-rebalancer:uploadArchives
:gemfire-web:uploadArchives
:gemfire-web-api:uploadArchives

FAILURE: Build failed with an exception.

* What went wrong:
Execution failed for task ':gemfire-core:test'.
> There were failing tests. See the report at: file://<https://builds.apache.org/job/Geode-nightly/ws/gemfire-core/build/reports/test/index.html>

* Try:
Run with --stacktrace option to get the stack trace. Run with --info or --debug option to get more log output.

BUILD FAILED

Total time: 8 hrs 27 mins 4.034 secs
Build step 'Invoke Gradle script' changed build result to FAILURE
Build step 'Invoke Gradle script' marked build as failure
Archiving artifacts
Compressed 494.31 MB of artifacts by 39.7% relative to #349
Recording test results

Jenkins build is back to normal : Geode-nightly #353

Posted by Apache Jenkins Server <je...@builds.apache.org>.
See <https://builds.apache.org/job/Geode-nightly/353/changes>


Re: Build failed in Jenkins: Geode-nightly #352

Posted by Anthony Baker <ab...@pivotal.io>.
Looks like the build script should check for the presence of the settings.xml file:

if (settingsXml.exists()) {
   …
}

Of course, the uploadArchives task will still fail since there are no credentials available when uploading into the Maven repository.

Anthony


> On Jan 20, 2016, at 9:03 AM, Kirk Lund <kl...@pivotal.io> wrote:
> 
> Root cause of our nightly build failure appears to be an environment
> problem:
> 
> Caused by: java.io.FileNotFoundException: /home/jenkins/.m2/settings.xml
> (No such file or directory)
> 
> -Kirk
> 
> ---------- Forwarded message ----------
> From: Apache Jenkins Server <je...@builds.apache.org>
> Date: Tue, Jan 19, 2016 at 7:52 PM
> Subject: Build failed in Jenkins: Geode-nightly #352
> To: dev@geode.incubator.apache.org, klund@pivotal.io, hkhamesra@pivotal.io,
> dschneider@pivotal.io, upthewaterspout@apache.org, bschuchardt@pivotal.io
> 
> 
> See <https://builds.apache.org/job/Geode-nightly/352/changes>
> 
> Changes:
> 
> [bschuchardt] Converting FilterProfile to use CopyOnWrite collections
> 
> [bschuchardt] Removing label from continues in AbstractRegionMap
> 
> [bschuchardt] refactoring RegionVersionHolder.recordVersion()
> 
> [bschuchardt] avoid invoking addOlderVersion for a version that isn't old
> 
> [dschneider] GEODE-783: add unit test for SyncChunkStack
> 
> [klund] Add Apache license header
> 
> [bschuchardt] added unit test category to RegionVersionHolder2JUnitTest
> 
> [upthewaterspout] GEODE-601: Fix intermittent exception in
> DiskRegionJUnitTest.
> 
> [upthewaterspout] GEODE-797: Adding an encoding=UTF-8 to javadocs
> 
> ------------------------------------------
> [...truncated 1832 lines...]
>> git init <https://builds.apache.org/job/Geode-nightly/ws/> # timeout=10
> Fetching upstream changes from
> https://git-wip-us.apache.org/repos/asf/incubator-geode.git
>> git --version # timeout=10
>> git -c core.askpass=true fetch --tags --progress
> https://git-wip-us.apache.org/repos/asf/incubator-geode.git
> +refs/heads/*:refs/remotes/origin/*
>> git config remote.origin.url
> https://git-wip-us.apache.org/repos/asf/incubator-geode.git # timeout=10
>> git config --add remote.origin.fetch +refs/heads/*:refs/remotes/origin/*
> # timeout=10
>> git config remote.origin.url
> https://git-wip-us.apache.org/repos/asf/incubator-geode.git # timeout=10
> Fetching upstream changes from
> https://git-wip-us.apache.org/repos/asf/incubator-geode.git
>> git -c core.askpass=true fetch --tags --progress
> https://git-wip-us.apache.org/repos/asf/incubator-geode.git
> +refs/heads/*:refs/remotes/origin/*
>> git rev-parse refs/remotes/origin/develop^{commit} # timeout=10
>> git rev-parse refs/remotes/origin/origin/develop^{commit} # timeout=10
> Checking out Revision 731c668f41d3a6777d0e24ca13b434e55c18ca65
> (refs/remotes/origin/develop)
>> git config core.sparsecheckout # timeout=10
>> git checkout -f 731c668f41d3a6777d0e24ca13b434e55c18ca65 # timeout=10
>> git branch -a # timeout=10
>> git rev-parse remotes/origin/asf-site^{commit} # timeout=10
>> git rev-parse remotes/origin/asf/asf-site^{commit} # timeout=10
>> git rev-parse remotes/origin/develop^{commit} # timeout=10
>> git rev-parse remotes/origin/feature/GEODE-11^{commit} # timeout=10
>> git rev-parse remotes/origin/feature/GEODE-12^{commit} # timeout=10
>> git rev-parse remotes/origin/feature/GEODE-124^{commit} # timeout=10
>> git rev-parse remotes/origin/feature/GEODE-14^{commit} # timeout=10
>> git rev-parse remotes/origin/feature/GEODE-14-2^{commit} # timeout=10
>> git rev-parse remotes/origin/feature/GEODE-151^{commit} # timeout=10
>> git rev-parse remotes/origin/feature/GEODE-16^{commit} # timeout=10
>> git rev-parse remotes/origin/feature/GEODE-160^{commit} # timeout=10
>> git rev-parse remotes/origin/feature/GEODE-17^{commit} # timeout=10
>> git rev-parse remotes/origin/feature/GEODE-178^{commit} # timeout=10
>> git rev-parse remotes/origin/feature/GEODE-189^{commit} # timeout=10
>> git rev-parse remotes/origin/feature/GEODE-217^{commit} # timeout=10
>> git rev-parse remotes/origin/feature/GEODE-227^{commit} # timeout=10
>> git rev-parse remotes/origin/feature/GEODE-259^{commit} # timeout=10
>> git rev-parse remotes/origin/feature/GEODE-280^{commit} # timeout=10
>> git rev-parse remotes/origin/feature/GEODE-291^{commit} # timeout=10
>> git rev-parse remotes/origin/feature/GEODE-308^{commit} # timeout=10
>> git rev-parse remotes/origin/feature/GEODE-372^{commit} # timeout=10
>> git rev-parse remotes/origin/feature/GEODE-374^{commit} # timeout=10
>> git rev-parse remotes/origin/feature/GEODE-377^{commit} # timeout=10
>> git rev-parse remotes/origin/feature/GEODE-38^{commit} # timeout=10
>> git rev-parse remotes/origin/feature/GEODE-392^{commit} # timeout=10
>> git rev-parse remotes/origin/feature/GEODE-409^{commit} # timeout=10
>> git rev-parse remotes/origin/feature/GEODE-41^{commit} # timeout=10
>> git rev-parse remotes/origin/feature/GEODE-417^{commit} # timeout=10
>> git rev-parse remotes/origin/feature/GEODE-438^{commit} # timeout=10
>> git rev-parse remotes/origin/feature/GEODE-500^{commit} # timeout=10
>> git rev-parse remotes/origin/feature/GEODE-53^{commit} # timeout=10
>> git rev-parse remotes/origin/feature/GEODE-54^{commit} # timeout=10
>> git rev-parse remotes/origin/feature/GEODE-542^{commit} # timeout=10
>> git rev-parse remotes/origin/feature/GEODE-544^{commit} # timeout=10
>> git rev-parse remotes/origin/feature/GEODE-546^{commit} # timeout=10
>> git rev-parse remotes/origin/feature/GEODE-563^{commit} # timeout=10
>> git rev-parse remotes/origin/feature/GEODE-574^{commit} # timeout=10
>> git rev-parse remotes/origin/feature/GEODE-578^{commit} # timeout=10
>> git rev-parse remotes/origin/feature/GEODE-580^{commit} # timeout=10
>> git rev-parse remotes/origin/feature/GEODE-584^{commit} # timeout=10
>> git rev-parse remotes/origin/feature/GEODE-607^{commit} # timeout=10
>> git rev-parse remotes/origin/feature/GEODE-608^{commit} # timeout=10
>> git rev-parse remotes/origin/feature/GEODE-610^{commit} # timeout=10
>> git rev-parse remotes/origin/feature/GEODE-611^{commit} # timeout=10
>> git rev-parse remotes/origin/feature/GEODE-622^{commit} # timeout=10
>> git rev-parse remotes/origin/feature/GEODE-637^{commit} # timeout=10
>> git rev-parse remotes/origin/feature/GEODE-678^{commit} # timeout=10
>> git rev-parse remotes/origin/feature/GEODE-681^{commit} # timeout=10
>> git rev-parse remotes/origin/feature/GEODE-714^{commit} # timeout=10
>> git rev-parse remotes/origin/feature/GEODE-715^{commit} # timeout=10
>> git rev-parse remotes/origin/feature/GEODE-77^{commit} # timeout=10
>> git rev-parse remotes/origin/feature/GEODE-78^{commit} # timeout=10
>> git rev-parse remotes/origin/feature/GEODE-781^{commit} # timeout=10
>> git rev-parse remotes/origin/feature/GEODE-79^{commit} # timeout=10
>> git rev-parse remotes/origin/feature/GEODE-80^{commit} # timeout=10
>> git rev-parse remotes/origin/feature/wan_single_hop_wip^{commit} #
> timeout=10
>> git rev-parse remotes/origin/gh-wiki^{commit} # timeout=10
>> git rev-parse remotes/origin/master^{commit} # timeout=10
>> git rev-parse remotes/origin/release/1.0.0-incubating.M1^{commit} #
> timeout=10
>> git rev-parse remotes/origin/sga2^{commit} # timeout=10
>> git rev-parse remotes/origin/wan_cq_donation^{commit} # timeout=10
>> git checkout -b develop 731c668f41d3a6777d0e24ca13b434e55c18ca65
>> git rev-list 6e6861d142d69c8dea098eb2e9fc2b5b47e1c769 # timeout=10
> [Gradle] - Launching build.
> [Geode-nightly] $ <https://builds.apache.org/job/Geode-nightly/ws/gradlew>
> --no-daemon clean precheckin distTar distZip uploadArchives
> Downloading https://services.gradle.org/distributions/gradle-2.8-bin.zip
> .........................................................................................................................................................................................................................................................................................................................................................................................................................................................................................................................................................................................................................................................................................................................................................................................................................................................................................................................................................................................................................................................................................................................................................................................................................................................................................................................................................................................................................................................................................................................................................................................................................................................................................................................................................................................................................................................................................................................................................................................................................................................................................................................................................................................................................................................................................................................
> Unzipping <
> https://builds.apache.org/job/Geode-nightly/ws/wrapper/dists/gradle-2.8-bin/4rsda7i357a5ogdj89yq8dntm/gradle-2.8-bin.zip>
> to <
> https://builds.apache.org/job/Geode-nightly/ws/wrapper/dists/gradle-2.8-bin/4rsda7i357a5ogdj89yq8dntm
>> 
> Set executable permissions for: <
> https://builds.apache.org/job/Geode-nightly/ws/wrapper/dists/gradle-2.8-bin/4rsda7i357a5ogdj89yq8dntm/gradle-2.8/bin/gradle
>> 
> To honour the JVM settings for this build a new JVM will be forked. Please
> consider using the daemon:
> https://docs.gradle.org/2.8/userguide/gradle_daemon.html.
> Download
> https://plugins.gradle.org/m2/gradle/plugin/org/nosphere/apache/creadur-rat-gradle/0.2.0/creadur-rat-gradle-0.2.0.pom
> Download
> https://plugins.gradle.org/m2/org/ajoberstar/gradle-git/1.3.2/gradle-git-1.3.2.pom
> Download
> https://plugins.gradle.org/m2/com/bmuschko/gradle-nexus-plugin/2.3.1/gradle-nexus-plugin-2.3.1.pom
> Download
> https://plugins.gradle.org/m2/org/ajoberstar/grgit/1.4.1/grgit-1.4.1.pom
> Download
> https://plugins.gradle.org/m2/com/github/zafarkhaja/java-semver/0.9.0/java-semver-0.9.0.pom
> Download
> https://plugins.gradle.org/m2/org/sonatype/oss/oss-parent/9/oss-parent-9.pom
> Download
> https://plugins.gradle.org/m2/org/eclipse/jgit/org.eclipse.jgit/4.0.1.201506240215-r/org.eclipse.jgit-4.0.1.201506240215-r.pom
> Download
> https://plugins.gradle.org/m2/org/eclipse/jgit/org.eclipse.jgit-parent/4.0.1.201506240215-r/org.eclipse.jgit-parent-4.0.1.201506240215-r.pom
> Download
> https://plugins.gradle.org/m2/org/eclipse/jgit/org.eclipse.jgit.ui/4.0.1.201506240215-r/org.eclipse.jgit.ui-4.0.1.201506240215-r.pom
> Download
> https://plugins.gradle.org/m2/com/jcraft/jsch.agentproxy.jsch/0.0.9/jsch.agentproxy.jsch-0.0.9.pom
> Download
> https://plugins.gradle.org/m2/com/jcraft/jsch.agentproxy/0.0.9/jsch.agentproxy-0.0.9.pom
> Download
> https://plugins.gradle.org/m2/org/sonatype/oss/oss-parent/6/oss-parent-6.pom
> Download
> https://plugins.gradle.org/m2/com/jcraft/jsch.agentproxy.pageant/0.0.9/jsch.agentproxy.pageant-0.0.9.pom
> Download
> https://plugins.gradle.org/m2/com/jcraft/jsch.agentproxy.sshagent/0.0.9/jsch.agentproxy.sshagent-0.0.9.pom
> Download
> https://plugins.gradle.org/m2/com/jcraft/jsch.agentproxy.usocket-jna/0.0.9/jsch.agentproxy.usocket-jna-0.0.9.pom
> Download
> https://plugins.gradle.org/m2/com/jcraft/jsch.agentproxy.usocket-nc/0.0.9/jsch.agentproxy.usocket-nc-0.0.9.pom
> Download
> https://plugins.gradle.org/m2/org/slf4j/slf4j-api/1.7.12/slf4j-api-1.7.12.pom
> Download
> https://plugins.gradle.org/m2/org/slf4j/slf4j-parent/1.7.12/slf4j-parent-1.7.12.pom
> Download
> https://plugins.gradle.org/m2/com/jcraft/jsch/0.1.51/jsch-0.1.51.pom
> Download
> https://plugins.gradle.org/m2/com/googlecode/javaewah/JavaEWAH/0.7.9/JavaEWAH-0.7.9.pom
> Download
> https://plugins.gradle.org/m2/org/sonatype/oss/oss-parent/5/oss-parent-5.pom
> Download
> https://plugins.gradle.org/m2/org/apache/httpcomponents/httpclient/4.1.3/httpclient-4.1.3.pom
> Download
> https://plugins.gradle.org/m2/org/apache/httpcomponents/httpcomponents-client/4.1.3/httpcomponents-client-4.1.3.pom
> Download
> https://plugins.gradle.org/m2/org/apache/httpcomponents/project/5/project-5.pom
> Download
> https://plugins.gradle.org/m2/com/jcraft/jsch.agentproxy.core/0.0.9/jsch.agentproxy.core-0.0.9.pom
> Download
> https://plugins.gradle.org/m2/net/java/dev/jna/jna/4.1.0/jna-4.1.0.pom
> Download
> https://plugins.gradle.org/m2/net/java/dev/jna/jna-platform/4.1.0/jna-platform-4.1.0.pom
> Download
> https://plugins.gradle.org/m2/org/apache/httpcomponents/httpcore/4.1.4/httpcore-4.1.4.pom
> Download
> https://plugins.gradle.org/m2/org/apache/httpcomponents/httpcomponents-core/4.1.4/httpcomponents-core-4.1.4.pom
> Download
> https://plugins.gradle.org/m2/commons-logging/commons-logging/1.1.1/commons-logging-1.1.1.pom
> Download
> https://plugins.gradle.org/m2/org/apache/commons/commons-parent/5/commons-parent-5.pom
> Download https://plugins.gradle.org/m2/org/apache/apache/4/apache-4.pom
> Download
> https://plugins.gradle.org/m2/commons-codec/commons-codec/1.4/commons-codec-1.4.pom
> Download
> https://plugins.gradle.org/m2/org/apache/commons/commons-parent/11/commons-parent-11.pom
> Download
> https://plugins.gradle.org/m2/gradle/plugin/org/nosphere/apache/creadur-rat-gradle/0.2.0/creadur-rat-gradle-0.2.0.jar
> Download
> https://plugins.gradle.org/m2/org/ajoberstar/gradle-git/1.3.2/gradle-git-1.3.2.jar
> Download
> https://plugins.gradle.org/m2/com/bmuschko/gradle-nexus-plugin/2.3.1/gradle-nexus-plugin-2.3.1.jar
> Download
> https://plugins.gradle.org/m2/org/ajoberstar/grgit/1.4.1/grgit-1.4.1.jar
> Download
> https://plugins.gradle.org/m2/com/github/zafarkhaja/java-semver/0.9.0/java-semver-0.9.0.jar
> Download
> https://plugins.gradle.org/m2/org/eclipse/jgit/org.eclipse.jgit/4.0.1.201506240215-r/org.eclipse.jgit-4.0.1.201506240215-r.jar
> Download
> https://plugins.gradle.org/m2/org/eclipse/jgit/org.eclipse.jgit.ui/4.0.1.201506240215-r/org.eclipse.jgit.ui-4.0.1.201506240215-r.jar
> Download
> https://plugins.gradle.org/m2/com/jcraft/jsch.agentproxy.jsch/0.0.9/jsch.agentproxy.jsch-0.0.9.jar
> Download
> https://plugins.gradle.org/m2/com/jcraft/jsch.agentproxy.pageant/0.0.9/jsch.agentproxy.pageant-0.0.9.jar
> Download
> https://plugins.gradle.org/m2/com/jcraft/jsch.agentproxy.sshagent/0.0.9/jsch.agentproxy.sshagent-0.0.9.jar
> Download
> https://plugins.gradle.org/m2/com/jcraft/jsch.agentproxy.usocket-jna/0.0.9/jsch.agentproxy.usocket-jna-0.0.9.jar
> Download
> https://plugins.gradle.org/m2/com/jcraft/jsch.agentproxy.usocket-nc/0.0.9/jsch.agentproxy.usocket-nc-0.0.9.jar
> Download
> https://plugins.gradle.org/m2/org/slf4j/slf4j-api/1.7.12/slf4j-api-1.7.12.jar
> Download
> https://plugins.gradle.org/m2/com/jcraft/jsch/0.1.51/jsch-0.1.51.jar
> Download
> https://plugins.gradle.org/m2/com/googlecode/javaewah/JavaEWAH/0.7.9/JavaEWAH-0.7.9.jar
> Download
> https://plugins.gradle.org/m2/org/apache/httpcomponents/httpclient/4.1.3/httpclient-4.1.3.jar
> Download
> https://plugins.gradle.org/m2/com/jcraft/jsch.agentproxy.core/0.0.9/jsch.agentproxy.core-0.0.9.jar
> Download
> https://plugins.gradle.org/m2/net/java/dev/jna/jna/4.1.0/jna-4.1.0.jar
> Download
> https://plugins.gradle.org/m2/net/java/dev/jna/jna-platform/4.1.0/jna-platform-4.1.0.jar
> Download
> https://plugins.gradle.org/m2/org/apache/httpcomponents/httpcore/4.1.4/httpcore-4.1.4.jar
> Download
> https://plugins.gradle.org/m2/commons-logging/commons-logging/1.1.1/commons-logging-1.1.1.jar
> Download
> https://plugins.gradle.org/m2/commons-codec/commons-codec/1.4/commons-codec-1.4.jar
> Failed to notify ProjectEvaluationListener.afterEvaluate(), but primary
> configuration failure takes precedence.
> org.gradle.internal.event.ListenerNotificationException: Failed to notify
> project evaluation listener.
>        at
> org.gradle.internal.event.AbstractBroadcastDispatch.dispatch(AbstractBroadcastDispatch.java:55)
>        at
> org.gradle.internal.event.BroadcastDispatch.dispatch(BroadcastDispatch.java:79)
>        at
> org.gradle.internal.event.BroadcastDispatch.dispatch(BroadcastDispatch.java:30)
>        at
> org.gradle.messaging.dispatch.ProxyDispatchAdapter$DispatchingInvocationHandler.invoke(ProxyDispatchAdapter.java:93)
>        at com.sun.proxy.$Proxy11.afterEvaluate(Unknown Source)
>        at
> org.gradle.configuration.project.LifecycleProjectEvaluator.notifyAfterEvaluate(LifecycleProjectEvaluator.java:67)
>        at
> org.gradle.configuration.project.LifecycleProjectEvaluator.evaluate(LifecycleProjectEvaluator.java:61)
>        at
> org.gradle.api.internal.project.AbstractProject.evaluate(AbstractProject.java:499)
>        at
> org.gradle.api.internal.project.AbstractProject.evaluate(AbstractProject.java:86)
>        at
> org.gradle.execution.TaskPathProjectEvaluator.configureHierarchy(TaskPathProjectEvaluator.java:47)
>        at
> org.gradle.configuration.DefaultBuildConfigurer.configure(DefaultBuildConfigurer.java:35)
>        at
> org.gradle.initialization.DefaultGradleLauncher$2.run(DefaultGradleLauncher.java:125)
>        at org.gradle.internal.Factories$1.create(Factories.java:22)
>        at
> org.gradle.internal.progress.DefaultBuildOperationExecutor.run(DefaultBuildOperationExecutor.java:90)
>        at
> org.gradle.internal.progress.DefaultBuildOperationExecutor.run(DefaultBuildOperationExecutor.java:52)
>        at
> org.gradle.initialization.DefaultGradleLauncher.doBuildStages(DefaultGradleLauncher.java:122)
>        at
> org.gradle.initialization.DefaultGradleLauncher.access$200(DefaultGradleLauncher.java:32)
>        at
> org.gradle.initialization.DefaultGradleLauncher$1.create(DefaultGradleLauncher.java:99)
>        at
> org.gradle.initialization.DefaultGradleLauncher$1.create(DefaultGradleLauncher.java:93)
>        at
> org.gradle.internal.progress.DefaultBuildOperationExecutor.run(DefaultBuildOperationExecutor.java:90)
>        at
> org.gradle.internal.progress.DefaultBuildOperationExecutor.run(DefaultBuildOperationExecutor.java:62)
>        at
> org.gradle.initialization.DefaultGradleLauncher.doBuild(DefaultGradleLauncher.java:93)
>        at
> org.gradle.initialization.DefaultGradleLauncher.run(DefaultGradleLauncher.java:82)
>        at
> org.gradle.launcher.exec.InProcessBuildActionExecuter$DefaultBuildController.run(InProcessBuildActionExecuter.java:94)
>        at
> org.gradle.tooling.internal.provider.ExecuteBuildActionRunner.run(ExecuteBuildActionRunner.java:28)
>        at
> org.gradle.launcher.exec.ChainingBuildActionRunner.run(ChainingBuildActionRunner.java:35)
>        at
> org.gradle.launcher.exec.InProcessBuildActionExecuter.execute(InProcessBuildActionExecuter.java:43)
>        at
> org.gradle.launcher.exec.InProcessBuildActionExecuter.execute(InProcessBuildActionExecuter.java:28)
>        at
> org.gradle.launcher.exec.ContinuousBuildActionExecuter.execute(ContinuousBuildActionExecuter.java:77)
>        at
> org.gradle.launcher.exec.ContinuousBuildActionExecuter.execute(ContinuousBuildActionExecuter.java:47)
>        at
> org.gradle.launcher.daemon.server.exec.ExecuteBuild.doBuild(ExecuteBuild.java:52)
>        at
> org.gradle.launcher.daemon.server.exec.BuildCommandOnly.execute(BuildCommandOnly.java:36)
>        at
> org.gradle.launcher.daemon.server.api.DaemonCommandExecution.proceed(DaemonCommandExecution.java:120)
>        at
> org.gradle.launcher.daemon.server.exec.WatchForDisconnection.execute(WatchForDisconnection.java:37)
>        at
> org.gradle.launcher.daemon.server.api.DaemonCommandExecution.proceed(DaemonCommandExecution.java:120)
>        at
> org.gradle.launcher.daemon.server.exec.ResetDeprecationLogger.execute(ResetDeprecationLogger.java:26)
>        at
> org.gradle.launcher.daemon.server.api.DaemonCommandExecution.proceed(DaemonCommandExecution.java:120)
>        at
> org.gradle.launcher.daemon.server.exec.RequestStopIfSingleUsedDaemon.execute(RequestStopIfSingleUsedDaemon.java:34)
>        at
> org.gradle.launcher.daemon.server.api.DaemonCommandExecution.proceed(DaemonCommandExecution.java:120)
>        at
> org.gradle.launcher.daemon.server.exec.ForwardClientInput$2.call(ForwardClientInput.java:74)
>        at
> org.gradle.launcher.daemon.server.exec.ForwardClientInput$2.call(ForwardClientInput.java:72)
>        at org.gradle.util.Swapper.swap(Swapper.java:38)
>        at
> org.gradle.launcher.daemon.server.exec.ForwardClientInput.execute(ForwardClientInput.java:72)
>        at
> org.gradle.launcher.daemon.server.api.DaemonCommandExecution.proceed(DaemonCommandExecution.java:120)
>        at
> org.gradle.launcher.daemon.server.health.DaemonHealthTracker.execute(DaemonHealthTracker.java:40)
>        at
> org.gradle.launcher.daemon.server.api.DaemonCommandExecution.proceed(DaemonCommandExecution.java:120)
>        at
> org.gradle.launcher.daemon.server.exec.LogToClient.doBuild(LogToClient.java:66)
>        at
> org.gradle.launcher.daemon.server.exec.BuildCommandOnly.execute(BuildCommandOnly.java:36)
>        at
> org.gradle.launcher.daemon.server.api.DaemonCommandExecution.proceed(DaemonCommandExecution.java:120)
>        at
> org.gradle.launcher.daemon.server.exec.EstablishBuildEnvironment.doBuild(EstablishBuildEnvironment.java:71)
>        at
> org.gradle.launcher.daemon.server.exec.BuildCommandOnly.execute(BuildCommandOnly.java:36)
>        at
> org.gradle.launcher.daemon.server.api.DaemonCommandExecution.proceed(DaemonCommandExecution.java:120)
>        at
> org.gradle.launcher.daemon.server.health.HintGCAfterBuild.execute(HintGCAfterBuild.java:41)
>        at
> org.gradle.launcher.daemon.server.api.DaemonCommandExecution.proceed(DaemonCommandExecution.java:120)
>        at
> org.gradle.launcher.daemon.server.exec.StartBuildOrRespondWithBusy$1.run(StartBuildOrRespondWithBusy.java:50)
>        at
> org.gradle.launcher.daemon.server.DaemonStateCoordinator$1.run(DaemonStateCoordinator.java:246)
>        at
> org.gradle.internal.concurrent.ExecutorPolicy$CatchAndRecordFailures.onExecute(ExecutorPolicy.java:54)
>        at
> org.gradle.internal.concurrent.StoppableExecutorImpl$1.run(StoppableExecutorImpl.java:40)
>        at
> java.util.concurrent.ThreadPoolExecutor.runWorker(ThreadPoolExecutor.java:1142)
>        at
> java.util.concurrent.ThreadPoolExecutor$Worker.run(ThreadPoolExecutor.java:617)
>        at java.lang.Thread.run(Thread.java:745)
> Caused by: java.io.FileNotFoundException: /home/jenkins/.m2/settings.xml
> (No such file or directory)
>        at java.io.FileInputStream.open0(Native Method)
>        at java.io.FileInputStream.open(FileInputStream.java:195)
>        at java.io.FileInputStream.<init>(FileInputStream.java:138)
>        at groovy.util.XmlSlurper.parse(XmlSlurper.java:221)
>        at groovy.util.XmlSlurper$parse.call(Unknown Source)
>        at build_8nhqnxgvsda2ydhlda03q6ucd$_run_closure6$_closure50.doCall(<
> https://builds.apache.org/job/Geode-nightly/ws/build.gradle>:539)
>        at sun.reflect.NativeMethodAccessorImpl.invoke0(Native Method)
>        at
> sun.reflect.NativeMethodAccessorImpl.invoke(NativeMethodAccessorImpl.java:62)
>        at
> sun.reflect.DelegatingMethodAccessorImpl.invoke(DelegatingMethodAccessorImpl.java:43)
>        at java.lang.reflect.Method.invoke(Method.java:497)
>        at
> org.codehaus.groovy.reflection.CachedMethod.invoke(CachedMethod.java:93)
>        at groovy.lang.MetaMethod.doMethodInvoke(MetaMethod.java:325)
>        at
> org.codehaus.groovy.runtime.metaclass.ClosureMetaClass.invokeMethod(ClosureMetaClass.java:294)
>        at groovy.lang.MetaClassImpl.invokeMethod(MetaClassImpl.java:1019)
>        at groovy.lang.Closure.call(Closure.java:426)
>        at
> org.gradle.listener.ClosureBackedMethodInvocationDispatch.dispatch(ClosureBackedMethodInvocationDispatch.java:40)
>        at
> org.gradle.listener.ClosureBackedMethodInvocationDispatch.dispatch(ClosureBackedMethodInvocationDispatch.java:25)
>        at
> org.gradle.internal.event.AbstractBroadcastDispatch.dispatch(AbstractBroadcastDispatch.java:44)
>        ... 60 more
> 
> FAILURE: Build failed with an exception.
> 
> * Where:
> Build file '<https://builds.apache.org/job/Geode-nightly/ws/build.gradle'>
> line: 539
> 
> * What went wrong:
> A problem occurred evaluating project ':gemfire-assembly'.
>> Could not resolve all dependencies for configuration
> ':gemfire-assembly:runtime'.
>> A problem occurred configuring project ':gemfire-common'.
>> Failed to notify project evaluation listener.
>> /home/jenkins/.m2/settings.xml (No such file or directory)
> 
> * Try:
> Run with --stacktrace option to get the stack trace. Run with --info or
> --debug option to get more log output.
> 
> BUILD FAILED
> 
> Total time: 23.253 secs
> Build step 'Invoke Gradle script' changed build result to FAILURE
> Build step 'Invoke Gradle script' marked build as failure
> Archiving artifacts
> Recording test results
> ERROR: Publisher 'Publish JUnit test result report' failed: No test report
> files were found. Configuration error?


Fwd: Build failed in Jenkins: Geode-nightly #352

Posted by Kirk Lund <kl...@pivotal.io>.
Root cause of our nightly build failure appears to be an environment
problem:

Caused by: java.io.FileNotFoundException: /home/jenkins/.m2/settings.xml
(No such file or directory)

-Kirk

---------- Forwarded message ----------
From: Apache Jenkins Server <je...@builds.apache.org>
Date: Tue, Jan 19, 2016 at 7:52 PM
Subject: Build failed in Jenkins: Geode-nightly #352
To: dev@geode.incubator.apache.org, klund@pivotal.io, hkhamesra@pivotal.io,
dschneider@pivotal.io, upthewaterspout@apache.org, bschuchardt@pivotal.io


See <https://builds.apache.org/job/Geode-nightly/352/changes>

Changes:

[bschuchardt] Converting FilterProfile to use CopyOnWrite collections

[bschuchardt] Removing label from continues in AbstractRegionMap

[bschuchardt] refactoring RegionVersionHolder.recordVersion()

[bschuchardt] avoid invoking addOlderVersion for a version that isn't old

[dschneider] GEODE-783: add unit test for SyncChunkStack

[klund] Add Apache license header

[bschuchardt] added unit test category to RegionVersionHolder2JUnitTest

[upthewaterspout] GEODE-601: Fix intermittent exception in
DiskRegionJUnitTest.

[upthewaterspout] GEODE-797: Adding an encoding=UTF-8 to javadocs

------------------------------------------
[...truncated 1832 lines...]
 > git init <https://builds.apache.org/job/Geode-nightly/ws/> # timeout=10
Fetching upstream changes from
https://git-wip-us.apache.org/repos/asf/incubator-geode.git
 > git --version # timeout=10
 > git -c core.askpass=true fetch --tags --progress
https://git-wip-us.apache.org/repos/asf/incubator-geode.git
+refs/heads/*:refs/remotes/origin/*
 > git config remote.origin.url
https://git-wip-us.apache.org/repos/asf/incubator-geode.git # timeout=10
 > git config --add remote.origin.fetch +refs/heads/*:refs/remotes/origin/*
# timeout=10
 > git config remote.origin.url
https://git-wip-us.apache.org/repos/asf/incubator-geode.git # timeout=10
Fetching upstream changes from
https://git-wip-us.apache.org/repos/asf/incubator-geode.git
 > git -c core.askpass=true fetch --tags --progress
https://git-wip-us.apache.org/repos/asf/incubator-geode.git
+refs/heads/*:refs/remotes/origin/*
 > git rev-parse refs/remotes/origin/develop^{commit} # timeout=10
 > git rev-parse refs/remotes/origin/origin/develop^{commit} # timeout=10
Checking out Revision 731c668f41d3a6777d0e24ca13b434e55c18ca65
(refs/remotes/origin/develop)
 > git config core.sparsecheckout # timeout=10
 > git checkout -f 731c668f41d3a6777d0e24ca13b434e55c18ca65 # timeout=10
 > git branch -a # timeout=10
 > git rev-parse remotes/origin/asf-site^{commit} # timeout=10
 > git rev-parse remotes/origin/asf/asf-site^{commit} # timeout=10
 > git rev-parse remotes/origin/develop^{commit} # timeout=10
 > git rev-parse remotes/origin/feature/GEODE-11^{commit} # timeout=10
 > git rev-parse remotes/origin/feature/GEODE-12^{commit} # timeout=10
 > git rev-parse remotes/origin/feature/GEODE-124^{commit} # timeout=10
 > git rev-parse remotes/origin/feature/GEODE-14^{commit} # timeout=10
 > git rev-parse remotes/origin/feature/GEODE-14-2^{commit} # timeout=10
 > git rev-parse remotes/origin/feature/GEODE-151^{commit} # timeout=10
 > git rev-parse remotes/origin/feature/GEODE-16^{commit} # timeout=10
 > git rev-parse remotes/origin/feature/GEODE-160^{commit} # timeout=10
 > git rev-parse remotes/origin/feature/GEODE-17^{commit} # timeout=10
 > git rev-parse remotes/origin/feature/GEODE-178^{commit} # timeout=10
 > git rev-parse remotes/origin/feature/GEODE-189^{commit} # timeout=10
 > git rev-parse remotes/origin/feature/GEODE-217^{commit} # timeout=10
 > git rev-parse remotes/origin/feature/GEODE-227^{commit} # timeout=10
 > git rev-parse remotes/origin/feature/GEODE-259^{commit} # timeout=10
 > git rev-parse remotes/origin/feature/GEODE-280^{commit} # timeout=10
 > git rev-parse remotes/origin/feature/GEODE-291^{commit} # timeout=10
 > git rev-parse remotes/origin/feature/GEODE-308^{commit} # timeout=10
 > git rev-parse remotes/origin/feature/GEODE-372^{commit} # timeout=10
 > git rev-parse remotes/origin/feature/GEODE-374^{commit} # timeout=10
 > git rev-parse remotes/origin/feature/GEODE-377^{commit} # timeout=10
 > git rev-parse remotes/origin/feature/GEODE-38^{commit} # timeout=10
 > git rev-parse remotes/origin/feature/GEODE-392^{commit} # timeout=10
 > git rev-parse remotes/origin/feature/GEODE-409^{commit} # timeout=10
 > git rev-parse remotes/origin/feature/GEODE-41^{commit} # timeout=10
 > git rev-parse remotes/origin/feature/GEODE-417^{commit} # timeout=10
 > git rev-parse remotes/origin/feature/GEODE-438^{commit} # timeout=10
 > git rev-parse remotes/origin/feature/GEODE-500^{commit} # timeout=10
 > git rev-parse remotes/origin/feature/GEODE-53^{commit} # timeout=10
 > git rev-parse remotes/origin/feature/GEODE-54^{commit} # timeout=10
 > git rev-parse remotes/origin/feature/GEODE-542^{commit} # timeout=10
 > git rev-parse remotes/origin/feature/GEODE-544^{commit} # timeout=10
 > git rev-parse remotes/origin/feature/GEODE-546^{commit} # timeout=10
 > git rev-parse remotes/origin/feature/GEODE-563^{commit} # timeout=10
 > git rev-parse remotes/origin/feature/GEODE-574^{commit} # timeout=10
 > git rev-parse remotes/origin/feature/GEODE-578^{commit} # timeout=10
 > git rev-parse remotes/origin/feature/GEODE-580^{commit} # timeout=10
 > git rev-parse remotes/origin/feature/GEODE-584^{commit} # timeout=10
 > git rev-parse remotes/origin/feature/GEODE-607^{commit} # timeout=10
 > git rev-parse remotes/origin/feature/GEODE-608^{commit} # timeout=10
 > git rev-parse remotes/origin/feature/GEODE-610^{commit} # timeout=10
 > git rev-parse remotes/origin/feature/GEODE-611^{commit} # timeout=10
 > git rev-parse remotes/origin/feature/GEODE-622^{commit} # timeout=10
 > git rev-parse remotes/origin/feature/GEODE-637^{commit} # timeout=10
 > git rev-parse remotes/origin/feature/GEODE-678^{commit} # timeout=10
 > git rev-parse remotes/origin/feature/GEODE-681^{commit} # timeout=10
 > git rev-parse remotes/origin/feature/GEODE-714^{commit} # timeout=10
 > git rev-parse remotes/origin/feature/GEODE-715^{commit} # timeout=10
 > git rev-parse remotes/origin/feature/GEODE-77^{commit} # timeout=10
 > git rev-parse remotes/origin/feature/GEODE-78^{commit} # timeout=10
 > git rev-parse remotes/origin/feature/GEODE-781^{commit} # timeout=10
 > git rev-parse remotes/origin/feature/GEODE-79^{commit} # timeout=10
 > git rev-parse remotes/origin/feature/GEODE-80^{commit} # timeout=10
 > git rev-parse remotes/origin/feature/wan_single_hop_wip^{commit} #
timeout=10
 > git rev-parse remotes/origin/gh-wiki^{commit} # timeout=10
 > git rev-parse remotes/origin/master^{commit} # timeout=10
 > git rev-parse remotes/origin/release/1.0.0-incubating.M1^{commit} #
timeout=10
 > git rev-parse remotes/origin/sga2^{commit} # timeout=10
 > git rev-parse remotes/origin/wan_cq_donation^{commit} # timeout=10
 > git checkout -b develop 731c668f41d3a6777d0e24ca13b434e55c18ca65
 > git rev-list 6e6861d142d69c8dea098eb2e9fc2b5b47e1c769 # timeout=10
[Gradle] - Launching build.
[Geode-nightly] $ <https://builds.apache.org/job/Geode-nightly/ws/gradlew>
--no-daemon clean precheckin distTar distZip uploadArchives
Downloading https://services.gradle.org/distributions/gradle-2.8-bin.zip
.........................................................................................................................................................................................................................................................................................................................................................................................................................................................................................................................................................................................................................................................................................................................................................................................................................................................................................................................................................................................................................................................................................................................................................................................................................................................................................................................................................................................................................................................................................................................................................................................................................................................................................................................................................................................................................................................................................................................................................................................................................................................................................................................................................................................................................................................................................................................
Unzipping <
https://builds.apache.org/job/Geode-nightly/ws/wrapper/dists/gradle-2.8-bin/4rsda7i357a5ogdj89yq8dntm/gradle-2.8-bin.zip>
to <
https://builds.apache.org/job/Geode-nightly/ws/wrapper/dists/gradle-2.8-bin/4rsda7i357a5ogdj89yq8dntm
>
Set executable permissions for: <
https://builds.apache.org/job/Geode-nightly/ws/wrapper/dists/gradle-2.8-bin/4rsda7i357a5ogdj89yq8dntm/gradle-2.8/bin/gradle
>
To honour the JVM settings for this build a new JVM will be forked. Please
consider using the daemon:
https://docs.gradle.org/2.8/userguide/gradle_daemon.html.
Download
https://plugins.gradle.org/m2/gradle/plugin/org/nosphere/apache/creadur-rat-gradle/0.2.0/creadur-rat-gradle-0.2.0.pom
Download
https://plugins.gradle.org/m2/org/ajoberstar/gradle-git/1.3.2/gradle-git-1.3.2.pom
Download
https://plugins.gradle.org/m2/com/bmuschko/gradle-nexus-plugin/2.3.1/gradle-nexus-plugin-2.3.1.pom
Download
https://plugins.gradle.org/m2/org/ajoberstar/grgit/1.4.1/grgit-1.4.1.pom
Download
https://plugins.gradle.org/m2/com/github/zafarkhaja/java-semver/0.9.0/java-semver-0.9.0.pom
Download
https://plugins.gradle.org/m2/org/sonatype/oss/oss-parent/9/oss-parent-9.pom
Download
https://plugins.gradle.org/m2/org/eclipse/jgit/org.eclipse.jgit/4.0.1.201506240215-r/org.eclipse.jgit-4.0.1.201506240215-r.pom
Download
https://plugins.gradle.org/m2/org/eclipse/jgit/org.eclipse.jgit-parent/4.0.1.201506240215-r/org.eclipse.jgit-parent-4.0.1.201506240215-r.pom
Download
https://plugins.gradle.org/m2/org/eclipse/jgit/org.eclipse.jgit.ui/4.0.1.201506240215-r/org.eclipse.jgit.ui-4.0.1.201506240215-r.pom
Download
https://plugins.gradle.org/m2/com/jcraft/jsch.agentproxy.jsch/0.0.9/jsch.agentproxy.jsch-0.0.9.pom
Download
https://plugins.gradle.org/m2/com/jcraft/jsch.agentproxy/0.0.9/jsch.agentproxy-0.0.9.pom
Download
https://plugins.gradle.org/m2/org/sonatype/oss/oss-parent/6/oss-parent-6.pom
Download
https://plugins.gradle.org/m2/com/jcraft/jsch.agentproxy.pageant/0.0.9/jsch.agentproxy.pageant-0.0.9.pom
Download
https://plugins.gradle.org/m2/com/jcraft/jsch.agentproxy.sshagent/0.0.9/jsch.agentproxy.sshagent-0.0.9.pom
Download
https://plugins.gradle.org/m2/com/jcraft/jsch.agentproxy.usocket-jna/0.0.9/jsch.agentproxy.usocket-jna-0.0.9.pom
Download
https://plugins.gradle.org/m2/com/jcraft/jsch.agentproxy.usocket-nc/0.0.9/jsch.agentproxy.usocket-nc-0.0.9.pom
Download
https://plugins.gradle.org/m2/org/slf4j/slf4j-api/1.7.12/slf4j-api-1.7.12.pom
Download
https://plugins.gradle.org/m2/org/slf4j/slf4j-parent/1.7.12/slf4j-parent-1.7.12.pom
Download
https://plugins.gradle.org/m2/com/jcraft/jsch/0.1.51/jsch-0.1.51.pom
Download
https://plugins.gradle.org/m2/com/googlecode/javaewah/JavaEWAH/0.7.9/JavaEWAH-0.7.9.pom
Download
https://plugins.gradle.org/m2/org/sonatype/oss/oss-parent/5/oss-parent-5.pom
Download
https://plugins.gradle.org/m2/org/apache/httpcomponents/httpclient/4.1.3/httpclient-4.1.3.pom
Download
https://plugins.gradle.org/m2/org/apache/httpcomponents/httpcomponents-client/4.1.3/httpcomponents-client-4.1.3.pom
Download
https://plugins.gradle.org/m2/org/apache/httpcomponents/project/5/project-5.pom
Download
https://plugins.gradle.org/m2/com/jcraft/jsch.agentproxy.core/0.0.9/jsch.agentproxy.core-0.0.9.pom
Download
https://plugins.gradle.org/m2/net/java/dev/jna/jna/4.1.0/jna-4.1.0.pom
Download
https://plugins.gradle.org/m2/net/java/dev/jna/jna-platform/4.1.0/jna-platform-4.1.0.pom
Download
https://plugins.gradle.org/m2/org/apache/httpcomponents/httpcore/4.1.4/httpcore-4.1.4.pom
Download
https://plugins.gradle.org/m2/org/apache/httpcomponents/httpcomponents-core/4.1.4/httpcomponents-core-4.1.4.pom
Download
https://plugins.gradle.org/m2/commons-logging/commons-logging/1.1.1/commons-logging-1.1.1.pom
Download
https://plugins.gradle.org/m2/org/apache/commons/commons-parent/5/commons-parent-5.pom
Download https://plugins.gradle.org/m2/org/apache/apache/4/apache-4.pom
Download
https://plugins.gradle.org/m2/commons-codec/commons-codec/1.4/commons-codec-1.4.pom
Download
https://plugins.gradle.org/m2/org/apache/commons/commons-parent/11/commons-parent-11.pom
Download
https://plugins.gradle.org/m2/gradle/plugin/org/nosphere/apache/creadur-rat-gradle/0.2.0/creadur-rat-gradle-0.2.0.jar
Download
https://plugins.gradle.org/m2/org/ajoberstar/gradle-git/1.3.2/gradle-git-1.3.2.jar
Download
https://plugins.gradle.org/m2/com/bmuschko/gradle-nexus-plugin/2.3.1/gradle-nexus-plugin-2.3.1.jar
Download
https://plugins.gradle.org/m2/org/ajoberstar/grgit/1.4.1/grgit-1.4.1.jar
Download
https://plugins.gradle.org/m2/com/github/zafarkhaja/java-semver/0.9.0/java-semver-0.9.0.jar
Download
https://plugins.gradle.org/m2/org/eclipse/jgit/org.eclipse.jgit/4.0.1.201506240215-r/org.eclipse.jgit-4.0.1.201506240215-r.jar
Download
https://plugins.gradle.org/m2/org/eclipse/jgit/org.eclipse.jgit.ui/4.0.1.201506240215-r/org.eclipse.jgit.ui-4.0.1.201506240215-r.jar
Download
https://plugins.gradle.org/m2/com/jcraft/jsch.agentproxy.jsch/0.0.9/jsch.agentproxy.jsch-0.0.9.jar
Download
https://plugins.gradle.org/m2/com/jcraft/jsch.agentproxy.pageant/0.0.9/jsch.agentproxy.pageant-0.0.9.jar
Download
https://plugins.gradle.org/m2/com/jcraft/jsch.agentproxy.sshagent/0.0.9/jsch.agentproxy.sshagent-0.0.9.jar
Download
https://plugins.gradle.org/m2/com/jcraft/jsch.agentproxy.usocket-jna/0.0.9/jsch.agentproxy.usocket-jna-0.0.9.jar
Download
https://plugins.gradle.org/m2/com/jcraft/jsch.agentproxy.usocket-nc/0.0.9/jsch.agentproxy.usocket-nc-0.0.9.jar
Download
https://plugins.gradle.org/m2/org/slf4j/slf4j-api/1.7.12/slf4j-api-1.7.12.jar
Download
https://plugins.gradle.org/m2/com/jcraft/jsch/0.1.51/jsch-0.1.51.jar
Download
https://plugins.gradle.org/m2/com/googlecode/javaewah/JavaEWAH/0.7.9/JavaEWAH-0.7.9.jar
Download
https://plugins.gradle.org/m2/org/apache/httpcomponents/httpclient/4.1.3/httpclient-4.1.3.jar
Download
https://plugins.gradle.org/m2/com/jcraft/jsch.agentproxy.core/0.0.9/jsch.agentproxy.core-0.0.9.jar
Download
https://plugins.gradle.org/m2/net/java/dev/jna/jna/4.1.0/jna-4.1.0.jar
Download
https://plugins.gradle.org/m2/net/java/dev/jna/jna-platform/4.1.0/jna-platform-4.1.0.jar
Download
https://plugins.gradle.org/m2/org/apache/httpcomponents/httpcore/4.1.4/httpcore-4.1.4.jar
Download
https://plugins.gradle.org/m2/commons-logging/commons-logging/1.1.1/commons-logging-1.1.1.jar
Download
https://plugins.gradle.org/m2/commons-codec/commons-codec/1.4/commons-codec-1.4.jar
Failed to notify ProjectEvaluationListener.afterEvaluate(), but primary
configuration failure takes precedence.
org.gradle.internal.event.ListenerNotificationException: Failed to notify
project evaluation listener.
        at
org.gradle.internal.event.AbstractBroadcastDispatch.dispatch(AbstractBroadcastDispatch.java:55)
        at
org.gradle.internal.event.BroadcastDispatch.dispatch(BroadcastDispatch.java:79)
        at
org.gradle.internal.event.BroadcastDispatch.dispatch(BroadcastDispatch.java:30)
        at
org.gradle.messaging.dispatch.ProxyDispatchAdapter$DispatchingInvocationHandler.invoke(ProxyDispatchAdapter.java:93)
        at com.sun.proxy.$Proxy11.afterEvaluate(Unknown Source)
        at
org.gradle.configuration.project.LifecycleProjectEvaluator.notifyAfterEvaluate(LifecycleProjectEvaluator.java:67)
        at
org.gradle.configuration.project.LifecycleProjectEvaluator.evaluate(LifecycleProjectEvaluator.java:61)
        at
org.gradle.api.internal.project.AbstractProject.evaluate(AbstractProject.java:499)
        at
org.gradle.api.internal.project.AbstractProject.evaluate(AbstractProject.java:86)
        at
org.gradle.execution.TaskPathProjectEvaluator.configureHierarchy(TaskPathProjectEvaluator.java:47)
        at
org.gradle.configuration.DefaultBuildConfigurer.configure(DefaultBuildConfigurer.java:35)
        at
org.gradle.initialization.DefaultGradleLauncher$2.run(DefaultGradleLauncher.java:125)
        at org.gradle.internal.Factories$1.create(Factories.java:22)
        at
org.gradle.internal.progress.DefaultBuildOperationExecutor.run(DefaultBuildOperationExecutor.java:90)
        at
org.gradle.internal.progress.DefaultBuildOperationExecutor.run(DefaultBuildOperationExecutor.java:52)
        at
org.gradle.initialization.DefaultGradleLauncher.doBuildStages(DefaultGradleLauncher.java:122)
        at
org.gradle.initialization.DefaultGradleLauncher.access$200(DefaultGradleLauncher.java:32)
        at
org.gradle.initialization.DefaultGradleLauncher$1.create(DefaultGradleLauncher.java:99)
        at
org.gradle.initialization.DefaultGradleLauncher$1.create(DefaultGradleLauncher.java:93)
        at
org.gradle.internal.progress.DefaultBuildOperationExecutor.run(DefaultBuildOperationExecutor.java:90)
        at
org.gradle.internal.progress.DefaultBuildOperationExecutor.run(DefaultBuildOperationExecutor.java:62)
        at
org.gradle.initialization.DefaultGradleLauncher.doBuild(DefaultGradleLauncher.java:93)
        at
org.gradle.initialization.DefaultGradleLauncher.run(DefaultGradleLauncher.java:82)
        at
org.gradle.launcher.exec.InProcessBuildActionExecuter$DefaultBuildController.run(InProcessBuildActionExecuter.java:94)
        at
org.gradle.tooling.internal.provider.ExecuteBuildActionRunner.run(ExecuteBuildActionRunner.java:28)
        at
org.gradle.launcher.exec.ChainingBuildActionRunner.run(ChainingBuildActionRunner.java:35)
        at
org.gradle.launcher.exec.InProcessBuildActionExecuter.execute(InProcessBuildActionExecuter.java:43)
        at
org.gradle.launcher.exec.InProcessBuildActionExecuter.execute(InProcessBuildActionExecuter.java:28)
        at
org.gradle.launcher.exec.ContinuousBuildActionExecuter.execute(ContinuousBuildActionExecuter.java:77)
        at
org.gradle.launcher.exec.ContinuousBuildActionExecuter.execute(ContinuousBuildActionExecuter.java:47)
        at
org.gradle.launcher.daemon.server.exec.ExecuteBuild.doBuild(ExecuteBuild.java:52)
        at
org.gradle.launcher.daemon.server.exec.BuildCommandOnly.execute(BuildCommandOnly.java:36)
        at
org.gradle.launcher.daemon.server.api.DaemonCommandExecution.proceed(DaemonCommandExecution.java:120)
        at
org.gradle.launcher.daemon.server.exec.WatchForDisconnection.execute(WatchForDisconnection.java:37)
        at
org.gradle.launcher.daemon.server.api.DaemonCommandExecution.proceed(DaemonCommandExecution.java:120)
        at
org.gradle.launcher.daemon.server.exec.ResetDeprecationLogger.execute(ResetDeprecationLogger.java:26)
        at
org.gradle.launcher.daemon.server.api.DaemonCommandExecution.proceed(DaemonCommandExecution.java:120)
        at
org.gradle.launcher.daemon.server.exec.RequestStopIfSingleUsedDaemon.execute(RequestStopIfSingleUsedDaemon.java:34)
        at
org.gradle.launcher.daemon.server.api.DaemonCommandExecution.proceed(DaemonCommandExecution.java:120)
        at
org.gradle.launcher.daemon.server.exec.ForwardClientInput$2.call(ForwardClientInput.java:74)
        at
org.gradle.launcher.daemon.server.exec.ForwardClientInput$2.call(ForwardClientInput.java:72)
        at org.gradle.util.Swapper.swap(Swapper.java:38)
        at
org.gradle.launcher.daemon.server.exec.ForwardClientInput.execute(ForwardClientInput.java:72)
        at
org.gradle.launcher.daemon.server.api.DaemonCommandExecution.proceed(DaemonCommandExecution.java:120)
        at
org.gradle.launcher.daemon.server.health.DaemonHealthTracker.execute(DaemonHealthTracker.java:40)
        at
org.gradle.launcher.daemon.server.api.DaemonCommandExecution.proceed(DaemonCommandExecution.java:120)
        at
org.gradle.launcher.daemon.server.exec.LogToClient.doBuild(LogToClient.java:66)
        at
org.gradle.launcher.daemon.server.exec.BuildCommandOnly.execute(BuildCommandOnly.java:36)
        at
org.gradle.launcher.daemon.server.api.DaemonCommandExecution.proceed(DaemonCommandExecution.java:120)
        at
org.gradle.launcher.daemon.server.exec.EstablishBuildEnvironment.doBuild(EstablishBuildEnvironment.java:71)
        at
org.gradle.launcher.daemon.server.exec.BuildCommandOnly.execute(BuildCommandOnly.java:36)
        at
org.gradle.launcher.daemon.server.api.DaemonCommandExecution.proceed(DaemonCommandExecution.java:120)
        at
org.gradle.launcher.daemon.server.health.HintGCAfterBuild.execute(HintGCAfterBuild.java:41)
        at
org.gradle.launcher.daemon.server.api.DaemonCommandExecution.proceed(DaemonCommandExecution.java:120)
        at
org.gradle.launcher.daemon.server.exec.StartBuildOrRespondWithBusy$1.run(StartBuildOrRespondWithBusy.java:50)
        at
org.gradle.launcher.daemon.server.DaemonStateCoordinator$1.run(DaemonStateCoordinator.java:246)
        at
org.gradle.internal.concurrent.ExecutorPolicy$CatchAndRecordFailures.onExecute(ExecutorPolicy.java:54)
        at
org.gradle.internal.concurrent.StoppableExecutorImpl$1.run(StoppableExecutorImpl.java:40)
        at
java.util.concurrent.ThreadPoolExecutor.runWorker(ThreadPoolExecutor.java:1142)
        at
java.util.concurrent.ThreadPoolExecutor$Worker.run(ThreadPoolExecutor.java:617)
        at java.lang.Thread.run(Thread.java:745)
Caused by: java.io.FileNotFoundException: /home/jenkins/.m2/settings.xml
(No such file or directory)
        at java.io.FileInputStream.open0(Native Method)
        at java.io.FileInputStream.open(FileInputStream.java:195)
        at java.io.FileInputStream.<init>(FileInputStream.java:138)
        at groovy.util.XmlSlurper.parse(XmlSlurper.java:221)
        at groovy.util.XmlSlurper$parse.call(Unknown Source)
        at build_8nhqnxgvsda2ydhlda03q6ucd$_run_closure6$_closure50.doCall(<
https://builds.apache.org/job/Geode-nightly/ws/build.gradle>:539)
        at sun.reflect.NativeMethodAccessorImpl.invoke0(Native Method)
        at
sun.reflect.NativeMethodAccessorImpl.invoke(NativeMethodAccessorImpl.java:62)
        at
sun.reflect.DelegatingMethodAccessorImpl.invoke(DelegatingMethodAccessorImpl.java:43)
        at java.lang.reflect.Method.invoke(Method.java:497)
        at
org.codehaus.groovy.reflection.CachedMethod.invoke(CachedMethod.java:93)
        at groovy.lang.MetaMethod.doMethodInvoke(MetaMethod.java:325)
        at
org.codehaus.groovy.runtime.metaclass.ClosureMetaClass.invokeMethod(ClosureMetaClass.java:294)
        at groovy.lang.MetaClassImpl.invokeMethod(MetaClassImpl.java:1019)
        at groovy.lang.Closure.call(Closure.java:426)
        at
org.gradle.listener.ClosureBackedMethodInvocationDispatch.dispatch(ClosureBackedMethodInvocationDispatch.java:40)
        at
org.gradle.listener.ClosureBackedMethodInvocationDispatch.dispatch(ClosureBackedMethodInvocationDispatch.java:25)
        at
org.gradle.internal.event.AbstractBroadcastDispatch.dispatch(AbstractBroadcastDispatch.java:44)
        ... 60 more

FAILURE: Build failed with an exception.

* Where:
Build file '<https://builds.apache.org/job/Geode-nightly/ws/build.gradle'>
line: 539

* What went wrong:
A problem occurred evaluating project ':gemfire-assembly'.
> Could not resolve all dependencies for configuration
':gemfire-assembly:runtime'.
   > A problem occurred configuring project ':gemfire-common'.
      > Failed to notify project evaluation listener.
         > /home/jenkins/.m2/settings.xml (No such file or directory)

* Try:
Run with --stacktrace option to get the stack trace. Run with --info or
--debug option to get more log output.

BUILD FAILED

Total time: 23.253 secs
Build step 'Invoke Gradle script' changed build result to FAILURE
Build step 'Invoke Gradle script' marked build as failure
Archiving artifacts
Recording test results
ERROR: Publisher 'Publish JUnit test result report' failed: No test report
files were found. Configuration error?

Build failed in Jenkins: Geode-nightly #352

Posted by Apache Jenkins Server <je...@builds.apache.org>.
See <https://builds.apache.org/job/Geode-nightly/352/changes>

Changes:

[bschuchardt] Converting FilterProfile to use CopyOnWrite collections

[bschuchardt] Removing label from continues in AbstractRegionMap

[bschuchardt] refactoring RegionVersionHolder.recordVersion()

[bschuchardt] avoid invoking addOlderVersion for a version that isn't old

[dschneider] GEODE-783: add unit test for SyncChunkStack

[klund] Add Apache license header

[bschuchardt] added unit test category to RegionVersionHolder2JUnitTest

[upthewaterspout] GEODE-601: Fix intermittent exception in DiskRegionJUnitTest.

[upthewaterspout] GEODE-797: Adding an encoding=UTF-8 to javadocs

------------------------------------------
[...truncated 1832 lines...]
 > git init <https://builds.apache.org/job/Geode-nightly/ws/> # timeout=10
Fetching upstream changes from https://git-wip-us.apache.org/repos/asf/incubator-geode.git
 > git --version # timeout=10
 > git -c core.askpass=true fetch --tags --progress https://git-wip-us.apache.org/repos/asf/incubator-geode.git +refs/heads/*:refs/remotes/origin/*
 > git config remote.origin.url https://git-wip-us.apache.org/repos/asf/incubator-geode.git # timeout=10
 > git config --add remote.origin.fetch +refs/heads/*:refs/remotes/origin/* # timeout=10
 > git config remote.origin.url https://git-wip-us.apache.org/repos/asf/incubator-geode.git # timeout=10
Fetching upstream changes from https://git-wip-us.apache.org/repos/asf/incubator-geode.git
 > git -c core.askpass=true fetch --tags --progress https://git-wip-us.apache.org/repos/asf/incubator-geode.git +refs/heads/*:refs/remotes/origin/*
 > git rev-parse refs/remotes/origin/develop^{commit} # timeout=10
 > git rev-parse refs/remotes/origin/origin/develop^{commit} # timeout=10
Checking out Revision 731c668f41d3a6777d0e24ca13b434e55c18ca65 (refs/remotes/origin/develop)
 > git config core.sparsecheckout # timeout=10
 > git checkout -f 731c668f41d3a6777d0e24ca13b434e55c18ca65 # timeout=10
 > git branch -a # timeout=10
 > git rev-parse remotes/origin/asf-site^{commit} # timeout=10
 > git rev-parse remotes/origin/asf/asf-site^{commit} # timeout=10
 > git rev-parse remotes/origin/develop^{commit} # timeout=10
 > git rev-parse remotes/origin/feature/GEODE-11^{commit} # timeout=10
 > git rev-parse remotes/origin/feature/GEODE-12^{commit} # timeout=10
 > git rev-parse remotes/origin/feature/GEODE-124^{commit} # timeout=10
 > git rev-parse remotes/origin/feature/GEODE-14^{commit} # timeout=10
 > git rev-parse remotes/origin/feature/GEODE-14-2^{commit} # timeout=10
 > git rev-parse remotes/origin/feature/GEODE-151^{commit} # timeout=10
 > git rev-parse remotes/origin/feature/GEODE-16^{commit} # timeout=10
 > git rev-parse remotes/origin/feature/GEODE-160^{commit} # timeout=10
 > git rev-parse remotes/origin/feature/GEODE-17^{commit} # timeout=10
 > git rev-parse remotes/origin/feature/GEODE-178^{commit} # timeout=10
 > git rev-parse remotes/origin/feature/GEODE-189^{commit} # timeout=10
 > git rev-parse remotes/origin/feature/GEODE-217^{commit} # timeout=10
 > git rev-parse remotes/origin/feature/GEODE-227^{commit} # timeout=10
 > git rev-parse remotes/origin/feature/GEODE-259^{commit} # timeout=10
 > git rev-parse remotes/origin/feature/GEODE-280^{commit} # timeout=10
 > git rev-parse remotes/origin/feature/GEODE-291^{commit} # timeout=10
 > git rev-parse remotes/origin/feature/GEODE-308^{commit} # timeout=10
 > git rev-parse remotes/origin/feature/GEODE-372^{commit} # timeout=10
 > git rev-parse remotes/origin/feature/GEODE-374^{commit} # timeout=10
 > git rev-parse remotes/origin/feature/GEODE-377^{commit} # timeout=10
 > git rev-parse remotes/origin/feature/GEODE-38^{commit} # timeout=10
 > git rev-parse remotes/origin/feature/GEODE-392^{commit} # timeout=10
 > git rev-parse remotes/origin/feature/GEODE-409^{commit} # timeout=10
 > git rev-parse remotes/origin/feature/GEODE-41^{commit} # timeout=10
 > git rev-parse remotes/origin/feature/GEODE-417^{commit} # timeout=10
 > git rev-parse remotes/origin/feature/GEODE-438^{commit} # timeout=10
 > git rev-parse remotes/origin/feature/GEODE-500^{commit} # timeout=10
 > git rev-parse remotes/origin/feature/GEODE-53^{commit} # timeout=10
 > git rev-parse remotes/origin/feature/GEODE-54^{commit} # timeout=10
 > git rev-parse remotes/origin/feature/GEODE-542^{commit} # timeout=10
 > git rev-parse remotes/origin/feature/GEODE-544^{commit} # timeout=10
 > git rev-parse remotes/origin/feature/GEODE-546^{commit} # timeout=10
 > git rev-parse remotes/origin/feature/GEODE-563^{commit} # timeout=10
 > git rev-parse remotes/origin/feature/GEODE-574^{commit} # timeout=10
 > git rev-parse remotes/origin/feature/GEODE-578^{commit} # timeout=10
 > git rev-parse remotes/origin/feature/GEODE-580^{commit} # timeout=10
 > git rev-parse remotes/origin/feature/GEODE-584^{commit} # timeout=10
 > git rev-parse remotes/origin/feature/GEODE-607^{commit} # timeout=10
 > git rev-parse remotes/origin/feature/GEODE-608^{commit} # timeout=10
 > git rev-parse remotes/origin/feature/GEODE-610^{commit} # timeout=10
 > git rev-parse remotes/origin/feature/GEODE-611^{commit} # timeout=10
 > git rev-parse remotes/origin/feature/GEODE-622^{commit} # timeout=10
 > git rev-parse remotes/origin/feature/GEODE-637^{commit} # timeout=10
 > git rev-parse remotes/origin/feature/GEODE-678^{commit} # timeout=10
 > git rev-parse remotes/origin/feature/GEODE-681^{commit} # timeout=10
 > git rev-parse remotes/origin/feature/GEODE-714^{commit} # timeout=10
 > git rev-parse remotes/origin/feature/GEODE-715^{commit} # timeout=10
 > git rev-parse remotes/origin/feature/GEODE-77^{commit} # timeout=10
 > git rev-parse remotes/origin/feature/GEODE-78^{commit} # timeout=10
 > git rev-parse remotes/origin/feature/GEODE-781^{commit} # timeout=10
 > git rev-parse remotes/origin/feature/GEODE-79^{commit} # timeout=10
 > git rev-parse remotes/origin/feature/GEODE-80^{commit} # timeout=10
 > git rev-parse remotes/origin/feature/wan_single_hop_wip^{commit} # timeout=10
 > git rev-parse remotes/origin/gh-wiki^{commit} # timeout=10
 > git rev-parse remotes/origin/master^{commit} # timeout=10
 > git rev-parse remotes/origin/release/1.0.0-incubating.M1^{commit} # timeout=10
 > git rev-parse remotes/origin/sga2^{commit} # timeout=10
 > git rev-parse remotes/origin/wan_cq_donation^{commit} # timeout=10
 > git checkout -b develop 731c668f41d3a6777d0e24ca13b434e55c18ca65
 > git rev-list 6e6861d142d69c8dea098eb2e9fc2b5b47e1c769 # timeout=10
[Gradle] - Launching build.
[Geode-nightly] $ <https://builds.apache.org/job/Geode-nightly/ws/gradlew> --no-daemon clean precheckin distTar distZip uploadArchives
Downloading https://services.gradle.org/distributions/gradle-2.8-bin.zip
.........................................................................................................................................................................................................................................................................................................................................................................................................................................................................................................................................................................................................................................................................................................................................................................................................................................................................................................................................................................................................................................................................................................................................................................................................................................................................................................................................................................................................................................................................................................................................................................................................................................................................................................................................................................................................................................................................................................................................................................................................................................................................................................................................................................................................................................................................................................................
Unzipping <https://builds.apache.org/job/Geode-nightly/ws/wrapper/dists/gradle-2.8-bin/4rsda7i357a5ogdj89yq8dntm/gradle-2.8-bin.zip> to <https://builds.apache.org/job/Geode-nightly/ws/wrapper/dists/gradle-2.8-bin/4rsda7i357a5ogdj89yq8dntm>
Set executable permissions for: <https://builds.apache.org/job/Geode-nightly/ws/wrapper/dists/gradle-2.8-bin/4rsda7i357a5ogdj89yq8dntm/gradle-2.8/bin/gradle>
To honour the JVM settings for this build a new JVM will be forked. Please consider using the daemon: https://docs.gradle.org/2.8/userguide/gradle_daemon.html.
Download https://plugins.gradle.org/m2/gradle/plugin/org/nosphere/apache/creadur-rat-gradle/0.2.0/creadur-rat-gradle-0.2.0.pom
Download https://plugins.gradle.org/m2/org/ajoberstar/gradle-git/1.3.2/gradle-git-1.3.2.pom
Download https://plugins.gradle.org/m2/com/bmuschko/gradle-nexus-plugin/2.3.1/gradle-nexus-plugin-2.3.1.pom
Download https://plugins.gradle.org/m2/org/ajoberstar/grgit/1.4.1/grgit-1.4.1.pom
Download https://plugins.gradle.org/m2/com/github/zafarkhaja/java-semver/0.9.0/java-semver-0.9.0.pom
Download https://plugins.gradle.org/m2/org/sonatype/oss/oss-parent/9/oss-parent-9.pom
Download https://plugins.gradle.org/m2/org/eclipse/jgit/org.eclipse.jgit/4.0.1.201506240215-r/org.eclipse.jgit-4.0.1.201506240215-r.pom
Download https://plugins.gradle.org/m2/org/eclipse/jgit/org.eclipse.jgit-parent/4.0.1.201506240215-r/org.eclipse.jgit-parent-4.0.1.201506240215-r.pom
Download https://plugins.gradle.org/m2/org/eclipse/jgit/org.eclipse.jgit.ui/4.0.1.201506240215-r/org.eclipse.jgit.ui-4.0.1.201506240215-r.pom
Download https://plugins.gradle.org/m2/com/jcraft/jsch.agentproxy.jsch/0.0.9/jsch.agentproxy.jsch-0.0.9.pom
Download https://plugins.gradle.org/m2/com/jcraft/jsch.agentproxy/0.0.9/jsch.agentproxy-0.0.9.pom
Download https://plugins.gradle.org/m2/org/sonatype/oss/oss-parent/6/oss-parent-6.pom
Download https://plugins.gradle.org/m2/com/jcraft/jsch.agentproxy.pageant/0.0.9/jsch.agentproxy.pageant-0.0.9.pom
Download https://plugins.gradle.org/m2/com/jcraft/jsch.agentproxy.sshagent/0.0.9/jsch.agentproxy.sshagent-0.0.9.pom
Download https://plugins.gradle.org/m2/com/jcraft/jsch.agentproxy.usocket-jna/0.0.9/jsch.agentproxy.usocket-jna-0.0.9.pom
Download https://plugins.gradle.org/m2/com/jcraft/jsch.agentproxy.usocket-nc/0.0.9/jsch.agentproxy.usocket-nc-0.0.9.pom
Download https://plugins.gradle.org/m2/org/slf4j/slf4j-api/1.7.12/slf4j-api-1.7.12.pom
Download https://plugins.gradle.org/m2/org/slf4j/slf4j-parent/1.7.12/slf4j-parent-1.7.12.pom
Download https://plugins.gradle.org/m2/com/jcraft/jsch/0.1.51/jsch-0.1.51.pom
Download https://plugins.gradle.org/m2/com/googlecode/javaewah/JavaEWAH/0.7.9/JavaEWAH-0.7.9.pom
Download https://plugins.gradle.org/m2/org/sonatype/oss/oss-parent/5/oss-parent-5.pom
Download https://plugins.gradle.org/m2/org/apache/httpcomponents/httpclient/4.1.3/httpclient-4.1.3.pom
Download https://plugins.gradle.org/m2/org/apache/httpcomponents/httpcomponents-client/4.1.3/httpcomponents-client-4.1.3.pom
Download https://plugins.gradle.org/m2/org/apache/httpcomponents/project/5/project-5.pom
Download https://plugins.gradle.org/m2/com/jcraft/jsch.agentproxy.core/0.0.9/jsch.agentproxy.core-0.0.9.pom
Download https://plugins.gradle.org/m2/net/java/dev/jna/jna/4.1.0/jna-4.1.0.pom
Download https://plugins.gradle.org/m2/net/java/dev/jna/jna-platform/4.1.0/jna-platform-4.1.0.pom
Download https://plugins.gradle.org/m2/org/apache/httpcomponents/httpcore/4.1.4/httpcore-4.1.4.pom
Download https://plugins.gradle.org/m2/org/apache/httpcomponents/httpcomponents-core/4.1.4/httpcomponents-core-4.1.4.pom
Download https://plugins.gradle.org/m2/commons-logging/commons-logging/1.1.1/commons-logging-1.1.1.pom
Download https://plugins.gradle.org/m2/org/apache/commons/commons-parent/5/commons-parent-5.pom
Download https://plugins.gradle.org/m2/org/apache/apache/4/apache-4.pom
Download https://plugins.gradle.org/m2/commons-codec/commons-codec/1.4/commons-codec-1.4.pom
Download https://plugins.gradle.org/m2/org/apache/commons/commons-parent/11/commons-parent-11.pom
Download https://plugins.gradle.org/m2/gradle/plugin/org/nosphere/apache/creadur-rat-gradle/0.2.0/creadur-rat-gradle-0.2.0.jar
Download https://plugins.gradle.org/m2/org/ajoberstar/gradle-git/1.3.2/gradle-git-1.3.2.jar
Download https://plugins.gradle.org/m2/com/bmuschko/gradle-nexus-plugin/2.3.1/gradle-nexus-plugin-2.3.1.jar
Download https://plugins.gradle.org/m2/org/ajoberstar/grgit/1.4.1/grgit-1.4.1.jar
Download https://plugins.gradle.org/m2/com/github/zafarkhaja/java-semver/0.9.0/java-semver-0.9.0.jar
Download https://plugins.gradle.org/m2/org/eclipse/jgit/org.eclipse.jgit/4.0.1.201506240215-r/org.eclipse.jgit-4.0.1.201506240215-r.jar
Download https://plugins.gradle.org/m2/org/eclipse/jgit/org.eclipse.jgit.ui/4.0.1.201506240215-r/org.eclipse.jgit.ui-4.0.1.201506240215-r.jar
Download https://plugins.gradle.org/m2/com/jcraft/jsch.agentproxy.jsch/0.0.9/jsch.agentproxy.jsch-0.0.9.jar
Download https://plugins.gradle.org/m2/com/jcraft/jsch.agentproxy.pageant/0.0.9/jsch.agentproxy.pageant-0.0.9.jar
Download https://plugins.gradle.org/m2/com/jcraft/jsch.agentproxy.sshagent/0.0.9/jsch.agentproxy.sshagent-0.0.9.jar
Download https://plugins.gradle.org/m2/com/jcraft/jsch.agentproxy.usocket-jna/0.0.9/jsch.agentproxy.usocket-jna-0.0.9.jar
Download https://plugins.gradle.org/m2/com/jcraft/jsch.agentproxy.usocket-nc/0.0.9/jsch.agentproxy.usocket-nc-0.0.9.jar
Download https://plugins.gradle.org/m2/org/slf4j/slf4j-api/1.7.12/slf4j-api-1.7.12.jar
Download https://plugins.gradle.org/m2/com/jcraft/jsch/0.1.51/jsch-0.1.51.jar
Download https://plugins.gradle.org/m2/com/googlecode/javaewah/JavaEWAH/0.7.9/JavaEWAH-0.7.9.jar
Download https://plugins.gradle.org/m2/org/apache/httpcomponents/httpclient/4.1.3/httpclient-4.1.3.jar
Download https://plugins.gradle.org/m2/com/jcraft/jsch.agentproxy.core/0.0.9/jsch.agentproxy.core-0.0.9.jar
Download https://plugins.gradle.org/m2/net/java/dev/jna/jna/4.1.0/jna-4.1.0.jar
Download https://plugins.gradle.org/m2/net/java/dev/jna/jna-platform/4.1.0/jna-platform-4.1.0.jar
Download https://plugins.gradle.org/m2/org/apache/httpcomponents/httpcore/4.1.4/httpcore-4.1.4.jar
Download https://plugins.gradle.org/m2/commons-logging/commons-logging/1.1.1/commons-logging-1.1.1.jar
Download https://plugins.gradle.org/m2/commons-codec/commons-codec/1.4/commons-codec-1.4.jar
Failed to notify ProjectEvaluationListener.afterEvaluate(), but primary configuration failure takes precedence.
org.gradle.internal.event.ListenerNotificationException: Failed to notify project evaluation listener.
	at org.gradle.internal.event.AbstractBroadcastDispatch.dispatch(AbstractBroadcastDispatch.java:55)
	at org.gradle.internal.event.BroadcastDispatch.dispatch(BroadcastDispatch.java:79)
	at org.gradle.internal.event.BroadcastDispatch.dispatch(BroadcastDispatch.java:30)
	at org.gradle.messaging.dispatch.ProxyDispatchAdapter$DispatchingInvocationHandler.invoke(ProxyDispatchAdapter.java:93)
	at com.sun.proxy.$Proxy11.afterEvaluate(Unknown Source)
	at org.gradle.configuration.project.LifecycleProjectEvaluator.notifyAfterEvaluate(LifecycleProjectEvaluator.java:67)
	at org.gradle.configuration.project.LifecycleProjectEvaluator.evaluate(LifecycleProjectEvaluator.java:61)
	at org.gradle.api.internal.project.AbstractProject.evaluate(AbstractProject.java:499)
	at org.gradle.api.internal.project.AbstractProject.evaluate(AbstractProject.java:86)
	at org.gradle.execution.TaskPathProjectEvaluator.configureHierarchy(TaskPathProjectEvaluator.java:47)
	at org.gradle.configuration.DefaultBuildConfigurer.configure(DefaultBuildConfigurer.java:35)
	at org.gradle.initialization.DefaultGradleLauncher$2.run(DefaultGradleLauncher.java:125)
	at org.gradle.internal.Factories$1.create(Factories.java:22)
	at org.gradle.internal.progress.DefaultBuildOperationExecutor.run(DefaultBuildOperationExecutor.java:90)
	at org.gradle.internal.progress.DefaultBuildOperationExecutor.run(DefaultBuildOperationExecutor.java:52)
	at org.gradle.initialization.DefaultGradleLauncher.doBuildStages(DefaultGradleLauncher.java:122)
	at org.gradle.initialization.DefaultGradleLauncher.access$200(DefaultGradleLauncher.java:32)
	at org.gradle.initialization.DefaultGradleLauncher$1.create(DefaultGradleLauncher.java:99)
	at org.gradle.initialization.DefaultGradleLauncher$1.create(DefaultGradleLauncher.java:93)
	at org.gradle.internal.progress.DefaultBuildOperationExecutor.run(DefaultBuildOperationExecutor.java:90)
	at org.gradle.internal.progress.DefaultBuildOperationExecutor.run(DefaultBuildOperationExecutor.java:62)
	at org.gradle.initialization.DefaultGradleLauncher.doBuild(DefaultGradleLauncher.java:93)
	at org.gradle.initialization.DefaultGradleLauncher.run(DefaultGradleLauncher.java:82)
	at org.gradle.launcher.exec.InProcessBuildActionExecuter$DefaultBuildController.run(InProcessBuildActionExecuter.java:94)
	at org.gradle.tooling.internal.provider.ExecuteBuildActionRunner.run(ExecuteBuildActionRunner.java:28)
	at org.gradle.launcher.exec.ChainingBuildActionRunner.run(ChainingBuildActionRunner.java:35)
	at org.gradle.launcher.exec.InProcessBuildActionExecuter.execute(InProcessBuildActionExecuter.java:43)
	at org.gradle.launcher.exec.InProcessBuildActionExecuter.execute(InProcessBuildActionExecuter.java:28)
	at org.gradle.launcher.exec.ContinuousBuildActionExecuter.execute(ContinuousBuildActionExecuter.java:77)
	at org.gradle.launcher.exec.ContinuousBuildActionExecuter.execute(ContinuousBuildActionExecuter.java:47)
	at org.gradle.launcher.daemon.server.exec.ExecuteBuild.doBuild(ExecuteBuild.java:52)
	at org.gradle.launcher.daemon.server.exec.BuildCommandOnly.execute(BuildCommandOnly.java:36)
	at org.gradle.launcher.daemon.server.api.DaemonCommandExecution.proceed(DaemonCommandExecution.java:120)
	at org.gradle.launcher.daemon.server.exec.WatchForDisconnection.execute(WatchForDisconnection.java:37)
	at org.gradle.launcher.daemon.server.api.DaemonCommandExecution.proceed(DaemonCommandExecution.java:120)
	at org.gradle.launcher.daemon.server.exec.ResetDeprecationLogger.execute(ResetDeprecationLogger.java:26)
	at org.gradle.launcher.daemon.server.api.DaemonCommandExecution.proceed(DaemonCommandExecution.java:120)
	at org.gradle.launcher.daemon.server.exec.RequestStopIfSingleUsedDaemon.execute(RequestStopIfSingleUsedDaemon.java:34)
	at org.gradle.launcher.daemon.server.api.DaemonCommandExecution.proceed(DaemonCommandExecution.java:120)
	at org.gradle.launcher.daemon.server.exec.ForwardClientInput$2.call(ForwardClientInput.java:74)
	at org.gradle.launcher.daemon.server.exec.ForwardClientInput$2.call(ForwardClientInput.java:72)
	at org.gradle.util.Swapper.swap(Swapper.java:38)
	at org.gradle.launcher.daemon.server.exec.ForwardClientInput.execute(ForwardClientInput.java:72)
	at org.gradle.launcher.daemon.server.api.DaemonCommandExecution.proceed(DaemonCommandExecution.java:120)
	at org.gradle.launcher.daemon.server.health.DaemonHealthTracker.execute(DaemonHealthTracker.java:40)
	at org.gradle.launcher.daemon.server.api.DaemonCommandExecution.proceed(DaemonCommandExecution.java:120)
	at org.gradle.launcher.daemon.server.exec.LogToClient.doBuild(LogToClient.java:66)
	at org.gradle.launcher.daemon.server.exec.BuildCommandOnly.execute(BuildCommandOnly.java:36)
	at org.gradle.launcher.daemon.server.api.DaemonCommandExecution.proceed(DaemonCommandExecution.java:120)
	at org.gradle.launcher.daemon.server.exec.EstablishBuildEnvironment.doBuild(EstablishBuildEnvironment.java:71)
	at org.gradle.launcher.daemon.server.exec.BuildCommandOnly.execute(BuildCommandOnly.java:36)
	at org.gradle.launcher.daemon.server.api.DaemonCommandExecution.proceed(DaemonCommandExecution.java:120)
	at org.gradle.launcher.daemon.server.health.HintGCAfterBuild.execute(HintGCAfterBuild.java:41)
	at org.gradle.launcher.daemon.server.api.DaemonCommandExecution.proceed(DaemonCommandExecution.java:120)
	at org.gradle.launcher.daemon.server.exec.StartBuildOrRespondWithBusy$1.run(StartBuildOrRespondWithBusy.java:50)
	at org.gradle.launcher.daemon.server.DaemonStateCoordinator$1.run(DaemonStateCoordinator.java:246)
	at org.gradle.internal.concurrent.ExecutorPolicy$CatchAndRecordFailures.onExecute(ExecutorPolicy.java:54)
	at org.gradle.internal.concurrent.StoppableExecutorImpl$1.run(StoppableExecutorImpl.java:40)
	at java.util.concurrent.ThreadPoolExecutor.runWorker(ThreadPoolExecutor.java:1142)
	at java.util.concurrent.ThreadPoolExecutor$Worker.run(ThreadPoolExecutor.java:617)
	at java.lang.Thread.run(Thread.java:745)
Caused by: java.io.FileNotFoundException: /home/jenkins/.m2/settings.xml (No such file or directory)
	at java.io.FileInputStream.open0(Native Method)
	at java.io.FileInputStream.open(FileInputStream.java:195)
	at java.io.FileInputStream.<init>(FileInputStream.java:138)
	at groovy.util.XmlSlurper.parse(XmlSlurper.java:221)
	at groovy.util.XmlSlurper$parse.call(Unknown Source)
	at build_8nhqnxgvsda2ydhlda03q6ucd$_run_closure6$_closure50.doCall(<https://builds.apache.org/job/Geode-nightly/ws/build.gradle>:539)
	at sun.reflect.NativeMethodAccessorImpl.invoke0(Native Method)
	at sun.reflect.NativeMethodAccessorImpl.invoke(NativeMethodAccessorImpl.java:62)
	at sun.reflect.DelegatingMethodAccessorImpl.invoke(DelegatingMethodAccessorImpl.java:43)
	at java.lang.reflect.Method.invoke(Method.java:497)
	at org.codehaus.groovy.reflection.CachedMethod.invoke(CachedMethod.java:93)
	at groovy.lang.MetaMethod.doMethodInvoke(MetaMethod.java:325)
	at org.codehaus.groovy.runtime.metaclass.ClosureMetaClass.invokeMethod(ClosureMetaClass.java:294)
	at groovy.lang.MetaClassImpl.invokeMethod(MetaClassImpl.java:1019)
	at groovy.lang.Closure.call(Closure.java:426)
	at org.gradle.listener.ClosureBackedMethodInvocationDispatch.dispatch(ClosureBackedMethodInvocationDispatch.java:40)
	at org.gradle.listener.ClosureBackedMethodInvocationDispatch.dispatch(ClosureBackedMethodInvocationDispatch.java:25)
	at org.gradle.internal.event.AbstractBroadcastDispatch.dispatch(AbstractBroadcastDispatch.java:44)
	... 60 more

FAILURE: Build failed with an exception.

* Where:
Build file '<https://builds.apache.org/job/Geode-nightly/ws/build.gradle'> line: 539

* What went wrong:
A problem occurred evaluating project ':gemfire-assembly'.
> Could not resolve all dependencies for configuration ':gemfire-assembly:runtime'.
   > A problem occurred configuring project ':gemfire-common'.
      > Failed to notify project evaluation listener.
         > /home/jenkins/.m2/settings.xml (No such file or directory)

* Try:
Run with --stacktrace option to get the stack trace. Run with --info or --debug option to get more log output.

BUILD FAILED

Total time: 23.253 secs
Build step 'Invoke Gradle script' changed build result to FAILURE
Build step 'Invoke Gradle script' marked build as failure
Archiving artifacts
Recording test results
ERROR: Publisher 'Publish JUnit test result report' failed: No test report files were found. Configuration error?


Build failed in Jenkins: Geode-nightly #351

Posted by Apache Jenkins Server <je...@builds.apache.org>.
See <https://builds.apache.org/job/Geode-nightly/351/changes>

Changes:

[klund] GEODE-780: Change GFSH to not require Attach API when starting

[hkhamesra] Added helpe function for test to know CacheClientProxy state.

------------------------------------------
[...truncated 554 lines...]
:gemfire-core:compileTestJava
Download https://repo1.maven.org/maven2/net/spy/spymemcached/2.9.0/spymemcached-2.9.0.pom
Download https://repo1.maven.org/maven2/redis/clients/jedis/2.7.2/jedis-2.7.2.pom
Download https://repo1.maven.org/maven2/org/powermock/powermock-core/1.6.4/powermock-core-1.6.4.pom
Download https://repo1.maven.org/maven2/org/powermock/powermock/1.6.4/powermock-1.6.4.pom
Download https://repo1.maven.org/maven2/org/powermock/powermock-module-junit4/1.6.4/powermock-module-junit4-1.6.4.pom
Download https://repo1.maven.org/maven2/org/powermock/powermock-modules/1.6.4/powermock-modules-1.6.4.pom
Download https://repo1.maven.org/maven2/org/powermock/powermock-module-junit4-common/1.6.4/powermock-module-junit4-common-1.6.4.pom
Download https://repo1.maven.org/maven2/org/powermock/powermock-api-support/1.6.4/powermock-api-support-1.6.4.pom
Download https://repo1.maven.org/maven2/org/powermock/powermock-api/1.6.4/powermock-api-1.6.4.pom
Download https://repo1.maven.org/maven2/org/powermock/powermock-api-mockito/1.6.4/powermock-api-mockito-1.6.4.pom
Download https://repo1.maven.org/maven2/net/spy/spymemcached/2.9.0/spymemcached-2.9.0.jar
Download https://repo1.maven.org/maven2/redis/clients/jedis/2.7.2/jedis-2.7.2.jar
Download https://repo1.maven.org/maven2/org/powermock/powermock-core/1.6.4/powermock-core-1.6.4.jar
Download https://repo1.maven.org/maven2/org/powermock/powermock-module-junit4/1.6.4/powermock-module-junit4-1.6.4.jar
Download https://repo1.maven.org/maven2/org/powermock/powermock-module-junit4-common/1.6.4/powermock-module-junit4-common-1.6.4.jar
Download https://repo1.maven.org/maven2/org/powermock/powermock-api-support/1.6.4/powermock-api-support-1.6.4.jar
Download https://repo1.maven.org/maven2/org/powermock/powermock-api-mockito/1.6.4/powermock-api-mockito-1.6.4.jar
/x1/jenkins/jenkins-slave/workspace/Geode-nightly/gemfire-core/src/test/java/com/gemstone/gemfire/cache30/MemLRUEvictionControllerDUnitTest.java:22: warning: Unsafe is internal proprietary API and may be removed in a future release
import sun.misc.Unsafe;
               ^
/x1/jenkins/jenkins-slave/workspace/Geode-nightly/gemfire-core/src/test/java/com/gemstone/gemfire/cache30/MemLRUEvictionControllerDUnitTest.java:22: warning: Unsafe is internal proprietary API and may be removed in a future release
import sun.misc.Unsafe;
               ^
/x1/jenkins/jenkins-slave/workspace/Geode-nightly/gemfire-core/src/test/java/com/gemstone/gemfire/cache30/MemLRUEvictionControllerDUnitTest.java:22: warning: Unsafe is internal proprietary API and may be removed in a future release
import sun.misc.Unsafe;
               ^
Note: Some input files use or override a deprecated API.
Note: Recompile with -Xlint:deprecation for details.
Note: Some input files use unchecked or unsafe operations.
Note: Recompile with -Xlint:unchecked for details.
3 warnings
:gemfire-core:processTestResources
:gemfire-core:testClasses
:gemfire-core:jarTest
:gemfire-assembly:compileTestJavaNote: /x1/jenkins/jenkins-slave/workspace/Geode-nightly/gemfire-assembly/src/test/java/com/gemstone/gemfire/management/internal/configuration/SharedConfigurationEndToEndDUnitTest.java uses or overrides a deprecated API.
Note: Recompile with -Xlint:deprecation for details.

:gemfire-assembly:processTestResources UP-TO-DATE
:gemfire-assembly:testClasses
:gemfire-assembly:checkMissedTests
Download https://repo1.maven.org/maven2/cglib/cglib/3.1/cglib-3.1.jar
:gemfire-assembly:integrationTest
Build file '/x1/jenkins/jenkins-slave/workspace/Geode-nightly/build.gradle': line 90
AvailablePortFinder has been deprecated and is scheduled to be removed in Gradle 3.0
:gemfire-common:assemble
:gemfire-common:compileTestJava
:gemfire-common:processTestResources UP-TO-DATE
:gemfire-common:testClasses
:gemfire-common:checkMissedTests
:gemfire-common:test
:gemfire-common:check
:gemfire-common:build
:gemfire-common:distributedTest
:gemfire-common:integrationTest
:gemfire-core:checkMissedTests
Download https://repo1.maven.org/maven2/org/powermock/powermock-reflect/1.6.4/powermock-reflect-1.6.4.pom
Download https://repo1.maven.org/maven2/org/javassist/javassist/3.20.0-GA/javassist-3.20.0-GA.pom
Download https://repo1.maven.org/maven2/org/powermock/powermock-reflect/1.6.4/powermock-reflect-1.6.4.jar
:gemfire-core:test

com.gemstone.gemfire.internal.offheap.SimpleMemoryAllocatorJUnitTest > testClose FAILED
    java.lang.AssertionError: expected:<false> but was:<true>
        at org.junit.Assert.fail(Assert.java:88)
        at org.junit.Assert.failNotEquals(Assert.java:834)
        at org.junit.Assert.assertEquals(Assert.java:118)
        at org.junit.Assert.assertEquals(Assert.java:144)
        at com.gemstone.gemfire.internal.offheap.SimpleMemoryAllocatorJUnitTest.testClose(SimpleMemoryAllocatorJUnitTest.java:442)

com.gemstone.gemfire.internal.offheap.SimpleMemoryAllocatorJUnitTest > testCreate FAILED
    java.lang.AssertionError
        at org.junit.Assert.fail(Assert.java:86)
        at org.junit.Assert.assertTrue(Assert.java:41)
        at org.junit.Assert.assertFalse(Assert.java:64)
        at org.junit.Assert.assertFalse(Assert.java:74)
        at com.gemstone.gemfire.internal.offheap.SimpleMemoryAllocatorJUnitTest.testCreate(SimpleMemoryAllocatorJUnitTest.java:194)

com.gemstone.gemfire.internal.offheap.LifecycleListenerJUnitTest > testCallbacksAreCalledAfterReuse FAILED
    java.lang.AssertionError: expected:<false> but was:<true>
        at org.junit.Assert.fail(Assert.java:88)
        at org.junit.Assert.failNotEquals(Assert.java:834)
        at org.junit.Assert.assertEquals(Assert.java:118)
        at org.junit.Assert.assertEquals(Assert.java:144)
        at com.gemstone.gemfire.internal.offheap.LifecycleListenerJUnitTest.testCallbacksAreCalledAfterReuse(LifecycleListenerJUnitTest.java:103)

com.gemstone.gemfire.internal.offheap.LifecycleListenerJUnitTest > testCallbacksAreCalledAfterReuseWithFreeTrue FAILED
    java.lang.AssertionError: expected:<false> but was:<true>
        at org.junit.Assert.fail(Assert.java:88)
        at org.junit.Assert.failNotEquals(Assert.java:834)
        at org.junit.Assert.assertEquals(Assert.java:118)
        at org.junit.Assert.assertEquals(Assert.java:144)
        at com.gemstone.gemfire.internal.offheap.LifecycleListenerJUnitTest.closeAndFree(LifecycleListenerJUnitTest.java:147)
        at com.gemstone.gemfire.internal.offheap.LifecycleListenerJUnitTest.testCallbacksAreCalledAfterReuseWithFreeTrue(LifecycleListenerJUnitTest.java:168)

com.gemstone.gemfire.internal.offheap.LifecycleListenerJUnitTest > testCallbacksAreCalledAfterCreate FAILED
    java.lang.AssertionError: expected:<false> but was:<true>
        at org.junit.Assert.fail(Assert.java:88)
        at org.junit.Assert.failNotEquals(Assert.java:834)
        at org.junit.Assert.assertEquals(Assert.java:118)
        at org.junit.Assert.assertEquals(Assert.java:144)
        at com.gemstone.gemfire.internal.offheap.LifecycleListenerJUnitTest.closeAndFree(LifecycleListenerJUnitTest.java:147)
        at com.gemstone.gemfire.internal.offheap.LifecycleListenerJUnitTest.testCallbacksAreCalledAfterCreate(LifecycleListenerJUnitTest.java:89)

1870 tests completed, 5 failed, 34 skipped
:gemfire-core:test FAILED
:gemfire-core:distributedTest
:gemfire-core:integrationTest
:gemfire-joptsimple:assemble
:gemfire-joptsimple:compileTestJava UP-TO-DATE
:gemfire-joptsimple:processTestResources UP-TO-DATE
:gemfire-joptsimple:testClasses UP-TO-DATE
:gemfire-joptsimple:checkMissedTests UP-TO-DATE
:gemfire-joptsimple:test UP-TO-DATE
:gemfire-joptsimple:check
:gemfire-joptsimple:build
:gemfire-joptsimple:distributedTest UP-TO-DATE
:gemfire-joptsimple:integrationTest UP-TO-DATE
:gemfire-json:assemble
:gemfire-json:compileTestJava UP-TO-DATE
:gemfire-json:processTestResources UP-TO-DATE
:gemfire-json:testClasses UP-TO-DATE
:gemfire-json:checkMissedTests UP-TO-DATE
:gemfire-json:test UP-TO-DATE
:gemfire-json:check
:gemfire-json:build
:gemfire-json:distributedTest UP-TO-DATE
:gemfire-json:integrationTest UP-TO-DATE
:gemfire-junit:jar
:gemfire-junit:javadoc UP-TO-DATE
:gemfire-junit:javadocJar
:gemfire-junit:sourcesJar
:gemfire-junit:signArchives SKIPPED
:gemfire-junit:assemble
:gemfire-junit:checkMissedTests
:gemfire-junit:test
:gemfire-junit:check
:gemfire-junit:build
:gemfire-junit:distributedTest
:gemfire-junit:integrationTest
:gemfire-lucene:compileTestJava
Download https://repo1.maven.org/maven2/org/apache/lucene/lucene-test-framework/5.3.0/lucene-test-framework-5.3.0.pom
Download https://repo1.maven.org/maven2/org/apache/lucene/lucene-codecs/5.3.0/lucene-codecs-5.3.0.pom
Download https://repo1.maven.org/maven2/com/carrotsearch/randomizedtesting/randomizedtesting-runner/2.1.6/randomizedtesting-runner-2.1.6.pom
Download https://repo1.maven.org/maven2/com/carrotsearch/randomizedtesting/randomizedtesting-parent/2.1.6/randomizedtesting-parent-2.1.6.pom
Download https://repo1.maven.org/maven2/org/apache/lucene/lucene-test-framework/5.3.0/lucene-test-framework-5.3.0.jar
Download https://repo1.maven.org/maven2/org/apache/lucene/lucene-codecs/5.3.0/lucene-codecs-5.3.0.jar
Download https://repo1.maven.org/maven2/com/carrotsearch/randomizedtesting/randomizedtesting-runner/2.1.6/randomizedtesting-runner-2.1.6.jar
Note: /x1/jenkins/jenkins-slave/workspace/Geode-nightly/gemfire-lucene/src/test/java/com/gemstone/gemfire/cache/lucene/internal/distributed/LuceneFunctionJUnitTest.java uses or overrides a deprecated API.
Note: Recompile with -Xlint:deprecation for details.
Note: Some input files use unchecked or unsafe operations.
Note: Recompile with -Xlint:unchecked for details.
:gemfire-lucene:processTestResources
:gemfire-lucene:testClasses
:gemfire-lucene:checkMissedTests
:gemfire-lucene:test
:gemfire-lucene:check
:gemfire-lucene:distributedTest
:gemfire-lucene:integrationTest
:gemfire-rebalancer:compileJava
:gemfire-rebalancer:processResources UP-TO-DATE
:gemfire-rebalancer:classes
:gemfire-rebalancer:jar
:gemfire-rebalancer:javadoc/x1/jenkins/jenkins-slave/workspace/Geode-nightly/gemfire-rebalancer/src/main/java/com/gemstone/gemfire/cache/util/AutoBalancer.java:103: warning - AutoBalancer#DEFAULT_SIZE_THRESHOLD_PERCENT (referenced by @value tag) is an unknown reference.
/x1/jenkins/jenkins-slave/workspace/Geode-nightly/gemfire-rebalancer/src/main/java/com/gemstone/gemfire/cache/util/AutoBalancer.java:121: warning - AutoBalancer#DEFAULT_MINIMUM_SIZE (referenced by @value tag) is an unknown reference.

2 warnings
:gemfire-rebalancer:javadocJar
:gemfire-rebalancer:sourcesJar
:gemfire-rebalancer:signArchives SKIPPED
:gemfire-rebalancer:assemble
:gemfire-rebalancer:compileTestJava
:gemfire-rebalancer:processTestResources UP-TO-DATE
:gemfire-rebalancer:testClasses
:gemfire-rebalancer:checkMissedTests
:gemfire-rebalancer:test
:gemfire-rebalancer:check
:gemfire-rebalancer:build
:gemfire-rebalancer:distributedTest
:gemfire-rebalancer:integrationTest
:gemfire-web:assemble
:gemfire-web:compileTestJavaNote: /x1/jenkins/jenkins-slave/workspace/Geode-nightly/gemfire-web/src/test/java/com/gemstone/gemfire/management/internal/web/AbstractWebTestCase.java uses unchecked or unsafe operations.
Note: Recompile with -Xlint:unchecked for details.

:gemfire-web:processTestResources UP-TO-DATE
:gemfire-web:testClasses
:gemfire-web:checkMissedTests
:gemfire-web:test
:gemfire-web:check
:gemfire-web:build
:gemfire-web:distributedTest
:gemfire-web:integrationTest
:gemfire-web-api:assemble
:gemfire-web-api:compileTestJava UP-TO-DATE
:gemfire-web-api:processTestResources UP-TO-DATE
:gemfire-web-api:testClasses UP-TO-DATE
:gemfire-web-api:checkMissedTests UP-TO-DATE
:gemfire-web-api:test UP-TO-DATE
:gemfire-web-api:check
:gemfire-web-api:build
:gemfire-web-api:distributedTest UP-TO-DATE
:gemfire-web-api:integrationTest UP-TO-DATE
:combineReports
All test reports at /x1/jenkins/jenkins-slave/workspace/Geode-nightly/build/reports/combined
:gemfire-common:precheckin
:gemfire-joptsimple:precheckin
:gemfire-json:precheckin
:gemfire-junit:precheckin
:gemfire-rebalancer:precheckin
:gemfire-web:precheckin
:gemfire-web-api:precheckin
:gemfire-assembly:uploadArchives
:gemfire-common:uploadArchives
:gemfire-joptsimple:uploadArchives
:gemfire-json:uploadArchives
:gemfire-junit:uploadArchives
:gemfire-rebalancer:uploadArchives
:gemfire-web:uploadArchives
:gemfire-web-api:uploadArchives

FAILURE: Build completed with 2 failures.

1: Task failed with an exception.
-----------
* What went wrong:
Execution failed for task ':gemfire-core:javadoc'.
> Javadoc generation failed. Generated Javadoc options file (useful for troubleshooting): '/x1/jenkins/jenkins-slave/workspace/Geode-nightly/gemfire-core/build/tmp/javadoc/javadoc.options'

* Try:
Run with --stacktrace option to get the stack trace. Run with --info or --debug option to get more log output.
==============================================================================

2: Task failed with an exception.
-----------
* What went wrong:
Execution failed for task ':gemfire-core:test'.
> There were failing tests. See the report at: file:///x1/jenkins/jenkins-slave/workspace/Geode-nightly/gemfire-core/build/reports/test/index.html

* Try:
Run with --stacktrace option to get the stack trace. Run with --info or --debug option to get more log output.
==============================================================================

BUILD FAILED

Total time: 8 hrs 8 mins 27.448 secs
Build step 'Invoke Gradle script' changed build result to FAILURE
Build step 'Invoke Gradle script' marked build as failure
Archiving artifacts
Compressed 277.86 MB of artifacts by 42.8% relative to #349
Recording test results