You are viewing a plain text version of this content. The canonical link for it is here.
Posted to builds@beam.apache.org by Apache Jenkins Server <je...@builds.apache.org> on 2023/06/01 18:51:31 UTC
Build failed in Jenkins: beam_PostCommit_Java_DataflowV2 #3112
See <https://ci-beam.apache.org/job/beam_PostCommit_Java_DataflowV2/3112/display/redirect>
Changes:
------------------------------------------
[...truncated 63.72 KB...]
go: downloading google.golang.org/grpc v1.55.0
go: downloading google.golang.org/protobuf v1.30.0
go: downloading golang.org/x/sys v0.8.0
go: downloading golang.org/x/net v0.10.0
go: downloading google.golang.org/genproto v0.0.0-20230410155749-daa745c078e1
go: downloading golang.org/x/text v0.9.0
go: added github.com/apache/beam/sdks/v2 v2.48.0
go: added github.com/golang/protobuf v1.5.3
go: added golang.org/x/net v0.10.0
go: added golang.org/x/sys v0.8.0
go: added golang.org/x/text v0.9.0
go: added google.golang.org/genproto v0.0.0-20230410155749-daa745c078e1
go: added google.golang.org/grpc v1.55.0
go: added google.golang.org/protobuf v1.30.0
+ go-licenses save github.com/apache/beam/sdks/v2/java/container --save_path=/output/licenses
W0601 15:58:05.318596 36 library.go:101] "golang.org/x/sys/unix" contains non-Go code that can't be inspected for further dependencies:
/go/pkg/mod/golang.org/x/sys@v0.8.0/unix/asm_linux_amd64.s
+ go-licenses csv github.com/apache/beam/sdks/v2/java/container
+ tee /output/licenses/list.csv
W0601 15:58:09.285325 81 library.go:101] "golang.org/x/sys/unix" contains non-Go code that can't be inspected for further dependencies:
/go/pkg/mod/golang.org/x/sys@v0.8.0/unix/asm_linux_amd64.s
github.com/apache/beam/sdks/v2/go,https://github.com/apache/beam/blob/sdks/v2.48.0/sdks/go/README.md,Apache-2.0
github.com/apache/beam/sdks/v2/java/container,https://github.com/apache/beam/blob/sdks/v2.48.0/sdks/LICENSE,Apache-2.0
github.com/golang/protobuf,https://github.com/golang/protobuf/blob/v1.5.3/LICENSE,BSD-3-Clause
golang.org/x/net,https://cs.opensource.google/go/x/net/+/v0.10.0:LICENSE,BSD-3-Clause
golang.org/x/sys/unix,https://cs.opensource.google/go/x/sys/+/v0.8.0:LICENSE,BSD-3-Clause
golang.org/x/text,https://cs.opensource.google/go/x/text/+/v0.9.0:LICENSE,BSD-3-Clause
google.golang.org/genproto/googleapis/rpc/status,https://github.com/googleapis/go-genproto/blob/daa745c078e1/LICENSE,Apache-2.0
google.golang.org/grpc,https://github.com/grpc/grpc-go/blob/v1.55.0/LICENSE,Apache-2.0
google.golang.org/protobuf,https://github.com/protocolbuffers/protobuf-go/blob/v1.30.0/LICENSE,BSD-3-Clause
+ chmod -R a+w /output/licenses
> Task :release:go-licenses:java:createLicenses
> Task :sdks:java:container:java8:copyGolangLicenses
> Task :sdks:java:container:java8:dockerPrepare
> Task :sdks:java:container:java8:docker
#1 [internal] load build definition from Dockerfile
#1 transferring dockerfile: 2.58kB done
#1 DONE 0.0s
#2 [internal] load .dockerignore
#2 transferring context: 2B done
#2 DONE 0.0s
#3 [internal] load metadata for docker.io/library/eclipse-temurin:8
#3 DONE 0.4s
#4 [ 1/16] FROM docker.io/library/eclipse-temurin:8@sha256:d4efd49db25bb331f7323b40b2cd8330f0bb64cb46bf00db5fbd837813c611d3
#4 resolve docker.io/library/eclipse-temurin:8@sha256:d4efd49db25bb331f7323b40b2cd8330f0bb64cb46bf00db5fbd837813c611d3 0.0s done
#4 CACHED
#5 [internal] load build context
#5 transferring context: 46.85MB 0.3s done
#5 DONE 0.4s
#6 [ 2/16] ADD target/slf4j-api.jar /opt/apache/beam/jars/
#6 DONE 2.5s
#7 [ 3/16] ADD target/slf4j-jdk14.jar /opt/apache/beam/jars/
#7 DONE 0.8s
#8 [ 4/16] ADD target/jcl-over-slf4j.jar /opt/apache/beam/jars/
#8 DONE 0.1s
#9 [ 5/16] ADD target/log4j-over-slf4j.jar /opt/apache/beam/jars/
#9 DONE 0.0s
#10 [ 6/16] ADD target/log4j-to-slf4j.jar /opt/apache/beam/jars/
#10 DONE 0.1s
#11 [ 7/16] ADD target/beam-sdks-java-harness.jar /opt/apache/beam/jars/
#11 DONE 0.1s
#12 [ 8/16] COPY target/jamm.jar target/open-module-agent*.jar /opt/apache/beam/jars/
#12 DONE 0.1s
#13 [ 9/16] COPY target/linux_amd64/boot /opt/apache/beam/
#13 DONE 0.2s
#14 [10/16] COPY target/LICENSE /opt/apache/beam/
#14 DONE 0.0s
#15 [11/16] COPY target/NOTICE /opt/apache/beam/
#15 DONE 0.0s
#16 [12/16] ADD target/third_party_licenses /opt/apache/beam/third_party_licenses/
#16 DONE 0.2s
#17 [13/16] COPY target/LICENSE target/options/* /opt/apache/beam/options/
#17 DONE 0.1s
#18 [14/16] COPY target/go-licenses/* /opt/apache/beam/third_party_licenses/golang/
#18 DONE 0.1s
#19 [15/16] RUN if [ "true" = "false" ] ; then rm -rf /opt/apache/beam/third_party_licenses ; fi
#19 DONE 0.4s
#20 [16/16] COPY target/profiler/* /opt/google_cloud_profiler/
#20 DONE 0.1s
#21 exporting to image
#21 exporting layers
#21 exporting layers 0.2s done
#21 writing image sha256:5423b5901b49ca835905f7fc627da8f7acb9fd345993372d0ae35c989915e3c6 0.0s done
#21 naming to docker.io/apache/beam_java8_sdk:2.49.0.dev done
#21 DONE 0.3s
> Task :runners:google-cloud-dataflow-java:buildAndPushDockerJavaContainer
WARNING: `gcloud docker` will not be supported for Docker client versions above 18.03.
As an alternative, use `gcloud auth configure-docker` to configure `docker` to
use `gcloud` as a credential helper, then use `docker` as you would for non-GCR
registries, e.g. `docker pull gcr.io/project-id/my-image`. Add
`--verbosity=error` to silence this warning: `gcloud docker
--verbosity=error -- pull gcr.io/project-id/my-image`.
See: https://cloud.google.com/container-registry/docs/support/deprecation-notices#gcloud-docker
The push refers to repository [us.gcr.io/apache-beam-testing/java-postcommit-it/java]
81df10478b94: Preparing
5f70bf18a086: Preparing
f31db45fabd3: Preparing
abb2932121c3: Preparing
84e7d97db48c: Preparing
ab3b12a06427: Preparing
fe1ccaebfc21: Preparing
ef62067bc87c: Preparing
70e0f11388f1: Preparing
3d7b33e09818: Preparing
aa89f79da058: Preparing
74d88a675292: Preparing
92245dcb2a89: Preparing
fee080611480: Preparing
eb357eaa5b44: Preparing
3eb3677be944: Preparing
9091f97c3a30: Preparing
c45c46033aa8: Preparing
b8a36d10656a: Preparing
70e0f11388f1: Waiting
3d7b33e09818: Waiting
ef62067bc87c: Waiting
74d88a675292: Waiting
aa89f79da058: Waiting
eb357eaa5b44: Waiting
ab3b12a06427: Waiting
3eb3677be944: Waiting
9091f97c3a30: Waiting
92245dcb2a89: Waiting
fee080611480: Waiting
fe1ccaebfc21: Waiting
5f70bf18a086: Layer already exists
abb2932121c3: Pushed
f31db45fabd3: Pushed
ab3b12a06427: Pushed
81df10478b94: Pushed
84e7d97db48c: Pushed
fe1ccaebfc21: Pushed
70e0f11388f1: Pushed
3d7b33e09818: Pushed
aa89f79da058: Pushed
74d88a675292: Pushed
ef62067bc87c: Pushed
3eb3677be944: Layer already exists
9091f97c3a30: Layer already exists
c45c46033aa8: Layer already exists
b8a36d10656a: Layer already exists
92245dcb2a89: Pushed
fee080611480: Pushed
eb357eaa5b44: Pushed
20230601155737: digest: sha256:fdd1db7800efc2125df4e0257b22d790bf2ef602452dc382e9737b5f0a58069b size: 4296
> Task :runners:google-cloud-dataflow-java:coreSDKJavaRunnerV2IntegrationTest NO-SOURCE
> Task :runners:google-cloud-dataflow-java:examplesJavaRunnerV2IntegrationTest
***********************************************************
***********************************************************
**********************Set Up Pubsub************************
The Pub/Sub topic has been set up for this example: projects/apache-beam-testing/topics/testpipeline-jenkins-0601155840-82aad585
The Pub/Sub subscription has been set up for this example: projects/apache-beam-testing/subscriptions/testpipeline-jenkins-0601155840-82aad585
*************************Tear Down*************************
The Pub/Sub topic has been deleted: projects/apache-beam-testing/topics/testpipeline-jenkins-0601155840-82aad585
The Pub/Sub subscription has been deleted: projects/apache-beam-testing/subscriptions/testpipeline-jenkins-0601155840-82aad585
***********************************************************
***********************************************************
***********************************************************
***********************************************************
**********************Set Up Pubsub************************
The Pub/Sub topic has been set up for this example: projects/apache-beam-testing/topics/testpipeline-jenkins-0601155840-bcbce317
The Pub/Sub subscription has been set up for this example: projects/apache-beam-testing/subscriptions/testpipeline-jenkins-0601155840-bcbce317
*************************Tear Down*************************
The Pub/Sub topic has been deleted: projects/apache-beam-testing/topics/testpipeline-jenkins-0601155840-bcbce317
The Pub/Sub subscription has been deleted: projects/apache-beam-testing/subscriptions/testpipeline-jenkins-0601155840-bcbce317
***********************************************************
***********************************************************
> Task :runners:google-cloud-dataflow-java:googleCloudPlatformRunnerV2IntegrationTest
org.apache.beam.sdk.io.gcp.spanner.changestreams.it.SpannerChangeStreamOrderedByTimestampAndTransactionIdIT > testTransactionBoundaries FAILED
java.lang.RuntimeException at SpannerChangeStreamOrderedByTimestampAndTransactionIdIT.java:197
98 tests completed, 1 failed, 4 skipped
> Task :runners:google-cloud-dataflow-java:googleCloudPlatformRunnerV2IntegrationTest FAILED
> Task :runners:google-cloud-dataflow-java:cleanUpDockerJavaImages
Untagged: us.gcr.io/apache-beam-testing/java-postcommit-it/java:20230601155737
Untagged: us.gcr.io/apache-beam-testing/java-postcommit-it/java@sha256:fdd1db7800efc2125df4e0257b22d790bf2ef602452dc382e9737b5f0a58069b
Deleted: sha256:5423b5901b49ca835905f7fc627da8f7acb9fd345993372d0ae35c989915e3c6
WARNING: Successfully resolved tag to sha256, but it is recommended to use sha256 directly.
Tag: [us.gcr.io/apache-beam-testing/java-postcommit-it/java:20230601155737]
- referencing digest: [us.gcr.io/apache-beam-testing/java-postcommit-it/java@sha256:fdd1db7800efc2125df4e0257b22d790bf2ef602452dc382e9737b5f0a58069b]
Deleted [[us.gcr.io/apache-beam-testing/java-postcommit-it/java:20230601155737] (referencing [us.gcr.io/apache-beam-testing/java-postcommit-it/java@sha256:fdd1db7800efc2125df4e0257b22d790bf2ef602452dc382e9737b5f0a58069b])].
Removing untagged image us.gcr.io/apache-beam-testing/java-postcommit-it/java@sha256:fdd1db7800efc2125df4e0257b22d790bf2ef602452dc382e9737b5f0a58069b
Digests:
- us.gcr.io/apache-beam-testing/java-postcommit-it/java@sha256:fdd1db7800efc2125df4e0257b22d790bf2ef602452dc382e9737b5f0a58069b
Deleted [us.gcr.io/apache-beam-testing/java-postcommit-it/java@sha256:fdd1db7800efc2125df4e0257b22d790bf2ef602452dc382e9737b5f0a58069b].
FAILURE: Build failed with an exception.
* What went wrong:
Execution failed for task ':runners:google-cloud-dataflow-java:googleCloudPlatformRunnerV2IntegrationTest'.
> There were failing tests. See the report at: file://<https://ci-beam.apache.org/job/beam_PostCommit_Java_DataflowV2/ws/src/runners/google-cloud-dataflow-java/build/reports/tests/googleCloudPlatformRunnerV2IntegrationTest/index.html>
* Try:
> Run with --stacktrace option to get the stack trace.
> Run with --info or --debug option to get more log output.
* Get more help at https://help.gradle.org
Deprecated Gradle features were used in this build, making it incompatible with Gradle 8.0.
You can use '--warning-mode all' to show the individual deprecation warnings and determine if they come from your own scripts or plugins.
See https://docs.gradle.org/7.5.1/userguide/command_line_interface.html#sec:command_line_warnings
Execution optimizations have been disabled for 1 invalid unit(s) of work during this build to ensure correctness.
Please consult deprecation warnings for more details.
BUILD FAILED in 2h 54m 6s
152 actionable tasks: 98 executed, 50 from cache, 4 up-to-date
Publishing build scan...
https://ge.apache.org/s/fg63fo2koh5rc
Build step 'Invoke Gradle script' changed build result to FAILURE
Build step 'Invoke Gradle script' marked build as failure
---------------------------------------------------------------------
To unsubscribe, e-mail: builds-unsubscribe@beam.apache.org
For additional commands, e-mail: builds-help@beam.apache.org
Jenkins build is back to normal : beam_PostCommit_Java_DataflowV2 #3115
Posted by Apache Jenkins Server <je...@builds.apache.org>.
See <https://ci-beam.apache.org/job/beam_PostCommit_Java_DataflowV2/3115/display/redirect>
---------------------------------------------------------------------
To unsubscribe, e-mail: builds-unsubscribe@beam.apache.org
For additional commands, e-mail: builds-help@beam.apache.org
beam_PostCommit_Java_DataflowV2 - Build # 3114 - Aborted!
Posted by Apache Jenkins Server <je...@builds.apache.org>.
beam_PostCommit_Java_DataflowV2 - Build # 3114 - Aborted:
Check console output at https://ci-beam.apache.org/job/beam_PostCommit_Java_DataflowV2/3114/ to view the results.
beam_PostCommit_Java_DataflowV2 - Build # 3113 - Aborted!
Posted by Apache Jenkins Server <je...@builds.apache.org>.
beam_PostCommit_Java_DataflowV2 - Build # 3113 - Aborted:
Check console output at https://ci-beam.apache.org/job/beam_PostCommit_Java_DataflowV2/3113/ to view the results.