You are viewing a plain text version of this content. The canonical link for it is here.
Posted to dev@zookeeper.apache.org by Apache Jenkins Server <je...@builds.apache.org> on 2017/10/25 15:52:30 UTC

Failed: ZOOKEEPER- PreCommit Build #1119

Build: https://builds.apache.org/job/PreCommit-ZOOKEEPER-github-pr-build/1119/

###################################################################################
########################## LAST 60 LINES OF THE CONSOLE ###########################
[...truncated 74.21 MB...]
     [exec]     +0 tests included.  The patch appears to be a documentation patch that doesn't require tests.
     [exec] 
     [exec]     +1 javadoc.  The javadoc tool did not generate any warning messages.
     [exec] 
     [exec]     +1 javac.  The applied patch does not increase the total number of javac compiler warnings.
     [exec] 
     [exec]     +1 findbugs.  The patch does not introduce any new Findbugs (version 3.0.1) warnings.
     [exec] 
     [exec]     +1 release audit.  The applied patch does not increase the total number of release audit warnings.
     [exec] 
     [exec]     -1 core tests.  The patch failed core unit tests.
     [exec] 
     [exec]     +1 contrib tests.  The patch passed contrib unit tests.
     [exec] 
     [exec] Test results: https://builds.apache.org/job/PreCommit-ZOOKEEPER-github-pr-build/1119//testReport/
     [exec] Findbugs warnings: https://builds.apache.org/job/PreCommit-ZOOKEEPER-github-pr-build/1119//artifact/trunk/build/test/findbugs/newPatchFindbugsWarnings.html
     [exec] Console output: https://builds.apache.org/job/PreCommit-ZOOKEEPER-github-pr-build/1119//console
     [exec] 
     [exec] This message is automatically generated.
     [exec] 
     [exec] 
     [exec] ======================================================================
     [exec] ======================================================================
     [exec]     Adding comment to Jira.
     [exec] ======================================================================
     [exec] ======================================================================
     [exec] 
     [exec] 
     [exec] Comment added.
     [exec] e9c18c27b70aef3efe68541f3e297163474e9e57 logged out
     [exec] 
     [exec] 
     [exec] ======================================================================
     [exec] ======================================================================
     [exec]     Finished build.
     [exec] ======================================================================
     [exec] ======================================================================
     [exec] 
     [exec] 
     [exec] mv: '/home/jenkins/jenkins-slave/workspace/PreCommit-ZOOKEEPER-github-pr-build/patchprocess' and '/home/jenkins/jenkins-slave/workspace/PreCommit-ZOOKEEPER-github-pr-build/patchprocess' are the same file

BUILD FAILED
/home/jenkins/jenkins-slave/workspace/PreCommit-ZOOKEEPER-github-pr-build/build.xml:1713: exec returned: 1

Total time: 21 minutes 26 seconds
Build step 'Execute shell' marked build as failure
Archiving artifacts
Setting JDK_1_7_LATEST__HOME=/home/jenkins/tools/java/latest1.7
Recording test results
Setting JDK_1_7_LATEST__HOME=/home/jenkins/tools/java/latest1.7
Setting JDK_1_7_LATEST__HOME=/home/jenkins/tools/java/latest1.7
[description-setter] Description set: ZOOKEEPER-2690
Putting comment on the pull request
Setting JDK_1_7_LATEST__HOME=/home/jenkins/tools/java/latest1.7
Email was triggered for: Failure - Any
Sending email for trigger: Failure - Any
Setting JDK_1_7_LATEST__HOME=/home/jenkins/tools/java/latest1.7
Setting JDK_1_7_LATEST__HOME=/home/jenkins/tools/java/latest1.7
Setting JDK_1_7_LATEST__HOME=/home/jenkins/tools/java/latest1.7



###################################################################################
############################## FAILED TESTS (if any) ##############################
3 tests failed.
FAILED:  org.apache.zookeeper.server.quorum.QuorumRequestPipelineTest.testSync[2]

Error Message:
null

Stack Trace:
java.lang.NullPointerException
	at org.apache.zookeeper.server.quorum.QuorumRequestPipelineTest.tearDown(QuorumRequestPipelineTest.java:82)


FAILED:  org.apache.zookeeper.server.quorum.ReconfigFailureCasesTest.testLeaderTimesoutOnNewQuorum

Error Message:
expected:<[leaderelection]> but was:<[following]>

Stack Trace:
junit.framework.AssertionFailedError: expected:<[leaderelection]> but was:<[following]>
	at org.apache.zookeeper.server.quorum.ReconfigFailureCasesTest.testLeaderTimesoutOnNewQuorum(ReconfigFailureCasesTest.java:198)
	at org.apache.zookeeper.JUnit4ZKTestRunner$LoggedInvokeMethod.evaluate(JUnit4ZKTestRunner.java:79)


FAILED:  org.apache.zookeeper.test.ReconfigTest.testQuorumSystemChange

Error Message:
KeeperErrorCode = Session expired

Stack Trace:
org.apache.zookeeper.KeeperException$SessionExpiredException: KeeperErrorCode = Session expired
	at org.apache.zookeeper.KeeperException.create(KeeperException.java:134)
	at org.apache.zookeeper.KeeperException.create(KeeperException.java:54)
	at org.apache.zookeeper.admin.ZooKeeperAdmin.reconfigure(ZooKeeperAdmin.java:187)
	at org.apache.zookeeper.admin.ZooKeeperAdmin.reconfigure(ZooKeeperAdmin.java:204)
	at org.apache.zookeeper.test.ReconfigTest.reconfig(ReconfigTest.java:84)
	at org.apache.zookeeper.test.ReconfigTest.testQuorumSystemChange(ReconfigTest.java:870)
	at org.apache.zookeeper.JUnit4ZKTestRunner$LoggedInvokeMethod.evaluate(JUnit4ZKTestRunner.java:79)

Success: ZOOKEEPER- PreCommit Build #1121

Posted by Apache Jenkins Server <je...@builds.apache.org>.
Build: https://builds.apache.org/job/PreCommit-ZOOKEEPER-github-pr-build/1121/

###################################################################################
########################## LAST 60 LINES OF THE CONSOLE ###########################
[...truncated 74.09 MB...]
     [exec]       
     [exec] 
     [exec]     +1 @author.  The patch does not contain any @author tags.
     [exec] 
     [exec]     +0 tests included.  The patch appears to be a documentation patch that doesn't require tests.
     [exec] 
     [exec]     +1 javadoc.  The javadoc tool did not generate any warning messages.
     [exec] 
     [exec]     +1 javac.  The applied patch does not increase the total number of javac compiler warnings.
     [exec] 
     [exec]     +1 findbugs.  The patch does not introduce any new Findbugs (version 3.0.1) warnings.
     [exec] 
     [exec]     +1 release audit.  The applied patch does not increase the total number of release audit warnings.
     [exec] 
     [exec]     +1 core tests.  The patch passed core unit tests.
     [exec] 
     [exec]     +1 contrib tests.  The patch passed contrib unit tests.
     [exec] 
     [exec] Test results: https://builds.apache.org/job/PreCommit-ZOOKEEPER-github-pr-build/1121//testReport/
     [exec] Findbugs warnings: https://builds.apache.org/job/PreCommit-ZOOKEEPER-github-pr-build/1121//artifact/trunk/build/test/findbugs/newPatchFindbugsWarnings.html
     [exec] Console output: https://builds.apache.org/job/PreCommit-ZOOKEEPER-github-pr-build/1121//console
     [exec] 
     [exec] This message is automatically generated.
     [exec] 
     [exec] 
     [exec] ======================================================================
     [exec] ======================================================================
     [exec]     Adding comment to Jira.
     [exec] ======================================================================
     [exec] ======================================================================
     [exec] 
     [exec] 
     [exec] Error: No value specified for option "issue"
     [exec] f184993705b43ef4010f3483100eab574ef17a20 logged out
     [exec] 
     [exec] 
     [exec] ======================================================================
     [exec] ======================================================================
     [exec]     Finished build.
     [exec] ======================================================================
     [exec] ======================================================================
     [exec] 
     [exec] 
     [exec] mv: '/home/jenkins/jenkins-slave/workspace/PreCommit-ZOOKEEPER-github-pr-build/patchprocess' and '/home/jenkins/jenkins-slave/workspace/PreCommit-ZOOKEEPER-github-pr-build/patchprocess' are the same file

BUILD SUCCESSFUL
Total time: 21 minutes 37 seconds
Archiving artifacts
Setting JDK_1_7_LATEST__HOME=/home/jenkins/tools/java/latest1.7
Recording test results
Setting JDK_1_7_LATEST__HOME=/home/jenkins/tools/java/latest1.7
Setting JDK_1_7_LATEST__HOME=/home/jenkins/tools/java/latest1.7
[description-setter] Description set: ZOOKEEPER-1703
Setting JDK_1_7_LATEST__HOME=/home/jenkins/tools/java/latest1.7
Email was triggered for: Success
Sending email for trigger: Success
Setting JDK_1_7_LATEST__HOME=/home/jenkins/tools/java/latest1.7
Setting JDK_1_7_LATEST__HOME=/home/jenkins/tools/java/latest1.7
Setting JDK_1_7_LATEST__HOME=/home/jenkins/tools/java/latest1.7



###################################################################################
############################## FAILED TESTS (if any) ##############################
All tests passed

Failed: ZOOKEEPER- PreCommit Build #1120

Posted by Apache Jenkins Server <je...@builds.apache.org>.
Build: https://builds.apache.org/job/PreCommit-ZOOKEEPER-github-pr-build/1120/

###################################################################################
########################## LAST 60 LINES OF THE CONSOLE ###########################
[...truncated 71.85 MB...]
     [exec]     +0 tests included.  The patch appears to be a documentation patch that doesn't require tests.
     [exec] 
     [exec]     +1 javadoc.  The javadoc tool did not generate any warning messages.
     [exec] 
     [exec]     +1 javac.  The applied patch does not increase the total number of javac compiler warnings.
     [exec] 
     [exec]     +1 findbugs.  The patch does not introduce any new Findbugs (version 3.0.1) warnings.
     [exec] 
     [exec]     +1 release audit.  The applied patch does not increase the total number of release audit warnings.
     [exec] 
     [exec]     -1 core tests.  The patch failed core unit tests.
     [exec] 
     [exec]     +1 contrib tests.  The patch passed contrib unit tests.
     [exec] 
     [exec] Test results: https://builds.apache.org/job/PreCommit-ZOOKEEPER-github-pr-build/1120//testReport/
     [exec] Findbugs warnings: https://builds.apache.org/job/PreCommit-ZOOKEEPER-github-pr-build/1120//artifact/trunk/build/test/findbugs/newPatchFindbugsWarnings.html
     [exec] Console output: https://builds.apache.org/job/PreCommit-ZOOKEEPER-github-pr-build/1120//console
     [exec] 
     [exec] This message is automatically generated.
     [exec] 
     [exec] 
     [exec] ======================================================================
     [exec] ======================================================================
     [exec]     Adding comment to Jira.
     [exec] ======================================================================
     [exec] ======================================================================
     [exec] 
     [exec] 
     [exec] Comment added.
     [exec] 93b81ba5b14ff647f7c7387c340746718900fd99 logged out
     [exec] 
     [exec] 
     [exec] ======================================================================
     [exec] ======================================================================
     [exec]     Finished build.
     [exec] ======================================================================
     [exec] ======================================================================
     [exec] 
     [exec] 
     [exec] mv: '/home/jenkins/jenkins-slave/workspace/PreCommit-ZOOKEEPER-github-pr-build/patchprocess' and '/home/jenkins/jenkins-slave/workspace/PreCommit-ZOOKEEPER-github-pr-build/patchprocess' are the same file

BUILD FAILED
/home/jenkins/jenkins-slave/workspace/PreCommit-ZOOKEEPER-github-pr-build/build.xml:1713: exec returned: 1

Total time: 13 minutes 12 seconds
Build step 'Execute shell' marked build as failure
Archiving artifacts
Setting JDK_1_7_LATEST__HOME=/home/jenkins/tools/java/latest1.7
Recording test results
Setting JDK_1_7_LATEST__HOME=/home/jenkins/tools/java/latest1.7
Setting JDK_1_7_LATEST__HOME=/home/jenkins/tools/java/latest1.7
[description-setter] Description set: ZOOKEEPER-2338
Putting comment on the pull request
Setting JDK_1_7_LATEST__HOME=/home/jenkins/tools/java/latest1.7
Email was triggered for: Failure - Any
Sending email for trigger: Failure - Any
Setting JDK_1_7_LATEST__HOME=/home/jenkins/tools/java/latest1.7
Setting JDK_1_7_LATEST__HOME=/home/jenkins/tools/java/latest1.7
Setting JDK_1_7_LATEST__HOME=/home/jenkins/tools/java/latest1.7



###################################################################################
############################## FAILED TESTS (if any) ##############################
All tests passed