You are viewing a plain text version of this content. The canonical link for it is here.
Posted to dev@bookkeeper.apache.org by Apache Jenkins Server <je...@builds.apache.org> on 2013/06/29 14:40:51 UTC
Build failed in Jenkins: bookkeeper-trunk #264
See <https://builds.apache.org/job/bookkeeper-trunk/264/>
------------------------------------------
[...truncated 704 lines...]
[INFO]
[INFO] --- maven-resources-plugin:2.4.3:testResources (default-testResources) @ hedwig-client ---
[INFO] Using 'UTF-8' encoding to copy filtered resources.
[INFO] skip non existing resourceDirectory <https://builds.apache.org/job/bookkeeper-trunk/ws/hedwig-client/src/test/resources>
[INFO] Copying 3 resources
[INFO]
[INFO] --- maven-compiler-plugin:3.0:testCompile (default-testCompile) @ hedwig-client ---
[INFO] Changes detected - recompiling the module!
[INFO] Compiling 4 source files to <https://builds.apache.org/job/bookkeeper-trunk/ws/hedwig-client/target/test-classes>
[INFO]
[INFO] --- maven-surefire-plugin:2.9:test (default-test) @ hedwig-client ---
[INFO] Surefire report directory: <https://builds.apache.org/job/bookkeeper-trunk/ws/hedwig-client/target/surefire-reports>
-------------------------------------------------------
T E S T S
-------------------------------------------------------
-------------------------------------------------------
T E S T S
-------------------------------------------------------
Running org.apache.hedwig.client.AppTest
Tests run: 1, Failures: 0, Errors: 0, Skipped: 0, Time elapsed: 0.022 sec
Running org.apache.hedwig.util.TestFileUtils
Tests run: 1, Failures: 0, Errors: 0, Skipped: 0, Time elapsed: 0.062 sec
Running org.apache.hedwig.util.TestHedwigSocketAddress
Tests run: 8, Failures: 0, Errors: 0, Skipped: 0, Time elapsed: 0.032 sec
Running org.apache.hedwig.util.TestPathUtils
Tests run: 2, Failures: 0, Errors: 0, Skipped: 0, Time elapsed: 0.025 sec
Results :
Tests run: 12, Failures: 0, Errors: 0, Skipped: 0
[INFO]
[INFO] --- maven-jar-plugin:2.3.1:jar (default-jar) @ hedwig-client ---
[INFO] Building jar: <https://builds.apache.org/job/bookkeeper-trunk/ws/hedwig-client/target/hedwig-client-4.3.0-SNAPSHOT.jar>
[INFO]
[INFO] >>> findbugs-maven-plugin:2.5.2:check (default-cli) @ hedwig-client >>>
[INFO]
[INFO] --- findbugs-maven-plugin:2.5.2:findbugs (findbugs) @ hedwig-client ---
[INFO] Fork Value is true
[INFO] Done FindBugs Analysis....
[INFO]
[INFO] <<< findbugs-maven-plugin:2.5.2:check (default-cli) @ hedwig-client <<<
[INFO]
[INFO] --- findbugs-maven-plugin:2.5.2:check (default-cli) @ hedwig-client ---
[INFO] BugInstance size is 0
[INFO] Error size is 0
[INFO] No errors/warnings found
[INFO]
[INFO] ------------------------------------------------------------------------
[INFO] Building hedwig-server 4.3.0-SNAPSHOT
[INFO] ------------------------------------------------------------------------
[INFO]
[INFO] --- maven-clean-plugin:2.5:clean (default-clean) @ hedwig-server ---
[INFO]
[INFO] --- apache-rat-plugin:0.7:check (default-cli) @ hedwig-server ---
[INFO] Exclude: **/p12.pass
[INFO]
[INFO] --- maven-remote-resources-plugin:1.1:process (default) @ hedwig-server ---
[INFO]
[INFO] --- maven-resources-plugin:2.4.3:resources (default-resources) @ hedwig-server ---
[INFO] Using 'UTF-8' encoding to copy filtered resources.
[INFO] Copying 5 resources
[INFO] Copying 3 resources
[INFO]
[INFO] --- maven-compiler-plugin:3.0:compile (default-compile) @ hedwig-server ---
[INFO] Changes detected - recompiling the module!
[INFO] Compiling 100 source files to <https://builds.apache.org/job/bookkeeper-trunk/ws/hedwig-server/target/classes>
[INFO]
[INFO] --- maven-antrun-plugin:1.6:run (createbuilddir) @ hedwig-server ---
[INFO] Executing tasks
main:
[mkdir] Created dir: <https://builds.apache.org/job/bookkeeper-trunk/ws/hedwig-server/target/zk_clientbase_build>
[INFO] Executed tasks
[INFO]
[INFO] --- maven-resources-plugin:2.4.3:testResources (default-testResources) @ hedwig-server ---
[INFO] Using 'UTF-8' encoding to copy filtered resources.
[INFO] Copying 1 resource
[INFO] Copying 3 resources
[INFO]
[INFO] --- maven-compiler-plugin:3.0:testCompile (default-testCompile) @ hedwig-server ---
[INFO] Changes detected - recompiling the module!
[INFO] Compiling 53 source files to <https://builds.apache.org/job/bookkeeper-trunk/ws/hedwig-server/target/test-classes>
[INFO]
[INFO] --- maven-surefire-plugin:2.9:test (default-test) @ hedwig-server ---
[INFO] Surefire report directory: <https://builds.apache.org/job/bookkeeper-trunk/ws/hedwig-server/target/surefire-reports>
-------------------------------------------------------
T E S T S
-------------------------------------------------------
-------------------------------------------------------
T E S T S
-------------------------------------------------------
Running org.apache.hedwig.server.integration.TestHedwigHubProxy
Tests run: 50, Failures: 0, Errors: 0, Skipped: 0, Time elapsed: 32.218 sec
Running org.apache.hedwig.server.integration.TestHedwigHubSSL
Tests run: 50, Failures: 0, Errors: 0, Skipped: 0, Time elapsed: 56.057 sec
Running org.apache.hedwig.server.integration.TestHedwigHubRegular
Tests run: 69, Failures: 18, Errors: 20, Skipped: 0, Time elapsed: 25.925 sec <<< FAILURE!
Running org.apache.hedwig.server.integration.TestHedwigRegion
Tests run: 6, Failures: 0, Errors: 0, Skipped: 0, Time elapsed: 107.41 sec
Running org.apache.hedwig.server.filter.TestMessageFilter
Tests run: 9, Failures: 0, Errors: 0, Skipped: 0, Time elapsed: 7.257 sec
Running org.apache.hedwig.server.netty.TestServerStats
Tests run: 1, Failures: 0, Errors: 0, Skipped: 0, Time elapsed: 0.126 sec
Running org.apache.hedwig.server.netty.TestPubSubServer
Tests run: 5, Failures: 0, Errors: 0, Skipped: 0, Time elapsed: 1.216 sec
Running org.apache.hedwig.server.subscriptions.TestUpdateSubscriptionState
Tests run: 2, Failures: 0, Errors: 0, Skipped: 0, Time elapsed: 107.311 sec
Running org.apache.hedwig.server.subscriptions.TestMMSubscriptionManager
Tests run: 1, Failures: 0, Errors: 0, Skipped: 0, Time elapsed: 1.117 sec
Running org.apache.hedwig.server.meta.TestMetadataManagerFactory
Tests run: 4, Failures: 0, Errors: 0, Skipped: 0, Time elapsed: 1.719 sec
Running org.apache.hedwig.server.meta.TestFactoryLayout
Tests run: 2, Failures: 0, Errors: 0, Skipped: 0, Time elapsed: 0.817 sec
Running org.apache.hedwig.server.meta.TestMetadataManager
Tests run: 6, Failures: 0, Errors: 0, Skipped: 0, Time elapsed: 1.241 sec
Running org.apache.hedwig.server.topics.TestHubInfo
Tests run: 1, Failures: 0, Errors: 0, Skipped: 0, Time elapsed: 0.257 sec
Running org.apache.hedwig.server.topics.TestConcurrentTopicAcquisition
Tests run: 1, Failures: 0, Errors: 0, Skipped: 0, Time elapsed: 6.291 sec
Running org.apache.hedwig.server.topics.TestMMTopicManager
Tests run: 14, Failures: 0, Errors: 0, Skipped: 0, Time elapsed: 29.058 sec
Running org.apache.hedwig.server.topics.TestZkTopicManager
Tests run: 7, Failures: 0, Errors: 0, Skipped: 0, Time elapsed: 14.655 sec
Running org.apache.hedwig.server.topics.TestHubLoad
Tests run: 1, Failures: 0, Errors: 0, Skipped: 0, Time elapsed: 0.25 sec
Running org.apache.hedwig.server.persistence.TestBookKeeperPersistenceManagerBlackBox
Tests run: 1, Failures: 0, Errors: 0, Skipped: 0, Time elapsed: 1.34 sec
Running org.apache.hedwig.server.persistence.TestReadAheadCacheWhiteBox
Tests run: 10, Failures: 0, Errors: 0, Skipped: 0, Time elapsed: 10.234 sec
Running org.apache.hedwig.server.persistence.MessageBoundedPersistenceTest
Tests run: 4, Failures: 0, Errors: 0, Skipped: 0, Time elapsed: 35.534 sec
Running org.apache.hedwig.server.persistence.TestLocalDBPersistenceManagerBlackBox
Tests run: 1, Failures: 0, Errors: 0, Skipped: 0, Time elapsed: 2 sec
Running org.apache.hedwig.server.persistence.TestReadAheadCacheBlackBox
Tests run: 1, Failures: 0, Errors: 0, Skipped: 0, Time elapsed: 2.009 sec
Running org.apache.hedwig.server.persistence.TestBookkeeperPersistenceManagerWhiteBox
Tests run: 5, Failures: 0, Errors: 0, Skipped: 0, Time elapsed: 3.101 sec
Running org.apache.hedwig.server.persistence.TestBookKeeperPersistenceManager
Tests run: 18, Failures: 0, Errors: 0, Skipped: 0, Time elapsed: 55.081 sec
Running org.apache.hedwig.server.persistence.TestDeadlock
Tests run: 1, Failures: 0, Errors: 0, Skipped: 0, Time elapsed: 56.468 sec
Running org.apache.hedwig.server.TestBackwardCompat
Tests run: 6, Failures: 0, Errors: 0, Skipped: 0, Time elapsed: 14.724 sec
Running org.apache.hedwig.server.TestPubSubServerStartup
Tests run: 1, Failures: 0, Errors: 0, Skipped: 0, Time elapsed: 1.469 sec
Running org.apache.hedwig.server.delivery.TestFIFODeliveryManager
Tests run: 2, Failures: 0, Errors: 0, Skipped: 0, Time elapsed: 2.454 sec
Running org.apache.hedwig.server.delivery.TestThrottlingDelivery
Tests run: 2, Failures: 0, Errors: 0, Skipped: 0, Time elapsed: 21.016 sec
Running org.apache.hedwig.server.handlers.TestBaseHandler
Tests run: 3, Failures: 0, Errors: 0, Skipped: 0, Time elapsed: 0.252 sec
Running org.apache.hedwig.server.handlers.TestSubUnsubHandler
Tests run: 2, Failures: 0, Errors: 0, Skipped: 0, Time elapsed: 0.979 sec
Running org.apache.hedwig.client.netty.TestMultiplexing
Tests run: 3, Failures: 0, Errors: 0, Skipped: 0, Time elapsed: 21.176 sec
Running org.apache.hedwig.client.TestPubSubClient
Tests run: 36, Failures: 0, Errors: 0, Skipped: 0, Time elapsed: 31.733 sec
Running org.apache.hedwig.client.TestSubAfterCloseSub
Tests run: 3, Failures: 0, Errors: 0, Skipped: 0, Time elapsed: 6.411 sec
Running org.apache.hedwig.zookeeper.TestZkUtils
Tests run: 1, Failures: 0, Errors: 0, Skipped: 0, Time elapsed: 0.532 sec
Results :
Failed tests: testSyncUnsubscribeWithoutSubscription[1](org.apache.hedwig.server.integration.TestHedwigHubRegular): expected:<0> but was:<7>
testAsyncUnsubscribeWithoutSubscription[1](org.apache.hedwig.server.integration.TestHedwigHubRegular): expected:<0> but was:<7>
testCloseSubscription[1](org.apache.hedwig.server.integration.TestHedwigHubRegular): expected:<0> but was:<7>
testStartDeliveryTwice[1](org.apache.hedwig.server.integration.TestHedwigHubRegular): expected:<0> but was:<7>
testStopDelivery[1](org.apache.hedwig.server.integration.TestHedwigHubRegular): expected:<0> but was:<7>
testConsumedMessagesInOrder[1](org.apache.hedwig.server.integration.TestHedwigHubRegular): expected:<0> but was:<8>
testCreateSubscriptionFailure[1](org.apache.hedwig.server.integration.TestHedwigHubRegular): expected:<0> but was:<8>
testCreateSubscriptionSuccess[1](org.apache.hedwig.server.integration.TestHedwigHubRegular): expected:<0> but was:<8>
testAttachToSubscriptionFailure[1](org.apache.hedwig.server.integration.TestHedwigHubRegular): expected:<0> but was:<8>
testSyncSubscribeWithInvalidSubscriberId[1](org.apache.hedwig.server.integration.TestHedwigHubRegular): expected:<0> but was:<8>
testAsyncSubscribeWithInvalidSubscriberId[1](org.apache.hedwig.server.integration.TestHedwigHubRegular): expected:<0> but was:<8>
testSyncUnsubscribeWithInvalidSubscriberId[1](org.apache.hedwig.server.integration.TestHedwigHubRegular): expected:<0> but was:<8>
testAsyncUnsubscribeWithInvalidSubscriberId[1](org.apache.hedwig.server.integration.TestHedwigHubRegular): expected:<0> but was:<8>
testSyncHubSubscribeWithInvalidSubscriberId[1](org.apache.hedwig.server.integration.TestHedwigHubRegular): expected:<0> but was:<8>
testAsyncHubSubscribeWithInvalidSubscriberId[1](org.apache.hedwig.server.integration.TestHedwigHubRegular): expected:<0> but was:<8>
testSyncHubUnsubscribeWithInvalidSubscriberId[1](org.apache.hedwig.server.integration.TestHedwigHubRegular): expected:<0> but was:<8>
testAsyncHubUnsubscribeWithInvalidSubscriberId[1](org.apache.hedwig.server.integration.TestHedwigHubRegular): expected:<0> but was:<8>
testPublishWithBookKeeperError[1](org.apache.hedwig.server.integration.TestHedwigHubRegular): expected:<0> but was:<8>
Tests in error:
testUnsubscribe[1](org.apache.hedwig.server.integration.TestHedwigHubRegular): Could not establish connection with ZooKeeper after zk_timeout*2 = 4000 ms. (Default value for zk_timeout is 2000).
testUnsubscribe[1](org.apache.hedwig.server.integration.TestHedwigHubRegular)
testSyncUnsubscribeWithoutSubscription[1](org.apache.hedwig.server.integration.TestHedwigHubRegular)
testAsyncUnsubscribeWithoutSubscription[1](org.apache.hedwig.server.integration.TestHedwigHubRegular)
testCloseSubscription[1](org.apache.hedwig.server.integration.TestHedwigHubRegular)
testStartDeliveryTwice[1](org.apache.hedwig.server.integration.TestHedwigHubRegular)
testStopDelivery[1](org.apache.hedwig.server.integration.TestHedwigHubRegular)
testConsumedMessagesInOrder[1](org.apache.hedwig.server.integration.TestHedwigHubRegular)
testCreateSubscriptionFailure[1](org.apache.hedwig.server.integration.TestHedwigHubRegular)
testCreateSubscriptionSuccess[1](org.apache.hedwig.server.integration.TestHedwigHubRegular)
testAttachToSubscriptionFailure[1](org.apache.hedwig.server.integration.TestHedwigHubRegular)
testSyncSubscribeWithInvalidSubscriberId[1](org.apache.hedwig.server.integration.TestHedwigHubRegular)
testAsyncSubscribeWithInvalidSubscriberId[1](org.apache.hedwig.server.integration.TestHedwigHubRegular)
testSyncUnsubscribeWithInvalidSubscriberId[1](org.apache.hedwig.server.integration.TestHedwigHubRegular)
testAsyncUnsubscribeWithInvalidSubscriberId[1](org.apache.hedwig.server.integration.TestHedwigHubRegular)
testSyncHubSubscribeWithInvalidSubscriberId[1](org.apache.hedwig.server.integration.TestHedwigHubRegular)
testAsyncHubSubscribeWithInvalidSubscriberId[1](org.apache.hedwig.server.integration.TestHedwigHubRegular)
testSyncHubUnsubscribeWithInvalidSubscriberId[1](org.apache.hedwig.server.integration.TestHedwigHubRegular)
testAsyncHubUnsubscribeWithInvalidSubscriberId[1](org.apache.hedwig.server.integration.TestHedwigHubRegular)
testPublishWithBookKeeperError[1](org.apache.hedwig.server.integration.TestHedwigHubRegular)
Tests run: 329, Failures: 18, Errors: 20, Skipped: 0
[INFO] ------------------------------------------------------------------------
[INFO] Reactor Summary:
[INFO]
[INFO] bookkeeper ........................................ SUCCESS [6.708s]
[INFO] compability dependencies .......................... SUCCESS [0.065s]
[INFO] bookkeeper-server-compat400 ....................... SUCCESS [6.375s]
[INFO] bookkeeper-server-compat410 ....................... SUCCESS [2.724s]
[INFO] hedwig-server-compat400 ........................... SUCCESS [4.328s]
[INFO] hedwig-server-compat410 ........................... SUCCESS [4.358s]
[INFO] hedwig-protocol ................................... SUCCESS [30.275s]
[INFO] bookkeeper-server ................................. SUCCESS [9:50.368s]
[INFO] hedwig-client ..................................... SUCCESS [22.753s]
[INFO] hedwig-server ..................................... FAILURE [11:16.253s]
[INFO] bookkeeper-benchmark .............................. SKIPPED
[INFO] hedwig-client-jms ................................. SKIPPED
[INFO] ------------------------------------------------------------------------
[INFO] BUILD FAILURE
[INFO] ------------------------------------------------------------------------
[INFO] Total time: 22:25.472s
[INFO] Finished at: Sat Jun 29 12:40:46 UTC 2013
[INFO] Final Memory: 30M/150M
[INFO] ------------------------------------------------------------------------
[ERROR] Failed to execute goal org.apache.maven.plugins:maven-surefire-plugin:2.9:test (default-test) on project hedwig-server: There are test failures.
[ERROR]
[ERROR] Please refer to <https://builds.apache.org/job/bookkeeper-trunk/ws/hedwig-server/target/surefire-reports> for the individual test results.
[ERROR] -> [Help 1]
[ERROR]
[ERROR] To see the full stack trace of the errors, re-run Maven with the -e switch.
[ERROR] Re-run Maven using the -X switch to enable full debug logging.
[ERROR]
[ERROR] For more information about the errors and possible solutions, please read the following articles:
[ERROR] [Help 1] http://cwiki.apache.org/confluence/display/MAVEN/MojoFailureException
[ERROR]
[ERROR] After correcting the problems, you can resume the build with the command
[ERROR] mvn <goals> -rf :hedwig-server
Build step 'Execute shell' marked build as failure
Recording test results
Jenkins build is back to normal : bookkeeper-trunk #265
Posted by Apache Jenkins Server <je...@builds.apache.org>.
See <https://builds.apache.org/job/bookkeeper-trunk/265/>