You are viewing a plain text version of this content. The canonical link for it is here.
Posted to builds@beam.apache.org by Apache Jenkins Server <je...@builds.apache.org> on 2022/11/09 04:56:59 UTC

Build failed in Jenkins: beam_PreCommit_Go_Cron #6347

See <https://ci-beam.apache.org/job/beam_PreCommit_Go_Cron/6347/display/redirect?page=changes>

Changes:

[noreply] [Go] Add pipeline resource hints to CHANGES.md (#24036)

[noreply] Handle Avro schema generation for logical data types in


------------------------------------------
[...truncated 16.15 KB...]
ok  	github.com/apache/beam/sdks/v2/go/pkg/beam/core/graph/mtime	0.020s
ok  	github.com/apache/beam/sdks/v2/go/pkg/beam/core/graph/window	0.086s
ok  	github.com/apache/beam/sdks/v2/go/pkg/beam/core/graph/window/trigger	0.103s
ok  	github.com/apache/beam/sdks/v2/go/pkg/beam/core/metrics	0.341s
ok  	github.com/apache/beam/sdks/v2/go/pkg/beam/core/runtime	0.120s
ok  	github.com/apache/beam/sdks/v2/go/pkg/beam/core/runtime/coderx	0.065s
panic: test timed out after 10m0s

goroutine 216 [running]:
testing.(*M).startAlarm.func1()
	/home/jenkins/sdk/go1.18.1/src/testing/testing.go:2029 +0x8e
created by time.goFunc
	/home/jenkins/sdk/go1.18.1/src/time/sleep.go:176 +0x32

goroutine 1 [chan receive, 9 minutes]:
testing.(*T).Run(0xc0001f0340, {0xb0da5c?, 0x517325?}, 0xb4fa08)
	/home/jenkins/sdk/go1.18.1/src/testing/testing.go:1487 +0x37a
testing.runTests.func1(0xc0001f0340?)
	/home/jenkins/sdk/go1.18.1/src/testing/testing.go:1839 +0x6e
testing.tRunner(0xc0001f0340, 0xc00013fcd8)
	/home/jenkins/sdk/go1.18.1/src/testing/testing.go:1439 +0x102
testing.runTests(0xa52660?, {0x1013c00, 0x33, 0x33}, {0x7fd72a8bd108?, 0x40?, 0x101f240?})
	/home/jenkins/sdk/go1.18.1/src/testing/testing.go:1837 +0x457
testing.(*M).Run(0xc0001f2320)
	/home/jenkins/sdk/go1.18.1/src/testing/testing.go:1719 +0x5d9
main.main()
	_testmain.go:181 +0x1aa

goroutine 198 [chan receive, 9 minutes]:
testing.(*T).Run(0xc000541ba0, {0xb0ab77?, 0x517873?}, 0xc0004a6660)
	/home/jenkins/sdk/go1.18.1/src/testing/testing.go:1487 +0x37a
github.com/apache/beam/sdks/v2/go/pkg/beam/core/runtime/exec.TestDynamicSplit(0xc000541a00?)
	<https://ci-beam.apache.org/job/beam_PreCommit_Go_Cron/ws/src/sdks/go/pkg/beam/core/runtime/exec/dynsplit_test.go>:67 +0x157
testing.tRunner(0xc000541ba0, 0xb4fa08)
	/home/jenkins/sdk/go1.18.1/src/testing/testing.go:1439 +0x102
created by testing.(*T).Run
	/home/jenkins/sdk/go1.18.1/src/testing/testing.go:1486 +0x35f

goroutine 141 [chan receive, 9 minutes]:
github.com/apache/beam/sdks/v2/go/pkg/beam/core/runtime/exec.splitBlockingDriver(0xc0004c3960, {{0xbfea08?, 0xc000492620?}, {0x0?, 0x0?}}, 0xc000492380)
	<https://ci-beam.apache.org/job/beam_PreCommit_Go_Cron/ws/src/sdks/go/pkg/beam/core/runtime/exec/dynsplit_test.go>:181 +0x20c
github.com/apache/beam/sdks/v2/go/pkg/beam/core/runtime/exec.TestDynamicSplit.func1(0xc0004c7520)
	<https://ci-beam.apache.org/job/beam_PreCommit_Go_Cron/ws/src/sdks/go/pkg/beam/core/runtime/exec/dynsplit_test.go>:84 +0x57f
testing.tRunner(0xc0004c7520, 0xc0004a6660)
	/home/jenkins/sdk/go1.18.1/src/testing/testing.go:1439 +0x102
created by testing.(*T).Run
	/home/jenkins/sdk/go1.18.1/src/testing/testing.go:1486 +0x35f

goroutine 144 [chan send, 9 minutes]:
github.com/apache/beam/sdks/v2/go/pkg/beam/core/runtime/exec.(*splitTestRTracker).TrySplit(0xc0004a2c80, 0x4?)
	<https://ci-beam.apache.org/job/beam_PreCommit_Go_Cron/ws/src/sdks/go/pkg/beam/core/runtime/exec/dynsplit_test.go>:401 +0x9e
github.com/apache/beam/sdks/v2/go/pkg/beam/core/runtime/exec.(*ProcessSizedElementsAndRestrictions).singleWindowSplit(0xc0004e4000, 0x50?, {0x9e86e0, 0xfd16a0}, {0x9e86e0, 0xfd16a0})
	<https://ci-beam.apache.org/job/beam_PreCommit_Go_Cron/ws/src/sdks/go/pkg/beam/core/runtime/exec/sdf.go>:702 +0x89
github.com/apache/beam/sdks/v2/go/pkg/beam/core/runtime/exec.(*ProcessSizedElementsAndRestrictions).Split(0xc0004e4000, 0xc0004eaa38?)
	<https://ci-beam.apache.org/job/beam_PreCommit_Go_Cron/ws/src/sdks/go/pkg/beam/core/runtime/exec/sdf.go>:664 +0x2fb
github.com/apache/beam/sdks/v2/go/pkg/beam/core/runtime/exec.(*DataSource).Split(0xc0004a5400, {0x0, 0x0, 0x0?}, 0x3fe0000000000000?, 0x1)
	<https://ci-beam.apache.org/job/beam_PreCommit_Go_Cron/ws/src/sdks/go/pkg/beam/core/runtime/exec/datasource.go>:512 +0x3af
github.com/apache/beam/sdks/v2/go/pkg/beam/core/runtime/exec.(*Plan).Split(0xeb9e20?, {{0x0, 0x0, 0x0}, 0x3fe0000000000000, 0x1})
	<https://ci-beam.apache.org/job/beam_PreCommit_Go_Cron/ws/src/sdks/go/pkg/beam/core/runtime/exec/plan.go>:275 +0xe5
github.com/apache/beam/sdks/v2/go/pkg/beam/core/runtime/exec.splitPlan(0xc0004a9f20?, 0xc0004aa238?)
	<https://ci-beam.apache.org/job/beam_PreCommit_Go_Cron/ws/src/sdks/go/pkg/beam/core/runtime/exec/dynsplit_test.go>:337 +0x72
created by github.com/apache/beam/sdks/v2/go/pkg/beam/core/runtime/exec.splitBlockingDriver
	<https://ci-beam.apache.org/job/beam_PreCommit_Go_Cron/ws/src/sdks/go/pkg/beam/core/runtime/exec/dynsplit_test.go>:177 +0x1ea

goroutine 143 [semacquire, 9 minutes]:
sync.runtime_SemacquireMutex(0x7fd701247668?, 0xa0?, 0x7fd72a8bd5b8?)
	/home/jenkins/sdk/go1.18.1/src/runtime/sema.go:71 +0x25
sync.(*Mutex).lockSlow(0xc0004a2c80)
	/home/jenkins/sdk/go1.18.1/src/sync/mutex.go:162 +0x165
sync.(*Mutex).Lock(...)
	/home/jenkins/sdk/go1.18.1/src/sync/mutex.go:81
github.com/apache/beam/sdks/v2/go/pkg/beam/core/runtime/exec.(*splitTestRTracker).GetRestriction(0x4?)
	<https://ci-beam.apache.org/job/beam_PreCommit_Go_Cron/ws/src/sdks/go/pkg/beam/core/runtime/exec/dynsplit_test.go>:422 +0x51
github.com/apache/beam/sdks/v2/go/pkg/beam/core/runtime/exec.(*splitTestSdf).ProcessElement(0xc000492380, 0xf?, 0xc0005864a0?, 0xc0004ad7d0)
	<https://ci-beam.apache.org/job/beam_PreCommit_Go_Cron/ws/src/sdks/go/pkg/beam/core/runtime/exec/dynsplit_test.go>:443 +0x2f
reflect.Value.call({0xa0b400?, 0xc0004a2780?, 0x44f592?}, {0xb04125, 0x4}, {0xc0004ae320, 0x3, 0x5b90a5?})
	/home/jenkins/sdk/go1.18.1/src/reflect/value.go:556 +0x845
reflect.Value.Call({0xa0b400?, 0xc0004a2780?, 0x0?}, {0xc0004ae320, 0x3, 0x3})
	/home/jenkins/sdk/go1.18.1/src/reflect/value.go:339 +0xbf
github.com/apache/beam/sdks/v2/go/pkg/beam/core/util/reflectx.(*reflectFunc).Call(0xc00048a5d0, {0xc0004ad740?, 0x0?, 0x99?})
	<https://ci-beam.apache.org/job/beam_PreCommit_Go_Cron/ws/src/sdks/go/pkg/beam/core/util/reflectx/call.go>:87 +0x59
github.com/apache/beam/sdks/v2/go/pkg/beam/core/runtime/exec.(*invoker).initCall.func46({0x0, 0x0, 0x0, 0x0, 0x0}, {0x10065e0, 0x1, 0x1}, 0x0?)
	<https://ci-beam.apache.org/job/beam_PreCommit_Go_Cron/ws/src/sdks/go/pkg/beam/core/runtime/exec/fn_arity.go>:307 +0x94
github.com/apache/beam/sdks/v2/go/pkg/beam/core/runtime/exec.(*invoker).Invoke(0xc0004a5540, {0xc01ac8?, 0xc0004a2c00}, {0x0, 0x0, 0x0, 0x0, 0x0}, {0x10065e0, 0x1, ...}, ...)
	<https://ci-beam.apache.org/job/beam_PreCommit_Go_Cron/ws/src/sdks/go/pkg/beam/core/runtime/exec/fn.go>:252 +0xdf5
github.com/apache/beam/sdks/v2/go/pkg/beam/core/runtime/exec.(*ParDo).invokeProcessFn(0xc0004b2200, {0xc01ac8, 0xc0004a2c00}, {0x0, 0x0, 0x0, 0x0, 0x0}, {0x10065e0, 0x1, ...}, ...)
	<https://ci-beam.apache.org/job/beam_PreCommit_Go_Cron/ws/src/sdks/go/pkg/beam/core/runtime/exec/pardo.go>:359 +0x25e
github.com/apache/beam/sdks/v2/go/pkg/beam/core/runtime/exec.(*ParDo).processSingleWindow(0xc0004b2200, 0xc0004ee1b0)
	<https://ci-beam.apache.org/job/beam_PreCommit_Go_Cron/ws/src/sdks/go/pkg/beam/core/runtime/exec/pardo.go>:178 +0x9b
github.com/apache/beam/sdks/v2/go/pkg/beam/core/runtime/exec.(*ProcessSizedElementsAndRestrictions).ProcessElement(0xc0004e4000, {0xbf9e80?, 0xc00048a840?}, 0xc0004c3b90, {0x0, 0x0, 0x0})
	<https://ci-beam.apache.org/job/beam_PreCommit_Go_Cron/ws/src/sdks/go/pkg/beam/core/runtime/exec/sdf.go>:528 +0x608
github.com/apache/beam/sdks/v2/go/pkg/beam/core/runtime/exec.(*DataSource).Process(0xc0004a5400, {0xc019e8, 0xc0000360b0})
	<https://ci-beam.apache.org/job/beam_PreCommit_Go_Cron/ws/src/sdks/go/pkg/beam/core/runtime/exec/datasource.go>:187 +0x4aa
github.com/apache/beam/sdks/v2/go/pkg/beam/core/runtime/exec.callNoPanic({0xc019e8?, 0xc0000360b0?}, 0x2a?)
	<https://ci-beam.apache.org/job/beam_PreCommit_Go_Cron/ws/src/sdks/go/pkg/beam/core/runtime/exec/util.go>:62 +0x6c
github.com/apache/beam/sdks/v2/go/pkg/beam/core/runtime/exec.(*Plan).Execute(0xc0004c3960, {0xc019e8, 0xc0000360b0}, {0xc000490300, 0x2a}, {{0xbfea08?, 0xc000492620?}, {0x0?, 0x0?}})
	<https://ci-beam.apache.org/job/beam_PreCommit_Go_Cron/ws/src/sdks/go/pkg/beam/core/runtime/exec/plan.go>:129 +0x394
github.com/apache/beam/sdks/v2/go/pkg/beam/core/runtime/exec.processPlan(0xc0004c3960, {{0xbfea08?, 0xc000492620?}, {0x0?, 0x0?}}, 0x0?)
	<https://ci-beam.apache.org/job/beam_PreCommit_Go_Cron/ws/src/sdks/go/pkg/beam/core/runtime/exec/dynsplit_test.go>:320 +0xe7
created by github.com/apache/beam/sdks/v2/go/pkg/beam/core/runtime/exec.splitBlockingDriver
	<https://ci-beam.apache.org/job/beam_PreCommit_Go_Cron/ws/src/sdks/go/pkg/beam/core/runtime/exec/dynsplit_test.go>:172 +0x151

goroutine 131 [chan receive, 9 minutes]:
github.com/apache/beam/sdks/v2/go/pkg/beam/core/runtime/exec.TestDataSource_Split.func3.1.2()
	<https://ci-beam.apache.org/job/beam_PreCommit_Go_Cron/ws/src/sdks/go/pkg/beam/core/runtime/exec/datasource_test.go>:373 +0x65
created by github.com/apache/beam/sdks/v2/go/pkg/beam/core/runtime/exec.TestDataSource_Split.func3.1
	<https://ci-beam.apache.org/job/beam_PreCommit_Go_Cron/ws/src/sdks/go/pkg/beam/core/runtime/exec/datasource_test.go>:371 +0x295
FAIL	github.com/apache/beam/sdks/v2/go/pkg/beam/core/runtime/exec	600.205s
?   	github.com/apache/beam/sdks/v2/go/pkg/beam/core/runtime/exec/optimized	[no test files]
ok  	github.com/apache/beam/sdks/v2/go/pkg/beam/core/runtime/genx	0.240s
ok  	github.com/apache/beam/sdks/v2/go/pkg/beam/core/runtime/graphx	0.189s
ok  	github.com/apache/beam/sdks/v2/go/pkg/beam/core/runtime/graphx/schema	0.256s
?   	github.com/apache/beam/sdks/v2/go/pkg/beam/core/runtime/graphx/v1	[no test files]
ok  	github.com/apache/beam/sdks/v2/go/pkg/beam/core/runtime/harness	0.901s
?   	github.com/apache/beam/sdks/v2/go/pkg/beam/core/runtime/harness/init	[no test files]
?   	github.com/apache/beam/sdks/v2/go/pkg/beam/core/runtime/harness/session	[no test files]
ok  	github.com/apache/beam/sdks/v2/go/pkg/beam/core/runtime/harness/statecache	0.093s
ok  	github.com/apache/beam/sdks/v2/go/pkg/beam/core/runtime/metricsx	0.096s
ok  	github.com/apache/beam/sdks/v2/go/pkg/beam/core/runtime/pipelinex	0.177s
ok  	github.com/apache/beam/sdks/v2/go/pkg/beam/core/runtime/xlangx	0.128s
ok  	github.com/apache/beam/sdks/v2/go/pkg/beam/core/runtime/xlangx/expansionx	1.153s
ok  	github.com/apache/beam/sdks/v2/go/pkg/beam/core/sdf	0.095s
ok  	github.com/apache/beam/sdks/v2/go/pkg/beam/core/state	0.066s
ok  	github.com/apache/beam/sdks/v2/go/pkg/beam/core/typex	0.075s
?   	github.com/apache/beam/sdks/v2/go/pkg/beam/core/util/dot	[no test files]
ok  	github.com/apache/beam/sdks/v2/go/pkg/beam/core/util/hooks	5.081s
ok  	github.com/apache/beam/sdks/v2/go/pkg/beam/core/util/ioutilx	0.039s
ok  	github.com/apache/beam/sdks/v2/go/pkg/beam/core/util/jsonx	0.064s
ok  	github.com/apache/beam/sdks/v2/go/pkg/beam/core/util/protox	0.076s
ok  	github.com/apache/beam/sdks/v2/go/pkg/beam/core/util/reflectx	0.085s
ok  	github.com/apache/beam/sdks/v2/go/pkg/beam/core/util/symtab	14.833s
ok  	github.com/apache/beam/sdks/v2/go/pkg/beam/internal/errors	0.083s
ok  	github.com/apache/beam/sdks/v2/go/pkg/beam/io/avroio	0.287s
ok  	github.com/apache/beam/sdks/v2/go/pkg/beam/io/bigqueryio	0.216s
ok  	github.com/apache/beam/sdks/v2/go/pkg/beam/io/bigtableio	0.857s
ok  	github.com/apache/beam/sdks/v2/go/pkg/beam/io/databaseio	0.226s
ok  	github.com/apache/beam/sdks/v2/go/pkg/beam/io/datastoreio	0.225s
ok  	github.com/apache/beam/sdks/v2/go/pkg/beam/io/fhirio	0.230s
ok  	github.com/apache/beam/sdks/v2/go/pkg/beam/io/filesystem	0.069s
ok  	github.com/apache/beam/sdks/v2/go/pkg/beam/io/filesystem/gcs	0.172s
ok  	github.com/apache/beam/sdks/v2/go/pkg/beam/io/filesystem/local	0.048s
ok  	github.com/apache/beam/sdks/v2/go/pkg/beam/io/filesystem/memfs	0.109s
ok  	github.com/apache/beam/sdks/v2/go/pkg/beam/io/parquetio	0.275s
?   	github.com/apache/beam/sdks/v2/go/pkg/beam/io/pubsubio	[no test files]
ok  	github.com/apache/beam/sdks/v2/go/pkg/beam/io/rtrackers/offsetrange	0.151s
ok  	github.com/apache/beam/sdks/v2/go/pkg/beam/io/synthetic	0.128s
ok  	github.com/apache/beam/sdks/v2/go/pkg/beam/io/textio	0.182s
?   	github.com/apache/beam/sdks/v2/go/pkg/beam/io/xlang/bigqueryio	[no test files]
?   	github.com/apache/beam/sdks/v2/go/pkg/beam/io/xlang/debeziumio	[no test files]
?   	github.com/apache/beam/sdks/v2/go/pkg/beam/io/xlang/jdbcio	[no test files]
?   	github.com/apache/beam/sdks/v2/go/pkg/beam/io/xlang/kafkaio	[no test files]
ok  	github.com/apache/beam/sdks/v2/go/pkg/beam/io/xlang/schemaio	0.068s
?   	github.com/apache/beam/sdks/v2/go/pkg/beam/log	[no test files]
?   	github.com/apache/beam/sdks/v2/go/pkg/beam/model	[no test files]
?   	github.com/apache/beam/sdks/v2/go/pkg/beam/model/fnexecution_v1	[no test files]
?   	github.com/apache/beam/sdks/v2/go/pkg/beam/model/jobmanagement_v1	[no test files]
?   	github.com/apache/beam/sdks/v2/go/pkg/beam/model/pipeline_v1	[no test files]
ok  	github.com/apache/beam/sdks/v2/go/pkg/beam/options/gcpopts	0.128s
ok  	github.com/apache/beam/sdks/v2/go/pkg/beam/options/jobopts	0.066s
ok  	github.com/apache/beam/sdks/v2/go/pkg/beam/options/resource	0.065s
ok  	github.com/apache/beam/sdks/v2/go/pkg/beam/provision	0.121s
ok  	github.com/apache/beam/sdks/v2/go/pkg/beam/register	0.047s
?   	github.com/apache/beam/sdks/v2/go/pkg/beam/runners	[no test files]
ok  	github.com/apache/beam/sdks/v2/go/pkg/beam/runners/dataflow	0.114s
ok  	github.com/apache/beam/sdks/v2/go/pkg/beam/runners/dataflow/dataflowlib	0.067s
ok  	github.com/apache/beam/sdks/v2/go/pkg/beam/runners/direct	0.102s
?   	github.com/apache/beam/sdks/v2/go/pkg/beam/runners/dot	[no test files]
?   	github.com/apache/beam/sdks/v2/go/pkg/beam/runners/flink	[no test files]
?   	github.com/apache/beam/sdks/v2/go/pkg/beam/runners/samza	[no test files]
?   	github.com/apache/beam/sdks/v2/go/pkg/beam/runners/spark	[no test files]
?   	github.com/apache/beam/sdks/v2/go/pkg/beam/runners/universal	[no test files]
ok  	github.com/apache/beam/sdks/v2/go/pkg/beam/runners/universal/extworker	0.148s
?   	github.com/apache/beam/sdks/v2/go/pkg/beam/runners/universal/runnerlib	[no test files]
ok  	github.com/apache/beam/sdks/v2/go/pkg/beam/runners/vet	0.060s
?   	github.com/apache/beam/sdks/v2/go/pkg/beam/runners/vet/testpipeline	[no test files]
ok  	github.com/apache/beam/sdks/v2/go/pkg/beam/testing/passert	0.233s
ok  	github.com/apache/beam/sdks/v2/go/pkg/beam/testing/ptest	0.130s
ok  	github.com/apache/beam/sdks/v2/go/pkg/beam/testing/teststream	0.070s
ok  	github.com/apache/beam/sdks/v2/go/pkg/beam/transforms/filter	0.089s
?   	github.com/apache/beam/sdks/v2/go/pkg/beam/transforms/sql	[no test files]
?   	github.com/apache/beam/sdks/v2/go/pkg/beam/transforms/sql/sqlx	[no test files]
ok  	github.com/apache/beam/sdks/v2/go/pkg/beam/transforms/stats	10.719s
ok  	github.com/apache/beam/sdks/v2/go/pkg/beam/transforms/top	0.148s
?   	github.com/apache/beam/sdks/v2/go/pkg/beam/transforms/xlang/dataframe	[no test files]
?   	github.com/apache/beam/sdks/v2/go/pkg/beam/transforms/xlang/python	[no test files]
?   	github.com/apache/beam/sdks/v2/go/pkg/beam/util/diagnostics	[no test files]
ok  	github.com/apache/beam/sdks/v2/go/pkg/beam/util/errorx	0.099s
?   	github.com/apache/beam/sdks/v2/go/pkg/beam/util/execx	[no test files]
ok  	github.com/apache/beam/sdks/v2/go/pkg/beam/util/gcsx	0.116s
?   	github.com/apache/beam/sdks/v2/go/pkg/beam/util/grpcx	[no test files]
ok  	github.com/apache/beam/sdks/v2/go/pkg/beam/util/harnessopts	0.105s
ok  	github.com/apache/beam/sdks/v2/go/pkg/beam/util/pubsubx	1.144s
ok  	github.com/apache/beam/sdks/v2/go/pkg/beam/util/shimx	0.107s
ok  	github.com/apache/beam/sdks/v2/go/pkg/beam/util/starcgenx	0.092s
?   	github.com/apache/beam/sdks/v2/go/pkg/beam/util/syscallx	[no test files]
?   	github.com/apache/beam/sdks/v2/go/pkg/beam/x/beamx	[no test files]
ok  	github.com/apache/beam/sdks/v2/go/pkg/beam/x/debug	0.110s
?   	github.com/apache/beam/sdks/v2/go/pkg/beam/x/hooks/perf	[no test files]
ok  	github.com/apache/beam/sdks/v2/go/test/integration	0.128s
?   	github.com/apache/beam/sdks/v2/go/test/integration/driver	[no test files]
?   	github.com/apache/beam/sdks/v2/go/test/integration/internal/jars	[no test files]
?   	github.com/apache/beam/sdks/v2/go/test/integration/internal/ports	[no test files]
ok  	github.com/apache/beam/sdks/v2/go/test/integration/io/fhirio	0.235s
ok  	github.com/apache/beam/sdks/v2/go/test/integration/io/xlang/bigquery	0.220s
ok  	github.com/apache/beam/sdks/v2/go/test/integration/io/xlang/debezium	0.202s
ok  	github.com/apache/beam/sdks/v2/go/test/integration/io/xlang/jdbc	0.189s
ok  	github.com/apache/beam/sdks/v2/go/test/integration/io/xlang/kafka	0.235s
ok  	github.com/apache/beam/sdks/v2/go/test/integration/primitives	0.263s
ok  	github.com/apache/beam/sdks/v2/go/test/integration/synthetic	0.985s
ok  	github.com/apache/beam/sdks/v2/go/test/integration/transforms/xlang/dataframe	0.086s
ok  	github.com/apache/beam/sdks/v2/go/test/integration/wordcount	0.199s
2022/11/09 04:47:24 skipping missing expansion service: expansion service labeled "test" not found: no --expansion_jar or --expansion_addr flag provided with label "test"
--- FAIL: TestAutomatedExpansionService (15.61s)
    expansion_test.go:47: failed to start expansion service JAR, got context deadline exceeded
FAIL
FAIL	github.com/apache/beam/sdks/v2/go/test/integration/xlang	15.769s
?   	github.com/apache/beam/sdks/v2/go/test/load	[no test files]
?   	github.com/apache/beam/sdks/v2/go/test/load/cogbk	[no test files]
?   	github.com/apache/beam/sdks/v2/go/test/load/combine	[no test files]
?   	github.com/apache/beam/sdks/v2/go/test/load/group_by_key	[no test files]
?   	github.com/apache/beam/sdks/v2/go/test/load/pardo	[no test files]
?   	github.com/apache/beam/sdks/v2/go/test/load/sideinput	[no test files]
ok  	github.com/apache/beam/sdks/v2/go/test/regression	0.311s
ok  	github.com/apache/beam/sdks/v2/go/test/regression/coders/fromyaml	0.111s
FAIL

> Task :sdks:go:goTest FAILED
> Task :goPrecommitBuild

FAILURE: Build failed with an exception.

* What went wrong:
Execution failed for task ':sdks:go:goTest'.
> Process 'command 'sh'' finished with non-zero exit value 1

* Try:
> Run with --stacktrace option to get the stack trace.
> Run with --info or --debug option to get more log output.

* Get more help at https://help.gradle.org

BUILD FAILED in 15m 13s
17 actionable tasks: 11 executed, 4 from cache, 2 up-to-date

Publishing build scan...
https://gradle.com/s/bkhn33zmo2q7u

Build step 'Invoke Gradle script' changed build result to FAILURE
Build step 'Invoke Gradle script' marked build as failure

---------------------------------------------------------------------
To unsubscribe, e-mail: builds-unsubscribe@beam.apache.org
For additional commands, e-mail: builds-help@beam.apache.org


Jenkins build is back to normal : beam_PreCommit_Go_Cron #6348

Posted by Apache Jenkins Server <je...@builds.apache.org>.
See <https://ci-beam.apache.org/job/beam_PreCommit_Go_Cron/6348/display/redirect?page=changes>


---------------------------------------------------------------------
To unsubscribe, e-mail: builds-unsubscribe@beam.apache.org
For additional commands, e-mail: builds-help@beam.apache.org