You are viewing a plain text version of this content. The canonical link for it is here.
Posted to dev@lucene.apache.org by Policeman Jenkins Server <je...@thetaphi.de> on 2013/09/12 10:19:43 UTC

[JENKINS] Lucene-Solr-trunk-Linux (32bit/jdk1.7.0_40) - Build # 7426 - Failure!

Build: http://jenkins.thetaphi.de/job/Lucene-Solr-trunk-Linux/7426/
Java: 32bit/jdk1.7.0_40 -server -XX:+UseParallelGC

1 tests failed.
REGRESSION:  org.apache.solr.handler.TestReplicationHandler.doTestStressReplication

Error Message:
timed out waiting for collection1 startAt time to exceed: Thu Sep 12 09:03:17 WEST 2013

Stack Trace:
java.lang.AssertionError: timed out waiting for collection1 startAt time to exceed: Thu Sep 12 09:03:17 WEST 2013
	at __randomizedtesting.SeedInfo.seed([28D22BD3B8C62D2E:F3792B15BDEE449D]:0)
	at org.junit.Assert.fail(Assert.java:93)
	at org.apache.solr.handler.TestReplicationHandler.watchCoreStartAt(TestReplicationHandler.java:1514)
	at org.apache.solr.handler.TestReplicationHandler.doTestStressReplication(TestReplicationHandler.java:818)
	at sun.reflect.NativeMethodAccessorImpl.invoke0(Native Method)
	at sun.reflect.NativeMethodAccessorImpl.invoke(NativeMethodAccessorImpl.java:57)
	at sun.reflect.DelegatingMethodAccessorImpl.invoke(DelegatingMethodAccessorImpl.java:43)
	at java.lang.reflect.Method.invoke(Method.java:606)
	at com.carrotsearch.randomizedtesting.RandomizedRunner.invoke(RandomizedRunner.java:1559)
	at com.carrotsearch.randomizedtesting.RandomizedRunner.access$600(RandomizedRunner.java:79)
	at com.carrotsearch.randomizedtesting.RandomizedRunner$6.evaluate(RandomizedRunner.java:737)
	at com.carrotsearch.randomizedtesting.RandomizedRunner$7.evaluate(RandomizedRunner.java:773)
	at com.carrotsearch.randomizedtesting.RandomizedRunner$8.evaluate(RandomizedRunner.java:787)
	at com.carrotsearch.randomizedtesting.rules.SystemPropertiesRestoreRule$1.evaluate(SystemPropertiesRestoreRule.java:53)
	at org.apache.lucene.util.TestRuleSetupTeardownChained$1.evaluate(TestRuleSetupTeardownChained.java:50)
	at org.apache.lucene.util.TestRuleFieldCacheSanity$1.evaluate(TestRuleFieldCacheSanity.java:51)
	at org.apache.lucene.util.AbstractBeforeAfterRule$1.evaluate(AbstractBeforeAfterRule.java:46)
	at com.carrotsearch.randomizedtesting.rules.SystemPropertiesInvariantRule$1.evaluate(SystemPropertiesInvariantRule.java:55)
	at org.apache.lucene.util.TestRuleThreadAndTestName$1.evaluate(TestRuleThreadAndTestName.java:49)
	at org.apache.lucene.util.TestRuleIgnoreAfterMaxFailures$1.evaluate(TestRuleIgnoreAfterMaxFailures.java:70)
	at org.apache.lucene.util.TestRuleMarkFailure$1.evaluate(TestRuleMarkFailure.java:48)
	at com.carrotsearch.randomizedtesting.rules.StatementAdapter.evaluate(StatementAdapter.java:36)
	at com.carrotsearch.randomizedtesting.ThreadLeakControl$StatementRunner.run(ThreadLeakControl.java:358)
	at com.carrotsearch.randomizedtesting.ThreadLeakControl.forkTimeoutingTask(ThreadLeakControl.java:782)
	at com.carrotsearch.randomizedtesting.ThreadLeakControl$3.evaluate(ThreadLeakControl.java:442)
	at com.carrotsearch.randomizedtesting.RandomizedRunner.runSingleTest(RandomizedRunner.java:746)
	at com.carrotsearch.randomizedtesting.RandomizedRunner$3.evaluate(RandomizedRunner.java:648)
	at com.carrotsearch.randomizedtesting.RandomizedRunner$4.evaluate(RandomizedRunner.java:682)
	at com.carrotsearch.randomizedtesting.RandomizedRunner$5.evaluate(RandomizedRunner.java:693)
	at com.carrotsearch.randomizedtesting.rules.StatementAdapter.evaluate(StatementAdapter.java:36)
	at com.carrotsearch.randomizedtesting.rules.SystemPropertiesRestoreRule$1.evaluate(SystemPropertiesRestoreRule.java:53)
	at org.apache.lucene.util.AbstractBeforeAfterRule$1.evaluate(AbstractBeforeAfterRule.java:46)
	at org.apache.lucene.util.TestRuleStoreClassName$1.evaluate(TestRuleStoreClassName.java:42)
	at com.carrotsearch.randomizedtesting.rules.SystemPropertiesInvariantRule$1.evaluate(SystemPropertiesInvariantRule.java:55)
	at com.carrotsearch.randomizedtesting.rules.NoShadowingOrOverridesOnMethodsRule$1.evaluate(NoShadowingOrOverridesOnMethodsRule.java:39)
	at com.carrotsearch.randomizedtesting.rules.NoShadowingOrOverridesOnMethodsRule$1.evaluate(NoShadowingOrOverridesOnMethodsRule.java:39)
	at com.carrotsearch.randomizedtesting.rules.StatementAdapter.evaluate(StatementAdapter.java:36)
	at org.apache.lucene.util.TestRuleAssertionsRequired$1.evaluate(TestRuleAssertionsRequired.java:43)
	at org.apache.lucene.util.TestRuleMarkFailure$1.evaluate(TestRuleMarkFailure.java:48)
	at org.apache.lucene.util.TestRuleIgnoreAfterMaxFailures$1.evaluate(TestRuleIgnoreAfterMaxFailures.java:70)
	at org.apache.lucene.util.TestRuleIgnoreTestSuites$1.evaluate(TestRuleIgnoreTestSuites.java:55)
	at com.carrotsearch.randomizedtesting.rules.StatementAdapter.evaluate(StatementAdapter.java:36)
	at com.carrotsearch.randomizedtesting.ThreadLeakControl$StatementRunner.run(ThreadLeakControl.java:358)
	at java.lang.Thread.run(Thread.java:724)




Build Log:
[...truncated 9664 lines...]
   [junit4] Suite: org.apache.solr.handler.TestReplicationHandler
   [junit4]   2> 177463 T253 oas.SolrTestCaseJ4.setUp ###Starting testNoWriter
   [junit4]   2> 177468 T253 oejs.Server.doStart jetty-8.1.10.v20130312
   [junit4]   2> 177471 T253 oejs.AbstractConnector.doStart Started SelectChannelConnector@127.0.0.1:41040
   [junit4]   2> 177471 T253 oass.SolrDispatchFilter.init SolrDispatchFilter.init()
   [junit4]   2> 177471 T253 oasc.SolrResourceLoader.locateSolrHome JNDI not configured for solr (NoInitialContextEx)
   [junit4]   2> 177472 T253 oasc.SolrResourceLoader.locateSolrHome using system property solr.solr.home: ./org.apache.solr.handler.TestReplicationHandler$SolrInstance-1378972986071/master
   [junit4]   2> 177472 T253 oasc.SolrResourceLoader.<init> new SolrResourceLoader for directory: './org.apache.solr.handler.TestReplicationHandler$SolrInstance-1378972986071/master/'
   [junit4]   2> 177482 T253 oasc.ConfigSolr.fromFile Loading container configuration from /mnt/ssd/jenkins/workspace/Lucene-Solr-trunk-Linux/solr/build/solr-core/test/J0/./org.apache.solr.handler.TestReplicationHandler$SolrInstance-1378972986071/master/solr.xml
   [junit4]   2> 177511 T253 oasc.CoreContainer.<init> New CoreContainer 9334722
   [junit4]   2> 177511 T253 oasc.CoreContainer.load Loading cores into CoreContainer [instanceDir=./org.apache.solr.handler.TestReplicationHandler$SolrInstance-1378972986071/master/]
   [junit4]   2> 177512 T253 oashc.HttpShardHandlerFactory.getParameter Setting socketTimeout to: 120000
   [junit4]   2> 177512 T253 oashc.HttpShardHandlerFactory.getParameter Setting urlScheme to: http://
   [junit4]   2> 177513 T253 oashc.HttpShardHandlerFactory.getParameter Setting connTimeout to: 15000
   [junit4]   2> 177513 T253 oashc.HttpShardHandlerFactory.getParameter Setting maxConnectionsPerHost to: 20
   [junit4]   2> 177513 T253 oashc.HttpShardHandlerFactory.getParameter Setting corePoolSize to: 0
   [junit4]   2> 177514 T253 oashc.HttpShardHandlerFactory.getParameter Setting maximumPoolSize to: 2147483647
   [junit4]   2> 177514 T253 oashc.HttpShardHandlerFactory.getParameter Setting maxThreadIdleTime to: 5
   [junit4]   2> 177514 T253 oashc.HttpShardHandlerFactory.getParameter Setting sizeOfQueue to: -1
   [junit4]   2> 177514 T253 oashc.HttpShardHandlerFactory.getParameter Setting fairnessPolicy to: false
   [junit4]   2> 177515 T253 oascsi.HttpClientUtil.createClient Creating new http client, config:maxConnectionsPerHost=20&maxConnections=10000&socketTimeout=120000&connTimeout=15000&retry=false
   [junit4]   2> 177518 T253 oasl.LogWatcher.createWatcher SLF4J impl is org.slf4j.impl.Log4jLoggerFactory
   [junit4]   2> 177518 T253 oasl.LogWatcher.newRegisteredLogWatcher Registering Log Listener [Log4j (org.slf4j.impl.Log4jLoggerFactory)]
   [junit4]   2> 177521 T263 oasc.CoreContainer.create Creating SolrCore 'collection1' using instanceDir: ./org.apache.solr.handler.TestReplicationHandler$SolrInstance-1378972986071/master/collection1
   [junit4]   2> 177521 T263 oasc.SolrResourceLoader.<init> new SolrResourceLoader for directory: './org.apache.solr.handler.TestReplicationHandler$SolrInstance-1378972986071/master/collection1/'
   [junit4]   2> 177548 T263 oasc.SolrConfig.<init> Using Lucene MatchVersion: LUCENE_50
   [junit4]   2> 177575 T263 oasc.SolrConfig.<init> Loaded SolrConfig: solrconfig.xml
   [junit4]   2> 177575 T263 oass.IndexSchema.readSchema Reading Solr Schema from schema.xml
   [junit4]   2> 177579 T263 oass.IndexSchema.readSchema [null] Schema name=test
   [junit4]   2> 177587 T263 oass.IndexSchema.readSchema unique key field: id
   [junit4]   2> 177588 T263 oasc.SolrCore.initDirectoryFactory org.apache.solr.core.MockDirectoryFactory
   [junit4]   2> 177589 T263 oasc.SolrCore.<init> [collection1] Opening new SolrCore at ./org.apache.solr.handler.TestReplicationHandler$SolrInstance-1378972986071/master/collection1/, dataDir=/mnt/ssd/jenkins/workspace/Lucene-Solr-trunk-Linux/solr/build/solr-core/test/J0/./org.apache.solr.handler.TestReplicationHandler$SolrInstance-1378972986071/master/collection1/data/
   [junit4]   2> 177589 T263 oasc.SolrCore.<init> JMX monitoring not detected for core: collection1
   [junit4]   2> 177589 T263 oasc.CachingDirectoryFactory.get return new directory for /mnt/ssd/jenkins/workspace/Lucene-Solr-trunk-Linux/solr/build/solr-core/test/J0/./org.apache.solr.handler.TestReplicationHandler$SolrInstance-1378972986071/master/collection1/data
   [junit4]   2> 177589 T263 oasc.SolrCore.getNewIndexDir New index directory detected: old=null new=/mnt/ssd/jenkins/workspace/Lucene-Solr-trunk-Linux/solr/build/solr-core/test/J0/./org.apache.solr.handler.TestReplicationHandler$SolrInstance-1378972986071/master/collection1/data/index/
   [junit4]   2> 177590 T263 oasc.SolrCore.initIndex WARN [collection1] Solr index directory '/mnt/ssd/jenkins/workspace/Lucene-Solr-trunk-Linux/solr/build/solr-core/test/J0/./org.apache.solr.handler.TestReplicationHandler$SolrInstance-1378972986071/master/collection1/data/index' doesn't exist. Creating new index...
   [junit4]   2> 177590 T263 oasc.CachingDirectoryFactory.get return new directory for /mnt/ssd/jenkins/workspace/Lucene-Solr-trunk-Linux/solr/build/solr-core/test/J0/./org.apache.solr.handler.TestReplicationHandler$SolrInstance-1378972986071/master/collection1/data/index
   [junit4]   2> 177591 T263 oasu.RandomMergePolicy.<init> RandomMergePolicy wrapping class org.apache.lucene.index.TieredMergePolicy: [TieredMergePolicy: maxMergeAtOnce=24, maxMergeAtOnceExplicit=23, maxMergedSegmentMB=81.568359375, floorSegmentMB=1.5263671875, forceMergeDeletesPctAllowed=12.023213796923233, segmentsPerTier=17.0, maxCFSSegmentSizeMB=8.796093022207999E12, noCFSRatio=0.6513293739995961
   [junit4]   2> 177591 T263 oasc.SolrDeletionPolicy.onCommit SolrDeletionPolicy.onCommit: commits: num=1
   [junit4]   2> 		commit{dir=MockDirWrapper(org.apache.lucene.store.RAMDirectory@f55289 lockFactory=org.apache.lucene.store.SingleInstanceLockFactory@170f3e2),segFN=segments_1,generation=1}
   [junit4]   2> 177592 T263 oasc.SolrDeletionPolicy.updateCommits newest commit generation = 1
   [junit4]   2> 177592 T263 oasc.SolrCore.loadUpdateProcessorChains no updateRequestProcessorChain defined as default, creating implicit default
   [junit4]   2> 177592 T263 oasc.RequestHandlers.initHandlersFromConfig created standard: solr.StandardRequestHandler
   [junit4]   2> 177593 T263 oasc.RequestHandlers.initHandlersFromConfig created /replication: solr.ReplicationHandler
   [junit4]   2> 177593 T263 oasc.RequestHandlers.initHandlersFromConfig created defaults: solr.StandardRequestHandler
   [junit4]   2> 177593 T263 oasc.RequestHandlers.initHandlersFromConfig adding lazy requestHandler: solr.StandardRequestHandler
   [junit4]   2> 177593 T263 oasc.RequestHandlers.initHandlersFromConfig created lazy: solr.StandardRequestHandler
   [junit4]   2> 177594 T263 oasc.RequestHandlers.initHandlersFromConfig created /update: solr.UpdateRequestHandler
   [junit4]   2> 177596 T263 oashl.XMLLoader.init xsltCacheLifetimeSeconds=60
   [junit4]   2> 177598 T263 oasu.CommitTracker.<init> Hard AutoCommit: disabled
   [junit4]   2> 177598 T263 oasu.CommitTracker.<init> Soft AutoCommit: disabled
   [junit4]   2> 177598 T263 oasu.RandomMergePolicy.<init> RandomMergePolicy wrapping class org.apache.lucene.index.LogByteSizeMergePolicy: [LogByteSizeMergePolicy: minMergeSize=1677721, mergeFactor=49, maxMergeSize=2147483648, maxMergeSizeForForcedMerge=9223372036854775807, calibrateSizeByDeletes=false, maxMergeDocs=2147483647, maxCFSSegmentSizeMB=8.796093022207999E12, noCFSRatio=0.0]
   [junit4]   2> 177599 T263 oasc.SolrDeletionPolicy.onInit SolrDeletionPolicy.onInit: commits: num=1
   [junit4]   2> 		commit{dir=MockDirWrapper(org.apache.lucene.store.RAMDirectory@f55289 lockFactory=org.apache.lucene.store.SingleInstanceLockFactory@170f3e2),segFN=segments_1,generation=1}
   [junit4]   2> 177599 T263 oasc.SolrDeletionPolicy.updateCommits newest commit generation = 1
   [junit4]   2> 177600 T263 oass.SolrIndexSearcher.<init> Opening Searcher@142d17 main
   [junit4]   2> 177600 T263 oash.ReplicationHandler.inform Replication enabled for following config files: schema.xml,xslt/dummy.xsl
   [junit4]   2> 177600 T263 oash.ReplicationHandler.inform Commits will be reserved for  10000
   [junit4]   2> 177600 T264 oasc.SolrCore.registerSearcher [collection1] Registered new searcher Searcher@142d17 main{StandardDirectoryReader(segments_1:1:nrt)}
   [junit4]   2> 177600 T263 oasc.CoreContainer.registerCore registering core: collection1
   [junit4]   2> 177601 T253 oass.SolrDispatchFilter.init user.dir=/mnt/ssd/jenkins/workspace/Lucene-Solr-trunk-Linux/solr/build/solr-core/test/J0
   [junit4]   2> 177602 T253 oass.SolrDispatchFilter.init SolrDispatchFilter.init() done
   [junit4]   2> 177602 T253 oascsi.HttpClientUtil.createClient Creating new http client, config:maxConnections=128&maxConnectionsPerHost=32&followRedirects=false
   [junit4]   2> 177612 T253 oejs.Server.doStart jetty-8.1.10.v20130312
   [junit4]   2> 177615 T253 oejs.AbstractConnector.doStart Started SelectChannelConnector@127.0.0.1:54488
   [junit4]   2> 177616 T253 oass.SolrDispatchFilter.init SolrDispatchFilter.init()
   [junit4]   2> 177616 T253 oasc.SolrResourceLoader.locateSolrHome JNDI not configured for solr (NoInitialContextEx)
   [junit4]   2> 177617 T253 oasc.SolrResourceLoader.locateSolrHome using system property solr.solr.home: ./org.apache.solr.handler.TestReplicationHandler$SolrInstance-1378972986213/slave
   [junit4]   2> 177617 T253 oasc.SolrResourceLoader.<init> new SolrResourceLoader for directory: './org.apache.solr.handler.TestReplicationHandler$SolrInstance-1378972986213/slave/'
   [junit4]   2> 177628 T253 oasc.ConfigSolr.fromFile Loading container configuration from /mnt/ssd/jenkins/workspace/Lucene-Solr-trunk-Linux/solr/build/solr-core/test/J0/./org.apache.solr.handler.TestReplicationHandler$SolrInstance-1378972986213/slave/solr.xml
   [junit4]   2> 177660 T253 oasc.CoreContainer.<init> New CoreContainer 4425906
   [junit4]   2> 177660 T253 oasc.CoreContainer.load Loading cores into CoreContainer [instanceDir=./org.apache.solr.handler.TestReplicationHandler$SolrInstance-1378972986213/slave/]
   [junit4]   2> 177661 T253 oashc.HttpShardHandlerFactory.getParameter Setting socketTimeout to: 120000
   [junit4]   2> 177661 T253 oashc.HttpShardHandlerFactory.getParameter Setting urlScheme to: http://
   [junit4]   2> 177662 T253 oashc.HttpShardHandlerFactory.getParameter Setting connTimeout to: 15000
   [junit4]   2> 177662 T253 oashc.HttpShardHandlerFactory.getParameter Setting maxConnectionsPerHost to: 20
   [junit4]   2> 177662 T253 oashc.HttpShardHandlerFactory.getParameter Setting corePoolSize to: 0
   [junit4]   2> 177662 T253 oashc.HttpShardHandlerFactory.getParameter Setting maximumPoolSize to: 2147483647
   [junit4]   2> 177663 T253 oashc.HttpShardHandlerFactory.getParameter Setting maxThreadIdleTime to: 5
   [junit4]   2> 177663 T253 oashc.HttpShardHandlerFactory.getParameter Setting sizeOfQueue to: -1
   [junit4]   2> 177663 T253 oashc.HttpShardHandlerFactory.getParameter Setting fairnessPolicy to: false
   [junit4]   2> 177664 T253 oascsi.HttpClientUtil.createClient Creating new http client, config:maxConnectionsPerHost=20&maxConnections=10000&socketTimeout=120000&connTimeout=15000&retry=false
   [junit4]   2> 177666 T253 oasl.LogWatcher.createWatcher SLF4J impl is org.slf4j.impl.Log4jLoggerFactory
   [junit4]   2> 177667 T253 oasl.LogWatcher.newRegisteredLogWatcher Registering Log Listener [Log4j (org.slf4j.impl.Log4jLoggerFactory)]
   [junit4]   2> 177670 T275 oasc.CoreContainer.create Creating SolrCore 'collection1' using instanceDir: ./org.apache.solr.handler.TestReplicationHandler$SolrInstance-1378972986213/slave/collection1
   [junit4]   2> 177670 T275 oasc.SolrResourceLoader.<init> new SolrResourceLoader for directory: './org.apache.solr.handler.TestReplicationHandler$SolrInstance-1378972986213/slave/collection1/'
   [junit4]   2> 177696 T275 oasc.SolrConfig.<init> Using Lucene MatchVersion: LUCENE_50
   [junit4]   2> 177720 T275 oasc.SolrConfig.<init> Loaded SolrConfig: solrconfig.xml
   [junit4]   2> 177721 T275 oass.IndexSchema.readSchema Reading Solr Schema from schema.xml
   [junit4]   2> 177724 T275 oass.IndexSchema.readSchema [null] Schema name=test
   [junit4]   2> 177733 T275 oass.IndexSchema.readSchema unique key field: id
   [junit4]   2> 177734 T275 oasc.SolrCore.initDirectoryFactory org.apache.solr.core.MockDirectoryFactory
   [junit4]   2> 177734 T275 oasc.SolrCore.<init> [collection1] Opening new SolrCore at ./org.apache.solr.handler.TestReplicationHandler$SolrInstance-1378972986213/slave/collection1/, dataDir=/mnt/ssd/jenkins/workspace/Lucene-Solr-trunk-Linux/solr/build/solr-core/test/J0/./org.apache.solr.handler.TestReplicationHandler$SolrInstance-1378972986213/slave/collection1/data/
   [junit4]   2> 177734 T275 oasc.SolrCore.<init> JMX monitoring not detected for core: collection1
   [junit4]   2> 177734 T275 oasc.CachingDirectoryFactory.get return new directory for /mnt/ssd/jenkins/workspace/Lucene-Solr-trunk-Linux/solr/build/solr-core/test/J0/./org.apache.solr.handler.TestReplicationHandler$SolrInstance-1378972986213/slave/collection1/data
   [junit4]   2> 177735 T275 oasc.SolrCore.getNewIndexDir New index directory detected: old=null new=/mnt/ssd/jenkins/workspace/Lucene-Solr-trunk-Linux/solr/build/solr-core/test/J0/./org.apache.solr.handler.TestReplicationHandler$SolrInstance-1378972986213/slave/collection1/data/index/
   [junit4]   2> 177735 T275 oasc.SolrCore.initIndex WARN [collection1] Solr index directory '/mnt/ssd/jenkins/workspace/Lucene-Solr-trunk-Linux/solr/build/solr-core/test/J0/./org.apache.solr.handler.TestReplicationHandler$SolrInstance-1378972986213/slave/collection1/data/index' doesn't exist. Creating new index...
   [junit4]   2> 177735 T275 oasc.CachingDirectoryFactory.get return new directory for /mnt/ssd/jenkins/workspace/Lucene-Solr-trunk-Linux/solr/build/solr-core/test/J0/./org.apache.solr.handler.TestReplicationHandler$SolrInstance-1378972986213/slave/collection1/data/index
   [junit4]   2> 177736 T275 oasu.RandomMergePolicy.<init> RandomMergePolicy wrapping class org.apache.lucene.index.TieredMergePolicy: [TieredMergePolicy: maxMergeAtOnce=24, maxMergeAtOnceExplicit=23, maxMergedSegmentMB=81.568359375, floorSegmentMB=1.5263671875, forceMergeDeletesPctAllowed=12.023213796923233, segmentsPerTier=17.0, maxCFSSegmentSizeMB=8.796093022207999E12, noCFSRatio=0.6513293739995961
   [junit4]   2> 177736 T275 oasc.SolrDeletionPolicy.onCommit SolrDeletionPolicy.onCommit: commits: num=1
   [junit4]   2> 		commit{dir=MockDirWrapper(org.apache.lucene.store.RAMDirectory@17c3b5d lockFactory=org.apache.lucene.store.SingleInstanceLockFactory@1e8f484),segFN=segments_1,generation=1}
   [junit4]   2> 177737 T275 oasc.SolrDeletionPolicy.updateCommits newest commit generation = 1
   [junit4]   2> 177737 T275 oasc.SolrCore.loadUpdateProcessorChains no updateRequestProcessorChain defined as default, creating implicit default
   [junit4]   2> 177738 T275 oasc.RequestHandlers.initHandlersFromConfig created standard: solr.StandardRequestHandler
   [junit4]   2> 177738 T275 oasc.RequestHandlers.initHandlersFromConfig created defaults: solr.StandardRequestHandler
   [junit4]   2> 177738 T275 oasc.RequestHandlers.initHandlersFromConfig adding lazy requestHandler: solr.StandardRequestHandler
   [junit4]   2> 177738 T275 oasc.RequestHandlers.initHandlersFromConfig created lazy: solr.StandardRequestHandler
   [junit4]   2> 177739 T275 oasc.RequestHandlers.initHandlersFromConfig created /update: solr.UpdateRequestHandler
   [junit4]   2> 177739 T275 oasc.RequestHandlers.initHandlersFromConfig created /replication: solr.ReplicationHandler
   [junit4]   2> 177740 T275 oashl.XMLLoader.init xsltCacheLifetimeSeconds=60
   [junit4]   2> 177741 T275 oasu.CommitTracker.<init> Hard AutoCommit: disabled
   [junit4]   2> 177742 T275 oasu.CommitTracker.<init> Soft AutoCommit: disabled
   [junit4]   2> 177742 T275 oasu.RandomMergePolicy.<init> RandomMergePolicy wrapping class org.apache.lucene.index.LogByteSizeMergePolicy: [LogByteSizeMergePolicy: minMergeSize=1677721, mergeFactor=49, maxMergeSize=2147483648, maxMergeSizeForForcedMerge=9223372036854775807, calibrateSizeByDeletes=false, maxMergeDocs=2147483647, maxCFSSegmentSizeMB=8.796093022207999E12, noCFSRatio=0.0]
   [junit4]   2> 177742 T275 oasc.SolrDeletionPolicy.onInit SolrDeletionPolicy.onInit: commits: num=1
   [junit4]   2> 		commit{dir=MockDirWrapper(org.apache.lucene.store.RAMDirectory@17c3b5d lockFactory=org.apache.lucene.store.SingleInstanceLockFactory@1e8f484),segFN=segments_1,generation=1}
   [junit4]   2> 177743 T275 oasc.SolrDeletionPolicy.updateCommits newest commit generation = 1
   [junit4]   2> 177743 T275 oass.SolrIndexSearcher.<init> Opening Searcher@b4c195 main
   [junit4]   2> 177745 T275 oash.SnapPuller.startExecutorService Poll Scheduled at an interval of 1000ms
   [junit4]   2> 177745 T276 oasc.SolrCore.registerSearcher [collection1] Registered new searcher Searcher@b4c195 main{StandardDirectoryReader(segments_1:1:nrt)}
   [junit4]   2> 177745 T275 oasc.CoreContainer.registerCore registering core: collection1
   [junit4]   2> 177746 T253 oass.SolrDispatchFilter.init user.dir=/mnt/ssd/jenkins/workspace/Lucene-Solr-trunk-Linux/solr/build/solr-core/test/J0
   [junit4]   2> 177746 T253 oass.SolrDispatchFilter.init SolrDispatchFilter.init() done
   [junit4]   2> 177746 T253 oascsi.HttpClientUtil.createClient Creating new http client, config:maxConnections=128&maxConnectionsPerHost=32&followRedirects=false
   [junit4]   2> 177770 T253 oasc.CoreContainer.shutdown Shutting down CoreContainer instance=4425906
   [junit4]   2> 177771 T253 oasc.SolrCore.close [collection1]  CLOSING SolrCore org.apache.solr.core.SolrCore@1d4880e
   [junit4]   2> 177771 T253 oasu.DirectUpdateHandler2.close closing DirectUpdateHandler2{commits=0,autocommits=0,soft autocommits=0,optimizes=0,rollbacks=0,expungeDeletes=0,docsPending=0,adds=0,deletesById=0,deletesByQuery=0,errors=0,cumulative_adds=0,cumulative_deletesById=0,cumulative_deletesByQuery=0,cumulative_errors=0}
   [junit4]   2> 177772 T253 oasu.SolrCoreState.decrefSolrCoreState Closing SolrCoreState
   [junit4]   2> 177772 T253 oasu.DefaultSolrCoreState.closeIndexWriter SolrCoreState ref count has reached 0 - closing IndexWriter
   [junit4]   2> 177772 T253 oasu.DefaultSolrCoreState.closeIndexWriter closing IndexWriter with IndexWriterCloser
   [junit4]   2> 177773 T253 oasc.SolrCore.closeSearcher [collection1] Closing main searcher on request.
   [junit4]   2> 177774 T253 oasc.CachingDirectoryFactory.close Closing MockDirectoryFactory - 2 directories currently being tracked
   [junit4]   2> 177774 T253 oasc.CachingDirectoryFactory.closeCacheValue looking to close /mnt/ssd/jenkins/workspace/Lucene-Solr-trunk-Linux/solr/build/solr-core/test/J0/./org.apache.solr.handler.TestReplicationHandler$SolrInstance-1378972986213/slave/collection1/data/index [CachedDir<<refCount=0;path=/mnt/ssd/jenkins/workspace/Lucene-Solr-trunk-Linux/solr/build/solr-core/test/J0/./org.apache.solr.handler.TestReplicationHandler$SolrInstance-1378972986213/slave/collection1/data/index;done=false>>]
   [junit4]   2> 177774 T253 oasc.CachingDirectoryFactory.close Closing directory: /mnt/ssd/jenkins/workspace/Lucene-Solr-trunk-Linux/solr/build/solr-core/test/J0/./org.apache.solr.handler.TestReplicationHandler$SolrInstance-1378972986213/slave/collection1/data/index
   [junit4]   2> 177775 T253 oasc.CachingDirectoryFactory.closeCacheValue looking to close /mnt/ssd/jenkins/workspace/Lucene-Solr-trunk-Linux/solr/build/solr-core/test/J0/./org.apache.solr.handler.TestReplicationHandler$SolrInstance-1378972986213/slave/collection1/data [CachedDir<<refCount=0;path=/mnt/ssd/jenkins/workspace/Lucene-Solr-trunk-Linux/solr/build/solr-core/test/J0/./org.apache.solr.handler.TestReplicationHandler$SolrInstance-1378972986213/slave/collection1/data;done=false>>]
   [junit4]   2> 177775 T253 oasc.CachingDirectoryFactory.close Closing directory: /mnt/ssd/jenkins/workspace/Lucene-Solr-trunk-Linux/solr/build/solr-core/test/J0/./org.apache.solr.handler.TestReplicationHandler$SolrInstance-1378972986213/slave/collection1/data
   [junit4]   2> 177775 T253 oejsh.ContextHandler.doStop stopped o.e.j.s.ServletContextHandler{/solr,null}
   [junit4]   2> 177848 T253 oasc.CoreContainer.shutdown Shutting down CoreContainer instance=9334722
   [junit4]   2> 177849 T253 oasc.SolrCore.close [collection1]  CLOSING SolrCore org.apache.solr.core.SolrCore@cf07c7
   [junit4]   2> 177850 T253 oasu.DirectUpdateHandler2.close closing DirectUpdateHandler2{commits=0,autocommits=0,soft autocommits=0,optimizes=0,rollbacks=0,expungeDeletes=0,docsPending=0,adds=0,deletesById=0,deletesByQuery=0,errors=0,cumulative_adds=0,cumulative_deletesById=0,cumulative_deletesByQuery=0,cumulative_errors=0}
   [junit4]   2> 177850 T253 oasu.SolrCoreState.decrefSolrCoreState Closing SolrCoreState
   [junit4]   2> 177851 T253 oasu.DefaultSolrCoreState.closeIndexWriter SolrCoreState ref count has reached 0 - closing IndexWriter
   [junit4]   2> 177851 T253 oasu.DefaultSolrCoreState.closeIndexWriter closing IndexWriter with IndexWriterCloser
   [junit4]   2> 177852 T253 oasc.SolrCore.closeSearcher [collection1] Closing main searcher on request.
   [junit4]   2> 177853 T253 oasc.CachingDirectoryFactory.close Closing MockDirectoryFactory - 2 directories currently being tracked
   [junit4]   2> 177853 T253 oasc.CachingDirectoryFactory.closeCacheValue looking to close /mnt/ssd/jenkins/workspace/Lucene-Solr-trunk-Linux/solr/build/solr-core/test/J0/./org.apache.solr.handler.TestReplicationHandler$SolrInstance-1378972986071/master/collection1/data [CachedDir<<refCount=0;path=/mnt/ssd/jenkins/workspace/Lucene-Solr-trunk-Linux/solr/build/solr-core/test/J0/./org.apache.solr.handler.TestReplicationHandler$SolrInstance-1378972986071/master/collection1/data;done=false>>]
   [junit4]   2> 177854 T253 oasc.CachingDirectoryFactory.close Closing directory: /mnt/ssd/jenkins/workspace/Lucene-Solr-trunk-Linux/solr/build/solr-core/test/J0/./org.apache.solr.handler.TestReplicationHandler$SolrInstance-1378972986071/master/collection1/data
   [junit4]   2> 177854 T253 oasc.CachingDirectoryFactory.closeCacheValue looking to close /mnt/ssd/jenkins/workspace/Lucene-Solr-trunk-Linux/solr/build/solr-core/test/J0/./org.apache.solr.handler.TestReplicationHandler$SolrInstance-1378972986071/master/collection1/data/index [CachedDir<<refCount=0;path=/mnt/ssd/jenkins/workspace/Lucene-Solr-trunk-Linux/solr/build/solr-core/test/J0/./org.apache.solr.handler.TestReplicationHandler$SolrInstance-1378972986071/master/collection1/data/index;done=false>>]
   [junit4]   2> 177855 T253 oasc.CachingDirectoryFactory.close Closing directory: /mnt/ssd/jenkins/workspace/Lucene-Solr-trunk-Linux/solr/build/solr-core/test/J0/./org.apache.solr.handler.TestReplicationHandler$SolrInstance-1378972986071/master/collection1/data/index
   [junit4]   2> 177855 T253 oejsh.ContextHandler.doStop stopped o.e.j.s.ServletContextHandler{/solr,null}
   [junit4]   2> 177907 T253 oejs.Server.doStart jetty-8.1.10.v20130312
   [junit4]   2> 177909 T253 oejs.AbstractConnector.doStart Started SelectChannelConnector@127.0.0.1:54488
   [junit4]   2> 177910 T253 oass.SolrDispatchFilter.init SolrDispatchFilter.init()
   [junit4]   2> 177910 T253 oasc.SolrResourceLoader.locateSolrHome JNDI not configured for solr (NoInitialContextEx)
   [junit4]   2> 177910 T253 oasc.SolrResourceLoader.locateSolrHome using system property solr.solr.home: ./org.apache.solr.handler.TestReplicationHandler$SolrInstance-1378972986213/slave
   [junit4]   2> 177911 T253 oasc.SolrResourceLoader.<init> new SolrResourceLoader for directory: './org.apache.solr.handler.TestReplicationHandler$SolrInstance-1378972986213/slave/'
   [junit4]   2> 177918 T253 oasc.ConfigSolr.fromFile Loading container configuration from /mnt/ssd/jenkins/workspace/Lucene-Solr-trunk-Linux/solr/build/solr-core/test/J0/./org.apache.solr.handler.TestReplicationHandler$SolrInstance-1378972986213/slave/solr.xml
   [junit4]   2> 177945 T253 oasc.CoreContainer.<init> New CoreContainer 6198948
   [junit4]   2> 177945 T253 oasc.CoreContainer.load Loading cores into CoreContainer [instanceDir=./org.apache.solr.handler.TestReplicationHandler$SolrInstance-1378972986213/slave/]
   [junit4]   2> 177946 T253 oashc.HttpShardHandlerFactory.getParameter Setting socketTimeout to: 120000
   [junit4]   2> 177947 T253 oashc.HttpShardHandlerFactory.getParameter Setting urlScheme to: http://
   [junit4]   2> 177947 T253 oashc.HttpShardHandlerFactory.getParameter Setting connTimeout to: 15000
   [junit4]   2> 177947 T253 oashc.HttpShardHandlerFactory.getParameter Setting maxConnectionsPerHost to: 20
   [junit4]   2> 177947 T253 oashc.HttpShardHandlerFactory.getParameter Setting corePoolSize to: 0
   [junit4]   2> 177948 T253 oashc.HttpShardHandlerFactory.getParameter Setting maximumPoolSize to: 2147483647
   [junit4]   2> 177948 T253 oashc.HttpShardHandlerFactory.getParameter Setting maxThreadIdleTime to: 5
   [junit4]   2> 177948 T253 oashc.HttpShardHandlerFactory.getParameter Setting sizeOfQueue to: -1
   [junit4]   2> 177948 T253 oashc.HttpShardHandlerFactory.getParameter Setting fairnessPolicy to: false
   [junit4]   2> 177949 T253 oascsi.HttpClientUtil.createClient Creating new http client, config:maxConnectionsPerHost=20&maxConnections=10000&socketTimeout=120000&connTimeout=15000&retry=false
   [junit4]   2> 177951 T253 oasl.LogWatcher.createWatcher SLF4J impl is org.slf4j.impl.Log4jLoggerFactory
   [junit4]   2> 177952 T253 oasl.LogWatcher.newRegisteredLogWatcher Registering Log Listener [Log4j (org.slf4j.impl.Log4jLoggerFactory)]
   [junit4]   2> 177955 T288 oasc.CoreContainer.create Creating SolrCore 'collection1' using instanceDir: ./org.apache.solr.handler.TestReplicationHandler$SolrInstance-1378972986213/slave/collection1
   [junit4]   2> 177955 T288 oasc.SolrResourceLoader.<init> new SolrResourceLoader for directory: './org.apache.solr.handler.TestReplicationHandler$SolrInstance-1378972986213/slave/collection1/'
   [junit4]   2> 177980 T288 oasc.SolrConfig.<init> Using Lucene MatchVersion: LUCENE_50
   [junit4]   2> 178004 T288 oasc.SolrConfig.<init> Loaded SolrConfig: solrconfig.xml
   [junit4]   2> 178005 T288 oass.IndexSchema.readSchema Reading Solr Schema from schema.xml
   [junit4]   2> 178008 T288 oass.IndexSchema.readSchema [null] Schema name=test
   [junit4]   2> 178016 T288 oass.IndexSchema.readSchema unique key field: id
   [junit4]   2> 178017 T288 oasc.SolrCore.initDirectoryFactory solr.NRTCachingDirectoryFactory
   [junit4]   2> 178023 T288 oasc.SolrCore.<init> [collection1] Opening new SolrCore at ./org.apache.solr.handler.TestReplicationHandler$SolrInstance-1378972986213/slave/collection1/, dataDir=/mnt/ssd/jenkins/workspace/Lucene-Solr-trunk-Linux/solr/build/solr-core/test/J0/org.apache.solr.handler.TestReplicationHandler$SolrInstance-1378972986213/slave/collection1/data/
   [junit4]   2> 178023 T288 oasc.SolrCore.<init> JMX monitoring not detected for core: collection1
   [junit4]   2> 178024 T288 oasc.CachingDirectoryFactory.get return new directory for /mnt/ssd/jenkins/workspace/Lucene-Solr-trunk-Linux/solr/build/solr-core/test/J0/org.apache.solr.handler.TestReplicationHandler$SolrInstance-1378972986213/slave/collection1/data
   [junit4]   2> 178024 T288 oasc.SolrCore.getNewIndexDir New index directory detected: old=null new=/mnt/ssd/jenkins/workspace/Lucene-Solr-trunk-Linux/solr/build/solr-core/test/J0/org.apache.solr.handler.TestReplicationHandler$SolrInstance-1378972986213/slave/collection1/data/index/
   [junit4]   2> 178024 T288 oasc.SolrCore.initIndex WARN [collection1] Solr index directory '/mnt/ssd/jenkins/workspace/Lucene-Solr-trunk-Linux/solr/build/solr-core/test/J0/org.apache.solr.handler.TestReplicationHandler$SolrInstance-1378972986213/slave/collection1/data/index' doesn't exist. Creating new index...
   [junit4]   2> 178025 T288 oasc.CachingDirectoryFactory.get return new directory for /mnt/ssd/jenkins/workspace/Lucene-Solr-trunk-Linux/solr/build/solr-core/test/J0/org.apache.solr.handler.TestReplicationHandler$SolrInstance-1378972986213/slave/collection1/data/index
   [junit4]   2> 178026 T288 oasu.RandomMergePolicy.<init> RandomMergePolicy wrapping class org.apache.lucene.index.AlcoholicMergePolicy: [AlcoholicMergePolicy: minMergeSize=0, mergeFactor=10, maxMergeSize=633471189, maxMergeSizeForForcedMerge=9223372036854775807, calibrateSizeByDeletes=true, maxMergeDocs=2147483647, maxCFSSegmentSizeMB=8.796093022207999E12, noCFSRatio=0.1]
   [junit4]   2> 178052 T288 oasc.SolrDeletionPolicy.onCommit SolrDeletionPolicy.onCommit: commits: num=1
   [junit4]   2> 		commit{dir=NRTCachingDirectory(org.apache.lucene.store.NIOFSDirectory@/mnt/ssd/jenkins/workspace/Lucene-Solr-trunk-Linux/solr/build/solr-core/test/J0/org.apache.solr.handler.TestReplicationHandler$SolrInstance-1378972986213/slave/collection1/data/index lockFactory=org.apache.lucene.store.SingleInstanceLockFactory@1258794; maxCacheMB=48.0 maxMergeSizeMB=4.0),segFN=segments_1,generation=1}
   [junit4]   2> 178053 T288 oasc.SolrDeletionPolicy.updateCommits newest commit generation = 1
   [junit4]   2> 178053 T288 oasc.SolrCore.loadUpdateProcessorChains no updateRequestProcessorChain defined as default, creating implicit default
   [junit4]   2> 178054 T288 oasc.RequestHandlers.initHandlersFromConfig created standard: solr.StandardRequestHandler
   [junit4]   2> 178054 T288 oasc.RequestHandlers.initHandlersFromConfig created defaults: solr.StandardRequestHandler
   [junit4]   2> 178054 T288 oasc.RequestHandlers.initHandlersFromConfig adding lazy requestHandler: solr.StandardRequestHandler
   [junit4]   2> 178054 T288 oasc.RequestHandlers.initHandlersFromConfig created lazy: solr.StandardRequestHandler
   [junit4]   2> 178055 T288 oasc.RequestHandlers.initHandlersFromConfig created /update: solr.UpdateRequestHandler
   [junit4]   2> 178055 T288 oasc.RequestHandlers.initHandlersFromConfig created /replication: solr.ReplicationHandler
   [junit4]   2> 178057 T288 oashl.XMLLoader.init xsltCacheLifetimeSeconds=60
   [junit4]   2> 178059 T288 oasu.CommitTracker.<init> Hard AutoCommit: disabled
   [junit4]   2> 178059 T288 oasu.CommitTracker.<init> Soft AutoCommit: disabled
   [junit4]   2> 178060 T288 oass.SolrIndexSearcher.<init> Opening Searcher@30a37b main
   [junit4]   2> 178061 T288 oash.SnapPuller.startExecutorService Poll Scheduled at an interval of 1000ms
   [junit4]   2> 178061 T288 oasc.CoreContainer.registerCore registering core: collection1
   [junit4]   2> 178061 T289 oasc.SolrCore.registerSearcher [collection1] Registered new searcher Searcher@30a37b main{StandardDirectoryReader(segments_1:1)}
   [junit4]   2> 178062 T253 oass.SolrDispatchFilter.init user.dir=/mnt/ssd/jenkins/workspace/Lucene-Solr-trunk-Linux/solr/build/solr-core/test/J0
   [junit4]   2> 178062 T253 oass.SolrDispatchFilter.init SolrDispatchFilter.init() done
   [junit4]   2> 178063 T253 oejs.Server.doStart jetty-8.1.10.v20130312
   [junit4]   2> 178064 T253 oejs.AbstractConnector.doStart Started SelectChannelConnector@127.0.0.1:41040
   [junit4]   2> 178065 T253 oass.SolrDispatchFilter.init SolrDispatchFilter.init()
   [junit4]   2> 178065 T253 oasc.SolrResourceLoader.locateSolrHome JNDI not configured for solr (NoInitialContextEx)
   [junit4]   2> 178066 T253 oasc.SolrResourceLoader.locateSolrHome using system property solr.solr.home: ./org.apache.solr.handler.TestReplicationHandler$SolrInstance-1378972986071/master
   [junit4]   2> 178066 T253 oasc.SolrResourceLoader.<init> new SolrResourceLoader for directory: './org.apache.solr.handler.TestReplicationHandler$SolrInstance-1378972986071/master/'
   [junit4]   2> 178076 T253 oasc.ConfigSolr.fromFile Loading container configuration from /mnt/ssd/jenkins/workspace/Lucene-Solr-trunk-Linux/solr/build/solr-core/test/J0/./org.apache.solr.handler.TestReplicationHandler$SolrInstance-1378972986071/master/solr.xml
   [junit4]   2> 178108 T253 oasc.CoreContainer.<init> New CoreContainer 7475411
   [junit4]   2> 178108 T253 oasc.CoreContainer.load Loading cores into CoreContainer [instanceDir=./org.apache.solr.handler.TestReplicationHandler$SolrInstance-1378972986071/master/]
   [junit4]   2> 178109 T253 oashc.HttpShardHandlerFactory.getParameter Setting socketTimeout to: 120000
   [junit4]   2> 178110 T253 oashc.HttpShardHandlerFactory.getParameter Setting urlScheme to: http://
   [junit4]   2> 178110 T253 oashc.HttpShardHandlerFactory.getParameter Setting connTimeout to: 15000
   [junit4]   2> 178110 T253 oashc.HttpShardHandlerFactory.getParameter Setting maxConnectionsPerHost to: 20
   [junit4]   2> 178110 T253 oashc.HttpShardHandlerFactory.getParameter Setting corePoolSize to: 0
   [junit4]   2> 178111 T253 oashc.HttpShardHandlerFactory.getParameter Setting maximumPoolSize to: 2147483647
   [junit4]   2> 178111 T253 oashc.HttpShardHandlerFactory.getParameter Setting maxThreadIdleTime to: 5
   [junit4]   2> 178111 T253 oashc.HttpShardHandlerFactory.getParameter Setting sizeOfQueue to: -1
   [junit4]   2> 178112 T253 oashc.HttpShardHandlerFactory.getParameter Setting fairnessPolicy to: false
   [junit4]   2> 178112 T253 oascsi.HttpClientUtil.createClient Creating new http client, config:maxConnectionsPerHost=20&maxConnections=10000&socketTimeout=120000&connTimeout=15000&retry=false
   [junit4]   2> 178115 T253 oasl.LogWatcher.createWatcher SLF4J impl is org.slf4j.impl.Log4jLoggerFactory
   [junit4]   2> 178115 T253 oasl.LogWatcher.newRegisteredLogWatcher Registering Log Listener [Log4j (org.slf4j.impl.Log4jLoggerFactory)]
   [junit4]   2> 178119 T301 oasc.CoreContainer.create Creating SolrCore 'collection1' using instanceDir: ./org.apache.solr.handler.TestReplicationHandler$SolrInstance-1378972986071/master/collection1
   [junit4]   2> 178119 T301 oasc.SolrResourceLoader.<init> new SolrResourceLoader for directory: './org.apache.solr.handler.TestReplicationHandler$SolrInstance-1378972986071/master/collection1/'
   [junit4]   2> 178150 T301 oasc.SolrConfig.<init> Using Lucene MatchVersion: LUCENE_50
   [junit4]   2> 178174 T301 oasc.SolrConfig.<init> Loaded SolrConfig: solrconfig.xml
   [junit4]   2> 178175 T301 oass.IndexSchema.readSchema Reading Solr Schema from schema.xml
   [junit4]   2> 178179 T301 oass.IndexSchema.readSchema [null] Schema name=test
   [junit4]   2> 178188 T301 oass.IndexSchema.readSchema unique key field: id
   [junit4]   2> 178189 T301 oasc.SolrCore.initDirectoryFactory solr.NRTCachingDirectoryFactory
   [junit4]   2> 178189 T301 oasc.SolrCore.<init> [collection1] Opening new SolrCore at ./org.apache.solr.handler.TestReplicationHandler$SolrInstance-1378972986071/master/collection1/, dataDir=/mnt/ssd/jenkins/workspace/Lucene-Solr-trunk-Linux/solr/build/solr-core/test/J0/org.apache.solr.handler.TestReplicationHandler$SolrInstance-1378972986071/master/collection1/data/
   [junit4]   2> 178189 T301 oasc.SolrCore.<init> JMX monitoring not detected for core: collection1
   [junit4]   2> 178190 T301 oasc.CachingDirectoryFactory.get return new directory for /mnt/ssd/jenkins/workspace/Lucene-Solr-trunk-Linux/solr/build/solr-core/test/J0/org.apache.solr.handler.TestReplicationHandler$SolrInstance-1378972986071/master/collection1/data
   [junit4]   2> 178190 T301 oasc.SolrCore.getNewIndexDir New index directory detected: old=null new=/mnt/ssd/jenkins/workspace/Lucene-Solr-trunk-Linux/solr/build/solr-core/test/J0/org.apache.solr.handler.TestReplicationHandler$SolrInstance-1378972986071/master/collection1/data/index/
   [junit4]   2> 178190 T301 oasc.SolrCore.initIndex WARN [collection1] Solr index directory '/mnt/ssd/jenkins/workspace/Lucene-Solr-trunk-Linux/solr/build/solr-core/test/J0/org.apache.solr.handler.TestReplicationHandler$SolrInstance-1378972986071/master/collection1/data/index' doesn't exist. Creating new index...
   [junit4]   2> 178191 T301 oasc.CachingDirectoryFactory.get return new directory for /mnt/ssd/jenkins/workspace/Lucene-Solr-trunk-Linux/solr/build/solr-core/test/J0/org.apache.solr.handler.TestReplicationHandler$SolrInstance-1378972986071/master/collection1/data/index
   [junit4]   2> 178192 T301 oasu.RandomMergePolicy.<init> RandomMergePolicy wrapping class org.apache.lucene.index.AlcoholicMergePolicy: [AlcoholicMergePolicy: minMergeSize=0, mergeFactor=10, maxMergeSize=633471189, maxMergeSizeForForcedMerge=9223372036854775807, calibrateSizeByDeletes=true, maxMergeDocs=2147483647, maxCFSSegmentSizeMB=8.796093022207999E12, noCFSRatio=0.1]
   [junit4]   2> 178194 T301 oasc.SolrDeletionPolicy.onCommit SolrDeletionPolicy.onCommit: commits: num=1
   [junit4]   2> 		commit{dir=NRTCachingDirectory(org.apache.lucene.store.NIOFSDirectory@/mnt/ssd/jenkins/workspace/Lucene-Solr-trunk-Linux/solr/build/solr-core/test/J0/org.apache.solr.handler.TestReplicationHandler$SolrInstance-1378972986071/master/collection1/data/index lockFactory=org.apache.lucene.store.SingleInstanceLockFactory@1b98fb1; maxCacheMB=48.0 maxMergeSizeMB=4.0),segFN=segments_1,generation=1}
   [junit4]   2> 178195 T301 oasc.SolrDeletionPolicy.updateCommits newest commit generation = 1
   [junit4]   2> 178195 T301 oasc.SolrCore.loadUpdateProcessorChains no updateRequestProcessorChain defined as default, creating implicit default
   [junit4]   2> 178196 T301 oasc.RequestHandlers.initHandlersFromConfig created standard: solr.StandardRequestHandler
   [junit4]   2> 178196 T301 oasc.RequestHandlers.initHandlersFromConfig created /replication: solr.ReplicationHandler
   [junit4]   2> 178196 T301 oasc.RequestHandlers.initHandlersFromConfig created defaults: solr.StandardRequestHandler
   [junit4]   2> 178196 T301 oasc.RequestHandlers.initHandlersFromConfig adding lazy requestHandler: solr.StandardRequestHandler
   [junit4]   2> 178196 T301 oasc.RequestHandlers.initHandlersFromConfig created lazy: solr.StandardRequestHandler
   [junit4]   2> 178197 T301 oasc.RequestHandlers.initHandlersFromConfig created /update: solr.UpdateRequestHandler
   [junit4]   2> 178199 T301 oashl.XMLLoader.init xsltCacheLifetimeSeconds=60
   [junit4]   2> 178201 T301 oasu.CommitTracker.<init> Hard AutoCommit: disabled
   [junit4]   2> 178201 T301 oasu.CommitTracker.<init> Soft AutoCommit: disabled
   [junit4]   2> 178203 T301 oass.SolrIndexSearcher.<init> Opening Searcher@49f5f1 main
   [junit4]   2> 178203 T301 oash.ReplicationHandler.inform Replication enabled for following config files: schema.xml,xslt/dummy.xsl
   [junit4]   2> 178204 T301 oash.ReplicationHandler.inform Commits will be reserved for  10000
   [junit4]   2> 178204 T301 oasc.CoreContainer.registerCore registering core: collection1
   [junit4]   2> 178204 T302 oasc.SolrCore.registerSearcher [collection1] Registered new searcher Searcher@49f5f1 main{StandardDirectoryReader(segments_1:1)}
   [junit4]   2> 178205 T253 oass.SolrDispatchFilter.init user.dir=/mnt/ssd/jenkins/workspace/Lucene-Solr-trunk-Linux/solr/build/solr-core/test/J0
   [junit4]   2> 178205 T253 oass.SolrDispatchFilter.init SolrDispatchFilter.init() done
   [junit4]   2> ASYNC  NEW_CORE C113 name=collection1 org.apache.solr.core.SolrCore@1626697
   [junit4]   2> 178211 T284 C113 oasu.RandomMergePolicy.<init> RandomMergePolicy wrapping class org.apache.lucene.index.AlcoholicMergePolicy: [AlcoholicMergePolicy: minMergeSize=0, mergeFactor=10, maxMergeSize=633471189, maxMergeSizeForForcedMerge=9223372036854775807, calibrateSizeByDeletes=true, maxMergeDocs=2147483647, maxCFSSegmentSizeMB=8.796093022207999E12, noCFSRatio=0.1]
   [junit4]   2> 178212 T284 C113 oasc.SolrDeletionPolicy.onInit SolrDeletionPolicy.onInit: commits: num=1
   [junit4]   2> 		commit{dir=NRTCachingDirectory(org.apache.lucene.store.NIOFSDirectory@/mnt/ssd/jenkins/workspace/Lucene-Solr-trunk-Linux/solr/build/solr-core/test/J0/org.apache.solr.handler.TestReplicationHandler$SolrInstance-1378972986213/slave/collection1/data/index lockFactory=org.apache.lucene.store.SingleInstanceLockFactory@1258794; maxCacheMB=48.0 maxMergeSizeMB=4.0),segFN=segments_1,generation=1}
   [junit4]   2> 178213 T284 C113 oasc.SolrDeletionPolicy.updateCommits newest commit generation = 1
   [junit4]   2> 178213 T284 C113 oasup.LogUpdateProcessor.finish [collection1] webapp=/solr path=/update params={wt=javabin&version=2} {add=[123456]} 0 3
   [junit4]   2> 178216 T285 C113 oasu.DirectUpdateHandler2.commit start commit{,optimize=false,openSearcher=true,waitSearcher=true,expungeDeletes=false,softCommit=false,prepareCommit=false}
   [junit4]   2> 178231 T285 C113 oasc.SolrDeletionPolicy.onCommit SolrDeletionPolicy.onCommit: commits: num=2
   [junit4]   2> 		commit{dir=NRTCachingDirectory(org.apache.lucene.store.NIOFSDirectory@/mnt/ssd/jenkins/workspace/Lucene-Solr-trunk-Linux/solr/build/solr-core/test/J0/org.apache.solr.handler.TestReplicationHandler$SolrInstance-1378972986213/slave/collection1/data/index lockFactory=org.apache.lucene.store.SingleInstanceLockFactory@1258794; maxCacheMB=48.0 maxMergeSizeMB=4.0),segFN=segments_1,generation=1}
   [junit4]   2> 		commit{dir=NRTCachingDirectory(org.apache.lucene.store.NIOFSDirectory@/mnt/ssd/jenkins/workspace/Lucene-Solr-trunk-Linux/solr/build/solr-core/test/J0/org.apache.solr.handler.TestReplicationHandler$SolrInstance-1378972986213/slave/collection1/data/index lockFactory=org.apache.lucene.store.SingleInstanceLockFactory@1258794; maxCacheMB=48.0 maxMergeSizeMB=4.0),segFN=segments_2,generation=2}
   [junit4]   2> 178232 T285 C113 oasc.SolrDeletionPolicy.updateCommits newest commit generation = 2
   [junit4]   2> 178236 T285 C113 oass.SolrIndexSearcher.<init> Opening Searcher@18366fc main
   [junit4]   2> 178237 T285 C113 oasu.DirectUpdateHandler2.commit end_commit_flush
   [junit4]   2> 178237 T289 oasc.SolrCore.registerSearcher [collection1] Registered new searcher Searcher@18366fc main{StandardDirectoryReader(segments_2:3 _0(5.0):C1)}
   [junit4]   2> 178238 T285 C113 oasup.LogUpdateProcessor.finish [collection1] webapp=/solr path=/update params={waitSearcher=true&commit=true&wt=javabin&version=2&softCommit=false} {commit=} 0 21
   [junit4]   2> 178259 T253 oasc.CoreContainer.shutdown Shutting down CoreContainer instance=6198948
   [junit4]   2> 178260 T253 oasc.SolrCore.close [collection1]  CLOSING SolrCore org.apache.solr.core.SolrCore@1626697
   [junit4]   2> 178261 T253 oasu.DirectUpdateHandler2.close closing DirectUpdateHandler2{commits=1,autocommits=0,soft autocommits=0,optimizes=0,rollbacks=0,expungeDeletes=0,docsPending=0,adds=0,deletesById=0,deletesByQuery=0,errors=0,cumulative_adds=1,cumulative_deletesById=0,cumulative_deletesByQuery=0,cumulative_errors=0}
   [junit4]   2> 178262 T253 oasu.SolrCoreState.decrefSolrCoreState Closing SolrCoreState
   [junit4]   2> 178262 T253 oasu.DefaultSolrCoreState.closeIndexWriter SolrCoreState ref count has reached 0 - closing IndexWriter
   [junit4]   2> 178263 T253 oasu.DefaultSolrCoreState.closeIndexWriter closing IndexWriter with IndexWriterCloser
   [junit4]   2> 178264 T253 oasc.SolrCore.closeSearcher [collection1] Closing main searcher on request.
   [junit4]   2> 178265 T253 oasc.CachingDirectoryFactory.close Closing NRTCachingDirectoryFactory - 2 directories currently being tracked
   [junit4]   2> 178266 T253 oasc.CachingDirectoryFactory.closeCacheValue looking to close /mnt/ssd/jenkins/workspace/Lucene-Solr-trunk-Linux/solr/build/solr-core/test/J0/org.apache.solr.handler.TestReplicationHandler$SolrInstance-1378972986213/slave/collection1/data/index [CachedDir<<refCount=0;path=/mnt/ssd/jenkins/workspace/Lucene-Solr-trunk-Linux/solr/build/solr-core/test/J0/org.apache.solr.handler.TestReplicationHandler$SolrInstance-1378972986213/slave/collection1/data/index;done=false>>]
   [junit4]   2> 178266 T253 oasc.CachingDirectoryFactory.close Closing directory: /mnt/ssd/jenkins/workspace/Lucene-Solr-trunk-Linux/solr/build/solr-core/test/J0/org.apache.solr.handler.TestReplicationHandler$SolrInstance-1378972986213/slave/collection1/data/index
   [junit4]   2> 178266 T253 oasc.CachingDirectoryFactory.closeCacheValue looking to close /mnt/ssd/jenkins/workspace/Lucene-Solr-trunk-Linux/solr/build/solr-core/test/J0/org.apache.solr.handler.TestReplicationHandler$SolrInstance-1378972986213/slave/collection1/data [CachedDir<<refCount=0;path=/mnt/ssd/jenkins/workspace/Lucene-Solr-trunk-Linux/solr/build/solr-core/test/J0/org.apache.solr.handler.TestReplicationHandler$SolrInstance-1378972986213/slave/collection1/data;done=false>>]
   [junit4]   2> 178267 T253 oasc.CachingDirectoryFactory.close Closing directory: /mnt/ssd/jenkins/workspace/Lucene-Solr-trunk-Linux/solr/build/solr-core/test/J0/org.apache.solr.handler.TestReplicationHandler$SolrInstance-1378972986213/slave/collection1/data
   [junit4]   2> 178267 T253 oejsh.ContextHandler.doStop stopped o.e.j.s.ServletContextHandler{/solr,null}
   [junit4]   2> 178319 T253 oejs.Server.doStart jetty-8.1.10.v20130312
   [junit4]   2> 178321 T253 oejs.AbstractConnector.doStart Started SelectChannelConnector@127.0.0.1:54488
   [junit4]   2> 178322 T253 oass.SolrDispatchFilter.init SolrDispatchFilter.init()
   [junit4]   2> 178322 T253 oasc.SolrResourceLoader.locateSolrHome JNDI not configured for solr (NoInitialContextEx)
   [junit4]   2> 178323 T253 oasc.SolrResourceLoader.locateSolrHome using system property solr.solr.home: ./org.apache.solr.handler.TestReplicationHandler$SolrInstance-1378972986213/slave
   [junit4]   2> 178323 T253 oasc.SolrResourceLoader.<init> new SolrResourceLoader for directory: './org.apache.solr.handler.TestReplicationHandler$SolrInstance-1378972986213/slave/'
   [junit4]   2> 178333 T253 oasc.ConfigSolr.fromFile Loading container configuration from /mnt/ssd/jenkins/workspace/Lucene-Solr-trunk-Linux/solr/build/solr-core/test/J0/./org.apache.solr.handler.TestReplicationHandler$SolrInstance-1378972986213/slave/solr.xml
   [junit4]   2> 178363 T253 oasc.CoreContainer.<init> New CoreContainer 8003061
   [junit4]   2> 178363 T253 oasc.CoreContainer.load Loading cores into CoreContainer [instanceDir=./org.apache.solr.handler.TestReplicationHandler$SolrInstance-1378972986213/slave/]
   [junit4]   2> 178364 T253 oashc.HttpShardHandlerFactory.getParameter Setting socketTimeout to: 120000
   [junit4]   2> 178365 T253 oashc.HttpShardHandlerFactory.getParameter Setting urlScheme to: http://
   [junit4]   2> 178365 T253 oashc.HttpShardHandlerFactory.getParameter Setting connTimeout to: 15000
   [junit4]   2> 178365 T253 oashc.HttpShardHandlerFactory.getParameter Setting maxConnectionsPerHost to: 20
   [junit4]   2> 178366 T253 oashc.HttpShardHandlerFactory.getParameter Setting corePoolSize to: 0
   [junit4]   2> 178366 T253 oashc.HttpShardHandlerFactory.getParameter Setting maximumPoolSize to: 2147483647
   [junit4]   2> 178366 T253 oashc.HttpShardHandlerFactory.getParameter Setting maxThreadIdleTime to: 5
   [junit4]   2> 178366 T253 oashc.HttpShardHandlerFactory.getParameter Setting sizeOfQueue to: -1
   [junit4]   2> 178367 T253 oashc.HttpShardHandlerFactory.getParameter Setting fairnessPolicy to: false
   [junit4]   2> 178367 T253 oascsi.HttpClientUtil.createClient Creating new http client, config:maxConnectionsPerHost=20&maxConnections=10000&socketTimeout=120000&connTimeout=15000&retry=false
   [junit4]   2> 178370 T253 oasl.LogWatcher.createWatcher SLF4J impl is org.slf4j.impl.Log4jLoggerFactory
   [junit4]   2> 178371 T253 oasl.LogWatcher.newRegisteredLogWatcher Registering Log Listener [Log4j (org.slf4j.impl.Log4jLoggerFactory)]
   [junit4]   2> 178374 T313 oasc.CoreContainer.create Creating SolrCore 'collection1' using instanceDir: ./org.apache.solr.handler.TestReplicationHandler$SolrInstance-1378972986213/slave/collection1
   [junit4]   2> 178374 T313 oasc.SolrResourceLoader.<init> new SolrResourceLoader for directory: './org.apache.solr.handler.TestReplicationHandler$SolrInstance-1378972986213/slave/collection1/'
   [junit4]   2> 178401 T313 oasc.SolrConfig.<init> Using Lucene MatchVersion: LUCENE_50
   [junit4]   2> 178426 T313 oasc.SolrConfig.<init> Loaded SolrConfig: solrconfig.xml
   [junit4]   2> 178426 T313 oass.IndexSchema.readSchema Reading Solr Schema from schema.xml
   [junit4]   2> 178430 T313 oass.IndexSchema.readSchema [null] Schema name=test
   [junit4]   2> 178439 T313 oass.IndexSchema.readSchema unique key field: id
   [junit4]   2> 178440 T313 oasc.SolrCore.initDirectoryFactory solr.NRTCachingDirectoryFactory
   [junit4]   2> 178440 T313 oasc.SolrCore.<init> [collection1] Opening new SolrCore at ./org.apache.solr.handler.TestReplicationHandler$SolrInstance-1378972986213/slave/collection1/, dataDir=/mnt/ssd/jenkins/workspace/Lucene-Solr-trunk-Linux/solr/build/solr-core/test/J0/org.apache.solr.handler.TestReplicationHandler$SolrInstance-1378972986213/slave/collection1/data/
   [junit4]   2> 178440 T313 oasc.SolrCore.<init> JMX monitoring not detected for core: collection1
   [junit4]   2> 178441 T313 oasc.CachingDirectoryFactory.get return new directory for /mnt/ssd/jenkins/workspace/Lucene-Solr-trunk-Linux/solr/build/solr-core/test/J0/org.apache.solr.handler.TestReplicationHandler$SolrInstance-1378972986213/slave/collection1/data
   [junit4]   2> 178441 T313 oasc.SolrCore.getNewIndexDir New index directory detected: old=null new=/mnt/ssd/jenkins/workspace/Lucene-Solr-trunk-Linux/solr/build/solr-core/test/J0/org.apache.solr.handler.TestReplicationHandler$SolrInstance-1378972986213/slave/collection1/data/index/
   [junit4]   2> 178442 T313 oasc.SolrCore.loadUpdateProcessorChains no updateRequestProcessorChain defined as default, creating implicit default
   [junit4]   2> 178442 T313 oasc.RequestHandlers.initHandlersFromConfig created standard: solr.StandardRequestHandler
   [junit4]   2> 178442 T313 oasc.RequestHandlers.initHandlersFromConfig created defaults: solr.StandardRequestHandler
   [junit4]   2> 178442 T313 oasc.RequestHandlers.initHandlersFromConfig adding lazy requestHandler: solr.StandardRequestHandler
   [junit4]   2> 178443 T313 oasc.RequestHandlers.initHandlersFromConfig created lazy: solr.StandardRequestHandler
   [junit4]   2> 178443 T313 oasc.RequestHandlers.initHandlersFromConfig created /update: solr.UpdateRequestHandler
   [junit4]   2> 178443 T313 oasc.RequestHandlers.initHandlersFromConfig created /replication: solr.ReplicationHandler
   [junit4]   2> 178446 T313 oashl.XMLLoader.init xsltCacheLifetimeSeconds=60
   [junit4]   2> 178447 T313 oasu.CommitTracker.<init> Hard AutoCommit: disabled
   [junit4]   2> 178447 T313 oasu.CommitTracker.<init> Soft AutoCommit: disabled
   [junit4]   2> 178448 T313 oasc.CachingDirectoryFactory.get return new directory for /mnt/ssd/jenkins/workspace/Lucene-Solr-trunk-Linux/solr/build/solr-core/test/J0/org.apache.solr.handler.TestReplicationHandler$SolrInstance-1378972986213/slave/collection1/data/index
   [junit4]   2> 178450 T313 oass.SolrIndexSearcher.<init> Opening Searcher@173e9cc main
   [junit4]   2> 178450 T313 oash.SnapPuller.startExecutorService Poll Scheduled at an interval of 1000ms
   [junit4]   2> 178451 T313 oasc.CoreContainer.registerCore registering core: collection1
   [junit4]   2> 178451 T314 oasc.SolrCore.registerSearcher [collection1] Registered new searcher Searcher@173e9cc main{StandardDirectoryReader(segments_2:3 _0(5.0):C1)}
   [junit4]   2> 178451 T253 oass.SolrDispatchFilter.init user.dir=/mnt/ssd/jenkins/workspace/Lucene-Solr-trunk-Linux/solr/build/solr-core/test/J0
   [junit4]   2> 178451 T253 oass.SolrDispatchFilter.init SolrDispatchFilter.init() done
   [junit4]   2> 178465 T317 oash.SnapPuller.<init> WARN 'masterUrl' must be specified without the /replication suffix
   [junit4]   2> 178466 T317 oash.SnapPuller.<init>  No value set for 'pollInterval'. Timer Task not started.
   [junit4]   2> ASYNC  NEW_CORE C114 name=collection1 org.apache.solr.core.SolrCore@13447b5
   [junit4]   2> 178471 T298 C114 oasc.SolrCore.execute [collection1] webapp=/solr path=/replication params={command=indexversion&qt=/replication&wt=javabin&version=2} status=0 QTime=1 
   [junit4]   2> ASYNC  NEW_CORE C115 name=collection1 org.apache.solr.core.SolrCore@11d7ab5
   [junit4]   2> 178471 T310 C115 oasc.SolrCore.execute [collection1] webapp=/solr path=/replication params={masterUrl=http://127.0.0.1:41040/solr/replication&command=fetchindex&wait=true} status=0 QTime=7 
   [junit4]   2> 178475 T253 oas.SolrTestCaseJ4.tearDown ###Ending testNoWriter
   [junit4]   2> 178497 T253 oasc.CoreContainer.shutdown Shutting down CoreContainer instance=7475411
   [junit4]   2> 178497 T253 oasc.SolrCore.close [collection1]  CLOSING SolrCore org.apache.solr.core.SolrCore@13447b5
   [junit4]   2> 178498 T253 oasu.DirectUpdateHandler2.close closing DirectUpdateHandler2{commits=0,autocommits=0,soft autocommits=0,optimizes=0,rollbacks=0,expungeDeletes=0,docsPending=0,adds=0,deletesById=0,deletesByQuery=0,errors=0,cumulative_adds=0,cumulative_deletesById=0,cumulative_deletesByQuery=0,cumulative_errors=0}
   [junit4]   2> 178498 T253 oasu.SolrCoreState.decrefSolrCoreState Closing SolrCoreState
   [junit4]   2> 178498 T253 oasu.DefaultSolrCoreState.closeIndexWriter SolrCoreState ref count has reached 0 - closing IndexWriter
   [junit4]   2> 178499 T253 oasu.DefaultSolrCoreState.closeIndexWriter closing IndexWriter with IndexWriterCloser
   [junit4]   2> 178499 T253 oasc.SolrCore.closeSearcher [collection1] Closing main searcher on request.
   [junit4]   2> 178499 T253 oasc.CachingDirectoryFactory.close Closing NRTCachingDirectoryFactory - 2 directories currently being tracked
   [junit4]   2> 178500 T253 oasc.CachingDirectoryFactory.closeCacheValue looking to close /mnt/ssd/jenkins/workspace/Lucene-Solr-trunk-Linux/solr/build/solr-core/test/J0/org.apache.solr.handler.TestReplicationHandler$SolrInstance-1378972986071/master/collection1/data [CachedDir<<refCount=0;path=/mnt/ssd/jenkins/workspace/Lucene-Solr-trunk-Linux/solr/build/solr-core/test/J0/org.apache.solr.handler.TestReplicationHandler$SolrInstance-1378972986071/master/collection1/data;done=false>>]
   [junit4]   2> 178500 T253 oasc.CachingDirectoryFactory.close Closing directory: /mnt/ssd/jenkins/workspace/Lucene-Solr-trunk-Linux/solr/build/solr-core/test/J0/org.apache.solr.handler.TestReplicationHandler$SolrInstance-1378972986071/master/collection1/data
   [junit4]   2> 178500 T253 oasc.CachingDirectoryFactory.closeCacheValue looking to close /mnt/ssd/jenkins/workspace/Lucene-Solr-trunk-Linux/solr/build/solr-core/test/J0/org.apache.solr.handler.TestReplicationHandler$SolrInstance-1378972986071/master/collection1/data/index [CachedDir<<refCount=0;path=/mnt/ssd/jenkins/workspace/Lucene-Solr-trunk-Linux/solr/build/solr-core/test/J0/org.apache.solr.handler.TestReplicationHandler$SolrInstance-1378972986071/master/collection1/data/index;done=false>>]
   [junit4]   2> 178501 T253 oasc.CachingDirectoryFactory.close Closing directory: /mnt/ssd/jenkins/workspace/Lucene-Solr-trunk-Linux/solr/build/solr-core/test/J0/org.apache.solr.handler.TestReplicationHandler$SolrInstance-1378972986071/master/collection1/data/index
   [junit4]   2> 178501 T253 oejsh.ContextHandler.doStop stopped o.e.j.s.ServletContextHandler{/solr,null}
   [junit4]   2> 178576 T253 oasc.CoreContainer.shutdown Shutting down CoreContainer instance=8003061
   [junit4]   2> 178577 T253 oasc.SolrCore.close [collection1]  CLOSING SolrCore org.apache.solr.core.SolrCore@11d7ab5
   [junit4]   2> 178577 T253 oasu.DirectUpdateHandler2.close closing DirectUpdateHandler2{commits=0,autocommits=0,soft autocommits=0,optimizes=0,rollbacks=0,expungeDeletes=0,docsPending=0,adds=0,deletesById=0,deletesByQuery=0,errors=0,cumulative_adds=0,cumulative_deletesById=0,cumulative_deletesByQuery=0,cumulative_errors=0}
   [junit4]   2> 178578 T253 oasu.SolrCoreState.decrefSolrCoreState Closing SolrCoreState
   [junit4]   2> 178578 T253 oasu.DefaultSolrCoreState.closeIndexWriter SolrCoreState ref count has reached 0 - closing IndexWriter
   [junit4]   2> 178578 T253 oasu.DefaultSolrCoreState.closeIndexWriter closing IndexWriter with IndexWriterCloser
   [junit4]   2> 178579 T253 oasc.SolrCore.closeSearcher [collection1] Closing main searcher on request.
   [junit4]   2> 178580 T253 oasc.CachingDirectoryFactory.close Closing NRTCachingDirectoryFactory - 2 directories currently being tracked
   [junit4]   2> 178580 T253 oasc.CachingDirectoryFactory.closeCacheValue looking to close /mnt/ssd/jenkins/workspace/Lucene-Solr-trunk-Linux/solr/build/solr-core/test/J0/org.apache.solr.handler.TestReplicationHandler$SolrInstance-1378972986213/slave/collection1/data/index [CachedDir<<refCount=0;path=/mnt/ssd/jenkins/workspace/Lucene-Solr-trunk-Linux/solr/build/solr-core/test/J0/org.apache.solr.handler.TestReplicationHandler$SolrInstance-1378972986213/slave/collection1/data/index;done=false>>]
   [junit4]   2> 178580 T253 oasc.CachingDirectoryFactory.close Closing directory: /mnt/ssd/jenkins/workspace/Lucene-Solr-trunk-Linux/solr/build/solr-core/test/J0/org.apache.solr.handler.TestReplicationHandler$SolrInstance-1378972986213/slave/collection1/data/index
   [junit4]   2> 178581 T253 oasc.CachingDirectoryFactory.closeCacheValue looking to close /mnt/ssd/jenkins/workspace/Lucene-Solr-trunk-Linux/solr/build/solr-core/test/J0/org.apache.solr.handler.TestReplicationHandler$SolrInstance-1378972986213/slave/collection1/data [CachedDir<<refCount=0;path=/mnt/ssd/jenkins/workspace/Lucene-Solr-trunk-Linux/solr/build/solr-core/test/J0/org.apache.solr.handler.TestReplicationHandler$SolrInstance-1378972986213/slave/collection1/data;done=false>>]
   [junit4]   2> 178581 T253 oasc.CachingDirectoryFactory.close Closing directory: /mnt/ssd/jenkins/workspace/Lucene-Solr-trunk-Linux/solr/build/solr-core/test/J0/org.apache.solr.handler.TestReplicationHandler$SolrInstance-1378972986213/slave/collection1/data
   [junit4]   2> 178581 T253 oejsh.ContextHandler.doStop stopped o.e.j.s.ServletContextHandler{/solr,null}
   [junit4]   2> 178643 T253 oas.SolrTestCaseJ4.setUp ###Starting doTestReplicateAfterWrite2Slave
   [junit4]   2> 178647 T253 oejs.Server.doStart jetty-8.1.10.v20130312
   [junit4]   2> 178649 T253 oejs.AbstractConnector.doStart Started SelectChannelConnector@127.0.0.1:33561
   [junit4]   2> 178650 T253 oass.SolrDispatchFilter.init SolrDispatchFilter.init()
   [junit4]   2> 178650 T253 oasc.SolrResourceLoader.locateSolrHome JNDI not configured for solr (NoInitialContextEx)
   [junit4]   2> 178650 T253 oasc.SolrResourceLoader.locateSolrHome using system property solr.solr.home: ./org.apache.solr.handler.TestReplicationHandler$SolrInstance-1378972987250/master
   [junit4]   2> 178650 T253 oasc.SolrResourceLoader.<init> new SolrResourceLoader for directory: './org.apache.solr.handler.TestReplicationHandler$SolrInstance-1378972987250/master/'
   [junit4]   2> 178661 T253 oasc.ConfigSolr.fromFile Loading container configuration from /mnt/ssd/jenkins/workspace/Lucene-Solr-trunk-Linux/solr/build/solr-core/test/J0/./org.apache.solr.handler.TestReplicationHandler$SolrInstance-1378972987250/master/solr.xml
   [junit4]   2> 178697 T253 oasc.CoreContainer.<init> New CoreContainer 29192871
   [junit4]   2> 178697 T253 oasc.CoreContainer.load Loading cores into CoreContainer [instanceDir=./org.apache.solr.handler.TestReplicationHandler$SolrInstance-1378972987250/master/]
   [junit4]   2> 178698 T253 oashc.HttpShardHandlerFactory.getParameter Setting socketTimeout to: 120000
   [junit4]   2> 178698 T253 oashc.HttpShardHandlerFactory.getParameter Setting urlScheme to: http://
   [junit4]   2> 178699 T253 oashc.HttpShardHandlerFactory.getParameter Setting connTimeout to: 15000
   [junit4]   2> 178699 T253 oashc.HttpShardHandlerFactory.getParameter Setting maxConnectionsPerHost to: 20
   [junit4]   2> 178699 T253 oashc.HttpShardHandlerFactory.getParameter Setting corePoolSize to: 0
   [junit4]   2> 178700 T253 oashc.HttpShardHandlerFactory.getParameter Setting maximumPoolSize to: 2147483647
   [junit4]   2> 178700 T253 oashc.HttpShardHandlerFactory.getParameter Setting maxThreadIdleTime to: 5
   [junit4]   2> 178700 T253 oashc.HttpShardHandlerFactory.getParameter Setting sizeOfQueue to: -1
   [junit4]   2> 178700 T253 oashc.HttpShardHandlerFactory.getParameter Setting fairnessPolicy to: false
   [junit4]   2> 178701 T253 oascsi.HttpClientUtil.createClient Creating new http client, config:maxConnectionsPerHost=20&maxConnections=10000&socketTimeout=120000&connTimeout=15000&retry=false
   [junit4]   2> 178704 T253 oasl.LogWatcher.createWatcher SLF4J impl is org.slf4j.impl.Log4jLoggerFactory
   [junit4]   2> 178705 T253 oasl.LogWatcher.newRegisteredLogWatcher Registering Log Listener [Log4j (org.slf4j.impl.Log4jLoggerFactory)]
   [junit4]   2> 178708 T328 oasc.CoreContainer.create Creating SolrCore 'collection1' using instanceDir: ./org.apache.solr.handler.TestReplicationHandler$SolrInstance-1378972987250/master/collection1
   [junit4]   2> 178709 T328 oasc.SolrResourceLoader.<init> new SolrResourceLoader for directory: './org.apache.solr.handler.TestReplicationHandler$SolrInstance-1378972987250/master/collection1/'
   [junit4]   2> 178742 T328 oasc.SolrConfig.<init> Using Lucene MatchVersion: LUCENE_50
   [junit4]   2> 178772 T328 oasc.SolrConfig.<init> Loaded SolrConfig: solrconfig.xml
   [junit4]   2> 178772 T328 oass.IndexSchema.readSchema Reading Solr Schema from schema.xml
   [junit4]   2> 178776 T328 oass.IndexSchema.readSchema [null] Schema name=test
   [junit4]   2> 178786 T328 oass.IndexSchema.readSchema unique key field: id
   [junit4]   2> 178787 T328 oasc.SolrCore.initDirectoryFactory org.apache.solr.core.MockDirectoryFactory
   [junit4]   2> 178788 T328 oasc.SolrCore.<init> [collection1] Opening new SolrCore at ./org.apache.solr.handler.TestReplicationHandler$SolrInstance-1378972987250/master/collection1/, dataDir=/mnt/ssd/jenkins/workspace/Lucene-Solr-trunk-Linux/solr/build/solr-core/test/J0/./org.apache.solr.handler.TestReplicationHandler$SolrInstance-1378972987250/master/collection1/data/
   [junit4]   2> 178788 T328 oasc.SolrCore.<init> JMX monitoring not detected for core: collection1
   [junit4]   2> 178788 T328 oasc.CachingDirectoryFactory.get return new directory for /mnt/ssd/jenkins/workspace/Lucene-Solr-trunk-Linux/solr/build/solr-core/test/J0/./org.apache.solr.handler.TestReplicationHandler$SolrInstance-1378972987250/master/collection1/data
   [junit4]   2> 178789 T328 oasc.SolrCore.getNewIndexDir New index directory detected: old=null new=/mnt/ssd/jenkins/workspace/Lucene-Solr-trunk-Linux/solr/build/solr-core/test/J0/./org.apache.solr.handler.TestReplicationHandler$SolrInstance-1378972987250/master/collection1/data/index/
   [junit4]   2> 178789 T328 oasc.SolrCore.initIndex WARN [collection1] Solr index directory '/mnt/ssd/jenkins/workspace/Lucene-Solr-trunk-Linux/solr/build/solr-core/test/J0/./org.apache.solr.handler.TestReplicationHandler$SolrInstance-1378972987250/master/collection1/data/index' doesn't exist. Creating new index...
   [junit4]   2> 178789 T328 oasc.CachingDirectoryFactory.get return new directory for /mnt/ssd/jenkins/workspace/Lucene-Solr-trunk-Linux/solr/build/solr-core/test/J0/./org.apache.solr.handler.TestReplicationHandler$SolrInstance-1378972987250/master/collection1/data/index
   [junit4]   2> 178790 T328 oasu.RandomMergePolicy.<init> RandomMergePolicy wrapping class org.apache.lucene.index.TieredMergePolicy: [TieredMergePolicy: maxMergeAtOnce=24, maxMergeAtOnceExplicit=23, maxMergedSegmentMB=81.568359375, floorSegmentMB=1.5263671875, forceMergeDeletesPctAllowed=12.023213796923233, segmentsPerTier=17.0, maxCFSSegmentSizeMB=8.796093022207999E12, noCFSRatio=0.6513293739995961
   [junit4]   2> 178792 T328 oasc.SolrDeletionPolicy.onCommit SolrDeletionPolicy.onCommit: commits: num=1
   [junit4]   2> 		commit{dir=MockDirWrapper(org.apache.lucene.store.RAMDirectory@2817d7 lockFactory=org.apache.lucene.store.SingleInstanceLockFactory@17c26b4),segFN=segments_1,generation=1}
   [junit4]   2> 178793 T328 oasc.SolrDeletionPolicy.updateCommits newest commit generation = 1
   [junit4]   2> 178793 T328 oasc.SolrCore.loadUpdateProcessorChains no updateRequestProcessorChain defined as default, creating implicit default
   [junit4]   2> 178794 T328 oasc.RequestHandlers.initHandlersFromConfig created standard: solr.StandardRequestHandler
   [junit4]   2> 178794 T328 oasc.RequestHandlers.initHandlersFromConfig created /replication: solr.ReplicationHandler
   [junit4]   2> 178794 T328 oasc.RequestHandlers.initHandlersFromConfig created defaults: solr.StandardRequestHandler
   [junit4]   2> 178794 T328 oasc.RequestHandlers.initHandlersFromConfig adding lazy requestHandler: solr.StandardRequestHandler
   [junit4]   2> 178795 T328 oasc.RequestHandlers.initHandlersFromConfig created lazy: solr.StandardRequestHandler
   [junit4]   2> 178795 T328 oasc.RequestHandlers.initHandlersFromConfig created /update: solr.UpdateRequestHandler
   [junit4]   2> 178797 T328 oashl.XMLLoader.init xsltCacheLifetimeSeconds=60
   [junit4]   2> 178799 T328 oasu.CommitTracker.<init> Hard AutoCommit: disabled
   [junit4]   2> 178800 T328 oasu.CommitTracker.<init> Soft AutoCommit: disabled
   [junit4]   2> 178800 T328 oasu.RandomMergePolicy.<init> RandomMergePolicy wrapping class org.apache.lucene.index.LogByteSizeMergePolicy: [LogByteSizeMergePolicy: minMergeSize=1677721, mergeFactor=49, maxMergeSize=2147483648, maxMergeSizeForForcedMerge=9223372036854775807, calibrateSizeByDeletes=false, maxMergeDocs=2147483647, maxCFSSegmentSizeMB=8.796093022207999E12, noCFSRatio=0.0]
   [junit4]   2> 178800 T328 oasc.SolrDeletionPolicy.onInit SolrDeletionPolicy.onInit: commits: num=1
   [junit4]   2> 		commit{dir=MockDirWrapper(org.apache.lucene.store.RAMDirectory@2817d7 lockFactory=org.apache.lucene.store.SingleInstanceLockFactory@17c26b4),segFN=segments_1,generation=1}
   [junit4]   2> 178801 T328 oasc.SolrDeletionPolicy.updateCommits newest commit generation = 1
   [junit4]   2> 178801 T328 oass.SolrIndexSearcher.<init> Opening Searcher@ee24bf main
   [junit4]   2> 178801 T328 oash.ReplicationHandler.inform Replication enabled for following config files: schema.xml,xslt/dummy.xsl
   [junit4]   2> 178801 T328 oash.ReplicationHandler.inform Commits will be reserved for  10000
   [junit4]   2> 178802 T329 oasc.SolrCore.registerSearcher [collection1] Registered new searcher Searcher@ee24bf main{StandardDirectoryReader(segments_1:1:nrt)}
   [junit4]   2> 178802 T328 oasc.CoreContainer.registerCore registering core: collection1
   [junit4]   2> 178803 T253 oass.SolrDispatchFilter.init user.dir=/mnt/ssd/jenkins/workspace/Lucene-Solr-trunk-Linux/solr/build/solr-core/test/J0
   [junit4]   2> 178803 T253 oass.SolrDispatchFilter.init SolrDispatchFilter.init() done
   [junit4]   2> 178804 T253 oascsi.HttpClientUtil.createClient Creating new http client, config:maxConnections=128&maxConnectionsPerHost=32&followRedirects=false
   [junit4]   2> 178811 T253 oejs.Server.doStart jetty-8.1.10.v20130312
   [junit4]   2> 178813 T253 oejs.AbstractConnector.doStart Started SelectChannelConnector@127.0.0.1:41905
   [junit4]   2> 178813 T253 oass.SolrDispatchFilter.init SolrDispatchFilter.init()
   [junit4]   2> 178814 T253 oasc.SolrResourceLoader.locateSolrHome JNDI not configured for solr (NoInitialContextEx)
   [junit4]   2> 178814 T253 oasc.SolrResourceLoader.locateSolrHome using system property solr.solr.home: ./org.apache.solr.handler.TestReplicationHandler$SolrInstance-1378972987415/slave
   [junit4]   2> 178814 T253 oasc.SolrResourceLoader.<init> new SolrResourceLoader for directory: './org.apache.solr.handler.TestReplicationHandler$SolrInstance-1378972987415/slave/'
   [junit4]   2> 178822 T253 oasc.ConfigSolr.fromFile Loading container configuration from /mnt/ssd/jenkins/workspace/Lucene-Solr-trunk-Linux/solr/build/solr-core/test/J0/./org.apache.solr.handler.TestReplicationHandler$SolrInstance-1378972987415/slave/solr.xml
   [junit4]   2> 178854 T253 oasc.CoreContainer.<init> New CoreContainer 29196265
   [junit4]   2> 178854 T253 oasc.CoreContainer.load Loading cores into CoreContainer [instanceDir=./org.apache.solr.handler.TestReplicationHandler$SolrInstance-1378972987415/slave/]
   [junit4]   2> 178855 T253 oashc.HttpShardHandlerFactory.getParameter Setting socketTimeout to: 120000
   [junit4]   2> 178856 T253 oashc.HttpShardHandlerFactory.getParameter Setting urlScheme to: http://
   [junit4]   2> 178856 T253 oashc.HttpShardHandlerFactory.getParameter Setting connTimeout to: 15000
   [junit4]   2> 178856 T253 oashc.HttpShardHandlerFactory.getParameter Setting maxConnectionsPerHost to: 20
   [junit4]   2> 178856 T253 oashc.HttpShardHandlerFactory.getParameter Setting corePoolSize to: 0
   [junit4]   2> 178857 T253 oashc.HttpShardHandlerFactory.getParameter Setting maximumPoolSize to: 2147483647
   [junit4]   2> 178857 T253 oashc.HttpShardHandlerFactory.getParameter Setting maxThreadIdleTime to: 5
   [junit4]   2> 178857 T253 oashc.HttpShardHandlerFactory.getParameter Setting sizeOfQueue to: -1
   [junit4]   2> 178858 T253 oashc.HttpShardHandlerFactory.getParameter Setting fairnessPolicy to: false
   [junit4]   2> 178858 T253 oascsi.HttpClientUtil.createClient Creating new http client, config:maxConnectionsPerHost=20&maxConnections=10000&socketTimeout=120000&connTimeout=15000&retry=false
   [junit4]   2> 178861 T253 oasl.LogWatcher.createWatcher SLF4J impl is org.slf4j.impl.Log4jLoggerFactory
   [junit4]   2> 178861 T253 oasl.LogWatcher.newRegisteredLogWatcher Registering Log Listener [Log4j (org.slf4j.impl.Log4jLoggerFactory)]
   [junit4]   2> 178865 T340 oasc.CoreContainer.create Creating SolrCore 'collection1' using instanceDir: ./org.apache.solr.handler.TestReplicationHandler$SolrInstance-1378972987415/slave/collection1
   [junit4]   2> 178865 T340 oasc.SolrResourceLoader.<init> new SolrResourceLoader for directory: './org.apache.solr.handler.TestReplicationHandler$SolrInstance-1378972987415/slave/collection1/'
   [junit4]   2> 178897 T340 oasc.SolrConfig.<init> Using Lucene MatchVersion: LUCENE_50
   [junit4]   2> 178927 T340 oasc.SolrConfig.<init> Loaded SolrConfig: solrconfig.xml
   [junit4]   2> 178928 T340 oass.IndexSchema.readSchema Reading Solr Schema from schema.xml
   [junit4]   2> 178932 T340 oass.IndexSchema.readSchema [null] Schema name=test
   [junit4]   2> 178942 T340 oass.IndexSchema.readSchema unique key field: id
   [junit4]   2> 178943 T340 oasc.SolrCore.initDirectoryFactory org.apache.solr.core.MockDirectoryFactory
   [junit4]   2> 178943 T340 oasc.SolrCore.<init> [collection1] Opening new SolrCore at ./org.apache.solr.handler.TestReplicationHandler$SolrInstance-1378972987415/slave/collection1/, dataDir=/mnt/ssd/jenkins/workspace/Lucene-Solr-trunk-Linux/solr/build/solr-core/test/J0/./org.apache.solr.handler.TestReplicationHandler$SolrInstance-1378972987415/slave/collection1/data/
   [junit4]   2> 178943 T340 oasc.SolrCore.<init> JMX monitoring not detected for core: collection1
   [junit4]   2> 178944 T340 oasc.CachingDirectoryFactory.get return new directory for /mnt/ssd/jenkins/workspace/Lucene-Solr-trunk-Linux/solr/build/solr-core/test/J0/./org.apache.solr.handler.TestReplicationHandler$SolrInstance-1378972987415/slave/collection1/data
   [junit4]   2> 178944 T340 oasc.SolrCore.getNewIndexDir New index directory detected: old=null new=/mnt/ssd/jenkins/workspace/Lucene-Solr-trunk-Linux/solr/build/solr-core/test/J0/./org.apache.solr.handler.TestReplicationHandler$SolrInstance-1378972987415/slave/collection1/data/index/
   [junit4]   2> 178944 T340 oasc.SolrCore.initIndex WARN [collection1] Solr index directory '/mnt/ssd/jenkins/workspace/Lucene-Solr-trunk-Linux/solr/build/solr-core/test/J0/./org.apache.solr.handler.TestReplicationHandler$SolrInstance-1378972987415/slave/collection1/data/index' doesn't exist. Creating new index...
   [junit4]   2> 178944 T340 oasc.CachingDirectoryFactory.get return new directory for /mnt/ssd/jenkins/workspace/Lucene-Solr-trunk-Linux/solr/build/solr-core/test/J0/./org.apache.solr.handler.TestReplicationHandler$SolrInstance-1378972987415/slave/collection1/data/index
   [junit4]   2> 178945 T340 oasu.RandomMergePolicy.<init> RandomMergePolicy wrapping class org.apache.lucene.index.TieredMergePolicy: [TieredMergePolicy: maxMergeAtOnce=24, maxMergeAtOnceExplicit=23, maxMergedSegmentMB=81.568359375, floorSegmentMB=1.5263671875, forceMergeDeletesPctAllowed=12.023213796923233, segmentsPerTier=17.0, maxCFSSegmentSizeMB=8.796093022207999E12, noCFSRatio=0.6513293739995961
   [junit4]   2> 178945 T340 oasc.SolrDeletionPolicy.onCommit SolrDeletionPolicy.onCommit: commits: num=1
   [junit4]   2> 		commit{dir=MockDirWrapper(org.apache.lucene.store.RAMDirectory@f796ee lockFactory=org.apache.lucene.store.SingleInstanceLockFactory@51d76f),segFN=segments_1,generation=1}
   [junit4]   2> 178946 T340 oasc.SolrDeletionPolicy.updateCommits newest commit generation = 1
   [junit4]   2> 178946 T340 oasc.SolrCore.loadUpdateProcessorChains no updateRequestProcessorChain defined as default, creating implicit default
   [junit4]   2> 178947 T340 oasc.RequestHandlers.initHandlersFromConfig created standard: solr.StandardRequestHandler
   [junit4]   2> 178947 T340 oasc.RequestHandlers.initHandlersFromConfig created defaults: solr.StandardRequestHandler
   [junit4]   2> 178947 T340 oasc.RequestHandlers.initHandlersFromConfig adding lazy requestHandler: solr.StandardRequestHandler
   [junit4]   2> 178947 T340 oasc.RequestHandlers.initHandlersFromConfig created lazy: solr.StandardRequestHandler
   [junit4]   2> 178947 T340 oasc.RequestHandlers.initHandlersFromConfig created /update: solr.UpdateRequestHandler
   [junit4]   2> 178948 T340 oasc.RequestHandlers.initHandlersFromConfig created /replication: solr.ReplicationHandler
   [junit4]   2> 178949 T340 oashl.XMLLoader.init xsltCacheLifetimeSeconds=60
   [junit4]   2> 178951 T340 oasu.CommitTracker.<init> Hard AutoCommit: disabled
   [junit4]   2> 178951 T340 oasu.CommitTracker.<init> Soft AutoCommit: disabled
   [junit4]   2> 178951 T340 oasu.RandomMergePolicy.<init> RandomMergePolicy wrapping class org.apache.lucene.index.LogByteSizeMergePolicy: [LogByteSizeMergePolicy: minMergeSize=1677721, mergeFactor=49, maxMergeSize=2147483648, maxMergeSizeForForcedMerge=9223372036854775807, calibrateSizeByDeletes=false, maxMergeDocs=2147483647, maxCFSSegmentSizeMB=8.796093022207999E12, noCFSRatio=0.0]
   [junit4]   2> 178952 T340 oasc.SolrDeletionPolicy.onInit SolrDeletionPolicy.onInit: commits: num=1
   [junit4]   2> 		commit{dir=MockDirWrapper(org.apache.lucene.store.RAMDirectory@f796ee lockFactory=org.apache.lucene.store.SingleInstanceLockFactory@51d76f),segFN=segments_1,generation=1}
   [junit4]   2> 178952 T340 oasc.SolrDeletionPolicy.updateCommits newest commit generation = 1
   [junit4]   2> 178952 T340 oass.SolrIndexSearcher.<init> Opening Searcher@169b472 main
   [junit4]   2> 178953 T340 oash.SnapPuller.startExecutorService Poll Scheduled at an interval of 1000ms
   [junit4]   2> 178953 T340 oasc.CoreContainer.registerCore registering core: collection1
   [junit4]   2> 178953 T341 oasc.SolrCore.registerSearcher [collection1] Registered new searcher Searcher@169b472 main{StandardDirectoryReader(segments_1:1:nrt)}
   [junit4]   2> 178954 T253 oass.SolrDispatchFilter.init user.dir=/mnt/ssd/jenkins/workspace/Lucene-Solr-trunk-Linux/solr/build/solr-core/test/J0
   [junit4]   2> 178954 T253 oass.SolrDispatchFilter.init SolrDispatchFilter.init() done
   [junit4]   2> 178955 T253 oascsi.HttpClientUtil.createClient Creating new http client, config:maxConnections=128&maxConnectionsPerHost=32&followRedirects=false
   [junit4]   2> ASYNC  NEW_CORE C116 name=collection1 org.apache.solr.core.SolrCore@15ac932
   [junit4]   2> 178964 T324 C116 oasc.SolrCore.execute [collection1] webapp=/solr path=/select params={sort=id+desc&q=*:*&wt=javabin&version=2} hits=0 status=0 QTime=0 
   [junit4]   2> 178968 T325 C116 oasup.LogUpdateProcessor.finish [collection1] webapp=/solr path=/update params={wt=javabin&version=2} {add=[0]} 0 1
   [junit4]   2> 178971 T326 C116 oasup.LogUpdateProcessor.finish [collection1] webapp=/solr path=/update params={wt=javabin&version=2} {add=[1]} 0 1
   [junit4]   2> 178973 T327 C116 oasup.LogUpdateProcessor.finish [collection1] webapp=/solr path=/update params={wt=javabin&version=2} {add=[2]} 0 0
   [junit4]   2> 178975 T324 C116 oasup.LogUpdateProcessor.finish [collection1] webapp=/solr path=/update params={wt=javabin&version=2} {add=[3]} 0 0
   [junit4]   2> 178978 T325 C116 oasup.LogUpdateProcessor.finish [collection1] webapp=/solr path=/update params={wt=javabin&version=2} {add=[4]} 0 1
   [junit4]   2> 178980 T326 C116 oasup.LogUpdateProcessor.finish [collection1] webapp=/solr path=/update params={wt=javabin&version=2} {add=[5]} 0 0
   [junit4]   2> 178982 T327 C116 oasup.LogUpdateProcessor.finish [collection1] webapp=/solr path=/update params={wt=javabin&version=2} {add=[6]} 0 0
   [junit4]   2> 178985 T324 C116 oasup.LogUpdateProcessor.finish [collection1] webapp=/solr path=/update params={wt=javabin&version=2} {add=[7]} 0 1
   [junit4]   2> 178987 T325 C116 oasup.LogUpdateProcessor.finish [collection1] webapp=/solr path=/update params={wt=javabin&version=2} {add=[8]} 0 0
   [junit4]   2> 178989 T326 C116 oasup.LogUpdateProcessor.finish [collection1] webapp=/solr path=/update params={wt=javabin&version=2} {add=[9]} 0 0
   [junit4]   2> 178991 T327 C116 oasup.LogUpdateProcessor.finish [collection1] webapp=/solr path=/update params={wt=javabin&version=2} {add=[10]} 0 0
   [junit4]   2> 178994 T324 C116 oasup.LogUpdateProcessor.finish [collection1] webapp=/solr path=/update params={wt=javabin&version=2} {add=[11]} 0 1
   [junit4]   2> 178996 T325 C116 oasup.LogUpdateProcessor.finish [collection1] webapp=/solr path=/update params={wt=javabin&version=2} {add=[12]} 0 0
   [junit4]   2> 178998 T326 C116 oasup.LogUpdateProcessor.finish [collection1] webapp=/solr path=/update params={wt=javabin&version=2} {add=[13]} 0 0
   [junit4]   2> 179000 T327 C116 oasup.LogUpdateProcessor.finish [collection1] webapp=/solr path=/update params={wt=javabin&version=2} {add=[14]} 0 0
   [junit4]   2> 179003 T324 C116 oasup.LogUpdateProcessor.finish [collection1] webapp=/solr path=/update params={wt=javabin&version=2} {add=[15]} 0 1
   [junit4]   2> 179005 T325 C116 oasup.LogUpdateProcessor.finish [collection1] webapp=/solr path=/update params={wt=javabin&version=2} {add=[16]} 0 0
   [junit4]   2> 179007 T326 C116 oasup.LogUpdateProcessor.finish [collection1] webapp=/solr path=/update params={wt=javabin&version=2} {add=[17]} 0 0
   [junit4]   2> 179009 T327 C116 oasup.LogUpdateProcessor.finish [collection1] webapp=/solr path=/update params={wt=javabin&version=2} {add=[18]} 0 0
   [junit4]   2> 179012 T324 C116 oasup.LogUpdateProcessor.finish [collection1] webapp=/solr path=/update params={wt=javabin&version=2} {add=[19]} 0 1
   [junit4]   2> 179014 T325 C116 oasup.LogUpdateProcessor.finish [collection1] webapp=/solr path=/update params={wt=javabin&version=2} {add=[20]} 0 0
   [junit4]   2> 179016 T326 C116 oasup.LogUpdateProcessor.finish [collection1] webapp=/solr path=/update params={wt=javabin&version=2} {add=[21]} 0 0
   [junit4]   2> 179018 T327 C116 oasup.LogUpdateProcessor.finish [collection1] webapp=/solr path=/update params={wt=javabin&version=2} {add=[22]} 0 0
   [junit4]   2> 179020 T324 C116 oasup.LogUpdateProcessor.finish [collection1] webapp=/solr path=/update params={wt=javabin&version=2} {add=[23]} 0 0
   [junit4]   2> 179023 T325 C116 oasup.LogUpdateProcessor.finish [collection1] webapp=/solr path=/update params={wt=javabin&version=2} {add=[24]} 0 1
   [junit4]   2> 179025 T326 C116 oasup.LogUpdateProcessor.finish [collection1] webapp=/solr path=/update params={wt=javabin&version=2} {add=[25]} 0 0
   [junit4]   2> 179027 T327 C116 oasup.LogUpdateProcessor.finish [collection1] webapp=/solr path=/update params={wt=javabin&version=2} {add=[26]} 0 0
   [junit4]   2> 179029 T324 C116 oasup.LogUpdateProcessor.finish [collection1] webapp=/solr path=/update params={wt=javabin&version=2} {add=[27]} 0 0
   [junit4]   2> 179032 T325 C116 oasup.LogUpdateProcessor.finish [collection1] webapp=/solr path=/update params={wt=javabin&version=2} {add=[28]} 0 1
   [junit4]   2> 179034 T326 C116 oasup.LogUpdateProcessor.finish [collection1] webapp=/solr path=/update params={wt=javabin&version=2} {add=[29]} 0 0
   [junit4]   2> 179036 T327 C116 oasup.LogUpdateProcessor.finish [collection1] webapp=/solr path=/update params={wt=javabin&version=2} {add=[30]} 0 0
   [junit4]   2> 179038 T324 C116 oasup.LogUpdateProcessor.finish [collection1] webapp=/solr path=/update params={wt=javabin&version=2} {add=[31]} 0 0
   [junit4]   2> 179040 T325 C116 oasup.LogUpdateProcessor.finish [collection1] webapp=/solr path=/update params={wt=javabin&version=2} {add=[32]} 0 0
   [junit4]   2> 179043 T326 C116 oasup.LogUpdateProcessor.finish [collection1] webapp=/solr path=/update params={wt=javabin&version=2} {add=[33]} 0 1
   [junit4]   2> 179045 T327 C116 oasup.LogUpdateProcessor.finish [collection1] webapp=/solr path=/update params={wt=javabin&version=2} {add=[34]} 0 0
   [junit4]   2> 179047 T324 C116 oasup.LogUpdateProcessor.finish [collection1] webapp=/solr path=/update params={wt=javabin&version=2} {add=[35]} 0 0
   [junit4]   2> 179049 T325 C116 oasup.LogUpdateProcessor.finish [collection1] webapp=/solr path=/update params={wt=javabin&version=2} {add=[36]} 0 0
   [junit4]   2> 179052 T327 C116 oasup.LogUpdateProcessor.finish [collection1] webapp=/solr path=/update params={wt=javabin&version=2} {add=[37]} 0 1
   [junit4]   2> 179054 T324 C116 oasup.LogUpdateProcessor.finish [collection1] webapp=/solr path=/update params={wt=javabin&version=2} {add=[38]} 0 0
   [junit4]   2> 179056 T325 C116 oasup.LogUpdateProcessor.finish [collection1] webapp=/solr path=/update params={wt=javabin&version=2} {add=[39]} 0 0
   [junit4]   2> 179059 T326 C116 oasup.LogUpdateProcessor.finish [collection1] webapp=/solr path=/update params={wt=javabin&version=2} {add=[40]} 0 1
   [junit4]   2> 179061 T327 C116 oasup.LogUpdateProcessor.finish [collection1] webapp=/solr path=/update params={wt=javabin&version=2} {add=[41]} 0 0
   [junit4]   2> 179063 T324 C116 oasup.LogUpdateProcessor.finish [collection1] webapp=/solr path=/update params={wt=javabin&version=2} {add=[42]} 0 0
   [junit4]   2> 179066 T325 C116 oasup.LogUpdateProcessor.finish [collection1] webapp=/solr path=/update params={wt=javabin&version=2} {add=[43]} 0 1
   [junit4]   2> 179068 T326 C116 oasup.LogUpdateProcessor.finish [collection1] webapp=/solr path=/update params={wt=javabin&version=2} {add=[44]} 0 0
   [junit4]   2> 179070 T327 C116 oasup.LogUpdateProcessor.finish [collection1] webapp=/solr path=/update params={wt=javabin&version=2} {add=[45]} 0 0
   [junit4]   2> 179072 T324 C116 oasup.LogUpdateProcessor.finish [collection1] webapp=/solr path=/update params={wt=javabin&version=2} {add=[46]} 0 0
   [junit4]   2> 179075 T325 C116 oasup.LogUpdateProcessor.finish [collection1] webapp=/solr path=/update params={wt=javabin&version=2} {add=[47]} 0 0
   [junit4]   2> 179077 T326 C116 oasup.LogUpdateProcessor.finish [collection1] webapp=/solr path=/update params={wt=javabin&version=2} {add=[48]} 0 0
   [junit4]   2> 179079 T327 C116 oasup.LogUpdateProcessor.finish [collection1] webapp=/solr path=/update params={wt=javabin&version=2} {add=[49]} 0 0
   [junit4]   2> 179082 T324 C116 oasup.LogUpdateProcessor.finish [collection1] webapp=/solr path=/update params={wt=javabin&version=2} {add=[50]} 0 1
   [junit4]   2> 179084 T325 C116 oasup.LogUpdateProcessor.finish [collection1] webapp=/solr path=/update params={wt=javabin&version=2} {add=[51]} 0 0
   [junit4]   2> 179086 T326 C116 oasup.LogUpdateProcessor.finish [collection1] webapp=/solr path=/update params={wt=javabin&version=2} {add=[52]} 0 0
   [junit4]   2> 179089 T327 C116 oasup.LogUpdateProcessor.finish [collection1] webapp=/solr path=/update params={wt=javabin&version=2} {add=[53]} 0 1
   [junit4]   2> 179091 T324 C116 oasup.LogUpdateProcessor.finish [collection1] webapp=/solr path=/update params={wt=javabin&version=2} {add=[54]} 0 0
   [junit4]   2> 179093 T325 C116 oasup.LogUpdateProcessor.finish [collection1] webapp=/solr path=/update params={wt=javabin&version=2} {add=[55]} 0 0
   [junit4]   2> 179095 T326 C116 oasup.LogUpdateProcessor.finish [collection1] webapp=/solr path=/update params={wt=javabin&version=2} {add=[56]} 0 0
   [junit4]   2> 179098 T327 C116 oasup.LogUpdateProcessor.finish [collection1] webapp=/solr path=/update params={wt=javabin&version=2} {add=[57]} 0 1
   [junit4]   2> 179100 T324 C116 oasup.LogUpdateProcessor.finish [collection1] webapp=/solr path=/update params={wt=javabin&version=2} {add=[58]} 0 0
   [junit4]   2> 179102 T325 C116 oasup.LogUpdateProcessor.finish [collection1] webapp=/solr path=/update params={wt=javabin&version=2} {add=[59]} 0 0
   [junit4]   2> 179104 T326 C116 oasup.LogUpdateProcessor.finish [collection1] webapp=/solr path=/update params={wt=javabin&version=2} {add=[60]} 0 0
   [junit4]   2> 179106 T327 C116 oasup.

[...truncated too long message...]

} status=0 QTime=0 
   [junit4]   2> 245067 T904 C166 oasc.SolrCore.execute [collection1] webapp=/solr path=/replication params={command=details&_trace=getDetails&wt=javabin&qt=/replication&version=2} status=0 QTime=3 
   [junit4]   2> 245072 T927 C167 oasc.SolrCore.execute [collection1] webapp=/solr path=/replication params={slave=false&command=details&wt=javabin&qt=/replication&version=2} status=0 QTime=1 
   [junit4]   2> 245073 T903 C166 oasc.SolrCore.execute [collection1] webapp=/solr path=/replication params={command=details&_trace=getDetails&wt=javabin&qt=/replication&version=2} status=0 QTime=4 
   [junit4]   2> 245077 T902 C166 oasc.SolrCore.execute [collection1] webapp=/solr path=/replication params={slave=false&command=details&wt=javabin&qt=/replication&version=2} status=0 QTime=0 
   [junit4]   2> 245078 T928 C167 oasc.SolrCore.execute [collection1] webapp=/solr path=/replication params={command=details&_trace=getDetails&wt=javabin&qt=/replication&version=2} status=0 QTime=3 
   [junit4]   2> 245083 T901 C166 oasc.SolrCore.execute [collection1] webapp=/solr path=/replication params={command=indexversion&_trace=assertVersions&wt=javabin&qt=/replication&version=2} status=0 QTime=1 
   [junit4]   2> 245086 T929 C167 oasc.SolrCore.execute [collection1] webapp=/solr path=/replication params={command=indexversion&_trace=assertVersions&wt=javabin&qt=/replication&version=2} status=0 QTime=1 
   [junit4]   2> 245097 T926 C167 oasc.SolrCore.execute [collection1] webapp=/solr path=/replication params={slave=false&command=details&wt=javabin&qt=/replication&version=2} status=0 QTime=1 
   [junit4]   2> 245097 T904 C166 oasc.SolrCore.execute [collection1] webapp=/solr path=/replication params={command=details&_trace=getDetails&wt=javabin&qt=/replication&version=2} status=0 QTime=6 
   [junit4]   2> 245102 T903 C166 oasc.SolrCore.execute [collection1] webapp=/solr path=/replication params={slave=false&command=details&wt=javabin&qt=/replication&version=2} status=0 QTime=1 
   [junit4]   2> 245103 T927 C167 oasc.SolrCore.execute [collection1] webapp=/solr path=/replication params={command=details&_trace=getDetails&wt=javabin&qt=/replication&version=2} status=0 QTime=4 
   [junit4]   2> 245103 T253 oas.SolrTestCaseJ4.tearDown ###Ending doTestSnapPullWithMasterUrl
   [junit4]   2> 245124 T253 oasc.CoreContainer.shutdown Shutting down CoreContainer instance=5793765
   [junit4]   2> 245125 T253 oasc.SolrCore.close [collection1]  CLOSING SolrCore org.apache.solr.core.SolrCore@1d43ef6
   [junit4]   2> 245125 T253 oasu.DirectUpdateHandler2.close closing DirectUpdateHandler2{commits=2,autocommits=0,soft autocommits=0,optimizes=0,rollbacks=0,expungeDeletes=0,docsPending=0,adds=0,deletesById=0,deletesByQuery=0,errors=0,cumulative_adds=496,cumulative_deletesById=0,cumulative_deletesByQuery=1,cumulative_errors=0}
   [junit4]   2> 245126 T253 oasu.SolrCoreState.decrefSolrCoreState Closing SolrCoreState
   [junit4]   2> 245126 T253 oasu.DefaultSolrCoreState.closeIndexWriter SolrCoreState ref count has reached 0 - closing IndexWriter
   [junit4]   2> 245127 T253 oasu.DefaultSolrCoreState.closeIndexWriter closing IndexWriter with IndexWriterCloser
   [junit4]   2> 245127 T253 oasc.SolrCore.closeSearcher [collection1] Closing main searcher on request.
   [junit4]   2> 245128 T253 oasc.CachingDirectoryFactory.close Closing MockDirectoryFactory - 2 directories currently being tracked
   [junit4]   2> 245129 T253 oasc.CachingDirectoryFactory.closeCacheValue looking to close /mnt/ssd/jenkins/workspace/Lucene-Solr-trunk-Linux/solr/build/solr-core/test/J0/./org.apache.solr.handler.TestReplicationHandler$SolrInstance-1378973051262/master/collection1/data/index.20130912090413537 [CachedDir<<refCount=0;path=/mnt/ssd/jenkins/workspace/Lucene-Solr-trunk-Linux/solr/build/solr-core/test/J0/./org.apache.solr.handler.TestReplicationHandler$SolrInstance-1378973051262/master/collection1/data/index.20130912090413537;done=false>>]
   [junit4]   2> 245129 T253 oasc.CachingDirectoryFactory.close Closing directory: /mnt/ssd/jenkins/workspace/Lucene-Solr-trunk-Linux/solr/build/solr-core/test/J0/./org.apache.solr.handler.TestReplicationHandler$SolrInstance-1378973051262/master/collection1/data/index.20130912090413537
   [junit4]   2> 245130 T253 oasc.CachingDirectoryFactory.closeCacheValue looking to close /mnt/ssd/jenkins/workspace/Lucene-Solr-trunk-Linux/solr/build/solr-core/test/J0/./org.apache.solr.handler.TestReplicationHandler$SolrInstance-1378973051262/master/collection1/data [CachedDir<<refCount=0;path=/mnt/ssd/jenkins/workspace/Lucene-Solr-trunk-Linux/solr/build/solr-core/test/J0/./org.apache.solr.handler.TestReplicationHandler$SolrInstance-1378973051262/master/collection1/data;done=false>>]
   [junit4]   2> 245130 T253 oasc.CachingDirectoryFactory.close Closing directory: /mnt/ssd/jenkins/workspace/Lucene-Solr-trunk-Linux/solr/build/solr-core/test/J0/./org.apache.solr.handler.TestReplicationHandler$SolrInstance-1378973051262/master/collection1/data
   [junit4]   2> 245130 T253 oejsh.ContextHandler.doStop stopped o.e.j.s.ServletContextHandler{/solr,null}
   [junit4]   2> 245204 T253 oasc.CoreContainer.shutdown Shutting down CoreContainer instance=31910224
   [junit4]   2> 245205 T253 oasc.SolrCore.close [collection1]  CLOSING SolrCore org.apache.solr.core.SolrCore@441b9f
   [junit4]   2> 245205 T253 oasu.DirectUpdateHandler2.close closing DirectUpdateHandler2{commits=2,autocommits=0,soft autocommits=0,optimizes=0,rollbacks=0,expungeDeletes=0,docsPending=0,adds=0,deletesById=0,deletesByQuery=0,errors=0,cumulative_adds=3,cumulative_deletesById=0,cumulative_deletesByQuery=1,cumulative_errors=0}
   [junit4]   2> 245206 T253 oasu.SolrCoreState.decrefSolrCoreState Closing SolrCoreState
   [junit4]   2> 245206 T253 oasu.DefaultSolrCoreState.closeIndexWriter SolrCoreState ref count has reached 0 - closing IndexWriter
   [junit4]   2> 245207 T253 oasu.DefaultSolrCoreState.closeIndexWriter closing IndexWriter with IndexWriterCloser
   [junit4]   2> 245207 T253 oasc.SolrCore.closeSearcher [collection1] Closing main searcher on request.
   [junit4]   2> 245208 T253 oasc.CachingDirectoryFactory.close Closing MockDirectoryFactory - 2 directories currently being tracked
   [junit4]   2> 245208 T253 oasc.CachingDirectoryFactory.closeCacheValue looking to close /mnt/ssd/jenkins/workspace/Lucene-Solr-trunk-Linux/solr/build/solr-core/test/J0/./org.apache.solr.handler.TestReplicationHandler$SolrInstance-1378973051436/slave/collection1/data/index.20130912090413245 [CachedDir<<refCount=0;path=/mnt/ssd/jenkins/workspace/Lucene-Solr-trunk-Linux/solr/build/solr-core/test/J0/./org.apache.solr.handler.TestReplicationHandler$SolrInstance-1378973051436/slave/collection1/data/index.20130912090413245;done=false>>]
   [junit4]   2> 245208 T253 oasc.CachingDirectoryFactory.close Closing directory: /mnt/ssd/jenkins/workspace/Lucene-Solr-trunk-Linux/solr/build/solr-core/test/J0/./org.apache.solr.handler.TestReplicationHandler$SolrInstance-1378973051436/slave/collection1/data/index.20130912090413245
   [junit4]   2> 245209 T253 oasc.CachingDirectoryFactory.closeCacheValue looking to close /mnt/ssd/jenkins/workspace/Lucene-Solr-trunk-Linux/solr/build/solr-core/test/J0/./org.apache.solr.handler.TestReplicationHandler$SolrInstance-1378973051436/slave/collection1/data [CachedDir<<refCount=0;path=/mnt/ssd/jenkins/workspace/Lucene-Solr-trunk-Linux/solr/build/solr-core/test/J0/./org.apache.solr.handler.TestReplicationHandler$SolrInstance-1378973051436/slave/collection1/data;done=false>>]
   [junit4]   2> 245209 T253 oasc.CachingDirectoryFactory.close Closing directory: /mnt/ssd/jenkins/workspace/Lucene-Solr-trunk-Linux/solr/build/solr-core/test/J0/./org.apache.solr.handler.TestReplicationHandler$SolrInstance-1378973051436/slave/collection1/data
   [junit4]   2> 245210 T253 oejsh.ContextHandler.doStop stopped o.e.j.s.ServletContextHandler{/solr,null}
   [junit4]   2> 245268 T253 oas.SolrTestCaseJ4.deleteCore ###deleteCore
   [junit4]   2> NOTE: test params are: codec=Lucene45: {newname=PostingsFormat(name=Asserting), id=PostingsFormat(name=Asserting), name=PostingsFormat(name=Asserting)}, docValues:{}, sim=DefaultSimilarity, locale=be_BY, timezone=Africa/Casablanca
   [junit4]   2> NOTE: Linux 3.2.0-53-generic i386/Oracle Corporation 1.7.0_40 (32-bit)/cpus=8,threads=1,free=143453368,total=206045184
   [junit4]   2> NOTE: All tests run in this JVM: [SystemInfoHandlerTest, ShowFileRequestHandlerTest, TestSystemIdResolver, CSVRequestHandlerTest, HdfsRecoveryZkTest, ShardSplitTest, ResourceLoaderTest, TestMergePolicyConfig, QueryElevationComponentTest, TestLMDirichletSimilarityFactory, TestReplicationHandler]
   [junit4] Completed on J0 in 67.85s, 14 tests, 1 failure <<< FAILURES!

[...truncated 823 lines...]
BUILD FAILED
/mnt/ssd/jenkins/workspace/Lucene-Solr-trunk-Linux/build.xml:396: The following error occurred while executing this line:
/mnt/ssd/jenkins/workspace/Lucene-Solr-trunk-Linux/build.xml:376: The following error occurred while executing this line:
/mnt/ssd/jenkins/workspace/Lucene-Solr-trunk-Linux/build.xml:39: The following error occurred while executing this line:
/mnt/ssd/jenkins/workspace/Lucene-Solr-trunk-Linux/solr/build.xml:189: The following error occurred while executing this line:
/mnt/ssd/jenkins/workspace/Lucene-Solr-trunk-Linux/solr/common-build.xml:455: The following error occurred while executing this line:
/mnt/ssd/jenkins/workspace/Lucene-Solr-trunk-Linux/lucene/common-build.xml:1230: The following error occurred while executing this line:
/mnt/ssd/jenkins/workspace/Lucene-Solr-trunk-Linux/lucene/common-build.xml:873: There were test failures: 325 suites, 1446 tests, 1 failure, 34 ignored (6 assumptions)

Total time: 39 minutes 8 seconds
Build step 'Invoke Ant' marked build as failure
Description set: Java: 32bit/jdk1.7.0_40 -server -XX:+UseParallelGC
Archiving artifacts
Recording test results
Email was triggered for: Failure
Sending email for trigger: Failure



Re: [JENKINS] Lucene-Solr-trunk-Linux (64bit/jdk1.7.0_40) - Build # 7427 - Still Failing!

Posted by Michael McCandless <lu...@mikemccandless.com>.
It looks like this is the new JVM bug:
https://issues.apache.org/jira/browse/LUCENE-5212

We don't know much about it yet ... except the JVM bug was not present
in 1.7.0_25 and is present in 1.7.0_40.

Mike McCandless

http://blog.mikemccandless.com


On Fri, Sep 13, 2013 at 12:08 PM, Robert Muir <rc...@gmail.com> wrote:
> Maybe it will reproduce with the master seed.
>
>
> On Fri, Sep 13, 2013 at 7:14 AM, Michael McCandless
> <lu...@mikemccandless.com> wrote:
>> This doesn't repro on current trunk ...
>>
>> Mike McCandless
>>
>> http://blog.mikemccandless.com
>>
>>
>> On Thu, Sep 12, 2013 at 5:26 AM, Policeman Jenkins Server
>> <je...@thetaphi.de> wrote:
>>> Build: http://jenkins.thetaphi.de/job/Lucene-Solr-trunk-Linux/7427/
>>> Java: 64bit/jdk1.7.0_40 -XX:-UseCompressedOops -XX:+UseG1GC
>>>
>>> 1 tests failed.
>>> REGRESSION:  org.apache.lucene.classification.KNearestNeighborClassifierTest.testPerformance
>>>
>>> Error Message:
>>> CheckIndex failed
>>>
>>> Stack Trace:
>>> java.lang.RuntimeException: CheckIndex failed
>>>         at __randomizedtesting.SeedInfo.seed([68F81CB00E47182B:AF19EE9265F32084]:0)
>>>         at org.apache.lucene.util._TestUtil.checkIndex(_TestUtil.java:227)
>>>         at org.apache.lucene.store.MockDirectoryWrapper.close(MockDirectoryWrapper.java:659)
>>>         at org.apache.lucene.classification.ClassificationTestBase.tearDown(ClassificationTestBase.java:70)
>>>         at sun.reflect.NativeMethodAccessorImpl.invoke0(Native Method)
>>>         at sun.reflect.NativeMethodAccessorImpl.invoke(NativeMethodAccessorImpl.java:57)
>>>         at sun.reflect.DelegatingMethodAccessorImpl.invoke(DelegatingMethodAccessorImpl.java:43)
>>>         at java.lang.reflect.Method.invoke(Method.java:606)
>>>         at com.carrotsearch.randomizedtesting.RandomizedRunner.invoke(RandomizedRunner.java:1559)
>>>         at com.carrotsearch.randomizedtesting.RandomizedRunner.access$600(RandomizedRunner.java:79)
>>>         at com.carrotsearch.randomizedtesting.RandomizedRunner$8.evaluate(RandomizedRunner.java:795)
>>>         at org.apache.lucene.util.TestRuleSetupTeardownChained$1.evaluate(TestRuleSetupTeardownChained.java:50)
>>>         at org.apache.lucene.util.TestRuleFieldCacheSanity$1.evaluate(TestRuleFieldCacheSanity.java:51)
>>>         at org.apache.lucene.util.AbstractBeforeAfterRule$1.evaluate(AbstractBeforeAfterRule.java:46)
>>>         at com.carrotsearch.randomizedtesting.rules.SystemPropertiesInvariantRule$1.evaluate(SystemPropertiesInvariantRule.java:55)
>>>         at org.apache.lucene.util.TestRuleThreadAndTestName$1.evaluate(TestRuleThreadAndTestName.java:49)
>>>         at org.apache.lucene.util.TestRuleIgnoreAfterMaxFailures$1.evaluate(TestRuleIgnoreAfterMaxFailures.java:70)
>>>         at org.apache.lucene.util.TestRuleMarkFailure$1.evaluate(TestRuleMarkFailure.java:48)
>>>         at com.carrotsearch.randomizedtesting.rules.StatementAdapter.evaluate(StatementAdapter.java:36)
>>>         at com.carrotsearch.randomizedtesting.ThreadLeakControl$StatementRunner.run(ThreadLeakControl.java:358)
>>>         at com.carrotsearch.randomizedtesting.ThreadLeakControl.forkTimeoutingTask(ThreadLeakControl.java:782)
>>>         at com.carrotsearch.randomizedtesting.ThreadLeakControl$3.evaluate(ThreadLeakControl.java:442)
>>>         at com.carrotsearch.randomizedtesting.RandomizedRunner.runSingleTest(RandomizedRunner.java:746)
>>>         at com.carrotsearch.randomizedtesting.RandomizedRunner$3.evaluate(RandomizedRunner.java:648)
>>>         at com.carrotsearch.randomizedtesting.RandomizedRunner$4.evaluate(RandomizedRunner.java:682)
>>>         at com.carrotsearch.randomizedtesting.RandomizedRunner$5.evaluate(RandomizedRunner.java:693)
>>>         at org.apache.lucene.util.AbstractBeforeAfterRule$1.evaluate(AbstractBeforeAfterRule.java:46)
>>>         at org.apache.lucene.util.TestRuleStoreClassName$1.evaluate(TestRuleStoreClassName.java:42)
>>>         at com.carrotsearch.randomizedtesting.rules.SystemPropertiesInvariantRule$1.evaluate(SystemPropertiesInvariantRule.java:55)
>>>         at com.carrotsearch.randomizedtesting.rules.NoShadowingOrOverridesOnMethodsRule$1.evaluate(NoShadowingOrOverridesOnMethodsRule.java:39)
>>>         at com.carrotsearch.randomizedtesting.rules.NoShadowingOrOverridesOnMethodsRule$1.evaluate(NoShadowingOrOverridesOnMethodsRule.java:39)
>>>         at com.carrotsearch.randomizedtesting.rules.StatementAdapter.evaluate(StatementAdapter.java:36)
>>>         at org.apache.lucene.util.TestRuleAssertionsRequired$1.evaluate(TestRuleAssertionsRequired.java:43)
>>>         at org.apache.lucene.util.TestRuleMarkFailure$1.evaluate(TestRuleMarkFailure.java:48)
>>>         at org.apache.lucene.util.TestRuleIgnoreAfterMaxFailures$1.evaluate(TestRuleIgnoreAfterMaxFailures.java:70)
>>>         at org.apache.lucene.util.TestRuleIgnoreTestSuites$1.evaluate(TestRuleIgnoreTestSuites.java:55)
>>>         at com.carrotsearch.randomizedtesting.rules.StatementAdapter.evaluate(StatementAdapter.java:36)
>>>         at com.carrotsearch.randomizedtesting.ThreadLeakControl$StatementRunner.run(ThreadLeakControl.java:358)
>>>         at java.lang.Thread.run(Thread.java:724)
>>>
>>>
>>>
>>>
>>> Build Log:
>>> [...truncated 6618 lines...]
>>>    [junit4] Suite: org.apache.lucene.classification.KNearestNeighborClassifierTest
>>>    [junit4]   1> CheckIndex failed
>>>    [junit4]   1> Segments file=segments_3 numSegments=2 version=5.0 format=
>>>    [junit4]   1>   1 of 2: name=_0 docCount=898
>>>    [junit4]   1>     codec=FastDecompressionCompressingStoredFields(storedFieldsFormat=CompressingStoredFieldsFormat(compressionMode=FAST_DECOMPRESSION, chunkSize=16384), termVectorsFormat=CompressingTermVectorsFormat(compressionMode=FAST_DECOMPRESSION, chunkSize=16384))
>>>    [junit4]   1>     compound=true
>>>    [junit4]   1>     numFiles=3
>>>    [junit4]   1>     size (MB)=0.283
>>>    [junit4]   1>     diagnostics = {timestamp=1378977956101, os=Linux, os.version=3.2.0-53-generic, source=flush, lucene.version=5.0-SNAPSHOT, os.arch=amd64, java.version=1.7.0_40, java.vendor=Oracle Corporation}
>>>    [junit4]   1>     no deletions
>>>    [junit4]   1>     test: open reader.........OK
>>>    [junit4]   1>     test: fields..............OK [3 fields]
>>>    [junit4]   1>     test: field norms.........OK [3 fields]
>>>    [junit4]   1>     test: terms, freq, prox...OK [9449 terms; 16456 terms/docs pairs; 16648 tokens]
>>>    [junit4]   1>     test: stored fields.......OK [2694 total field count; avg 3 fields per doc]
>>>    [junit4]   1>     test: term vectors........ERROR [2]
>>>    [junit4]   1> java.lang.ArrayIndexOutOfBoundsException: 2
>>>    [junit4]   1>        at org.apache.lucene.codecs.compressing.CompressingTermVectorsReader.get(CompressingTermVectorsReader.java:393)
>>>    [junit4]   1>        at org.apache.lucene.index.SegmentReader.getTermVectors(SegmentReader.java:169)
>>>    [junit4]   1>        at org.apache.lucene.index.CheckIndex.testTermVectors(CheckIndex.java:1524)
>>>    [junit4]   1>        at org.apache.lucene.index.CheckIndex.checkIndex(CheckIndex.java:611)
>>>    [junit4]   1>        at org.apache.lucene.util._TestUtil.checkIndex(_TestUtil.java:223)
>>>    [junit4]   1>        at org.apache.lucene.store.MockDirectoryWrapper.close(MockDirectoryWrapper.java:659)
>>>    [junit4]   1>        at org.apache.lucene.classification.ClassificationTestBase.tearDown(ClassificationTestBase.java:70)
>>>    [junit4]   1>        at sun.reflect.NativeMethodAccessorImpl.invoke0(Native Method)
>>>    [junit4]   1>        at sun.reflect.NativeMethodAccessorImpl.invoke(NativeMethodAccessorImpl.java:57)
>>>    [junit4]   1>        at sun.reflect.DelegatingMethodAccessorImpl.invoke(DelegatingMethodAccessorImpl.java:43)
>>>    [junit4]   1>        at java.lang.reflect.Method.invoke(Method.java:606)
>>>    [junit4]   1>        at com.carrotsearch.randomizedtesting.RandomizedRunner.invoke(RandomizedRunner.java:1559)
>>>    [junit4]   1>        at com.carrotsearch.randomizedtesting.RandomizedRunner.access$600(RandomizedRunner.java:79)
>>>    [junit4]   1>        at com.carrotsearch.randomizedtesting.RandomizedRunner$8.evaluate(RandomizedRunner.java:795)
>>>    [junit4]   1>        at org.apache.lucene.util.TestRuleSetupTeardownChained$1.evaluate(TestRuleSetupTeardownChained.java:50)
>>>    [junit4]   1>        at org.apache.lucene.util.TestRuleFieldCacheSanity$1.evaluate(TestRuleFieldCacheSanity.java:51)
>>>    [junit4]   1>        at org.apache.lucene.util.AbstractBeforeAfterRule$1.evaluate(AbstractBeforeAfterRule.java:46)
>>>    [junit4]   1>        at com.carrotsearch.randomizedtesting.rules.SystemPropertiesInvariantRule$1.evaluate(SystemPropertiesInvariantRule.java:55)
>>>    [junit4]   1>        at org.apache.lucene.util.TestRuleThreadAndTestName$1.evaluate(TestRuleThreadAndTestName.java:49)
>>>    [junit4]   1>        at org.apache.lucene.util.TestRuleIgnoreAfterMaxFailures$1.evaluate(TestRuleIgnoreAfterMaxFailures.java:70)
>>>    [junit4]   1>        at org.apache.lucene.util.TestRuleMarkFailure$1.evaluate(TestRuleMarkFailure.java:48)
>>>    [junit4]   1>        at com.carrotsearch.randomizedtesting.rules.StatementAdapter.evaluate(StatementAdapter.java:36)
>>>    [junit4]   1>        at com.carrotsearch.randomizedtesting.ThreadLeakControl$StatementRunner.run(ThreadLeakControl.java:358)
>>>    [junit4]   1>        at com.carrotsearch.randomizedtesting.ThreadLeakControl.forkTimeoutingTask(ThreadLeakControl.java:782)
>>>    [junit4]   1>        at com.carrotsearch.randomizedtesting.ThreadLeakControl$3.evaluate(ThreadLeakControl.java:442)
>>>    [junit4]   1>        at com.carrotsearch.randomizedtesting.RandomizedRunner.runSingleTest(RandomizedRunner.java:746)
>>>    [junit4]   1>        at com.carrotsearch.randomizedtesting.RandomizedRunner$3.evaluate(RandomizedRunner.java:648)
>>>    [junit4]   1>        at com.carrotsearch.randomizedtesting.RandomizedRunner$4.evaluate(RandomizedRunner.java:682)
>>>    [junit4]   1>        at com.carrotsearch.randomizedtesting.RandomizedRunner$5.evaluate(RandomizedRunner.java:693)
>>>    [junit4]   1>        at org.apache.lucene.util.AbstractBeforeAfterRule$1.evaluate(AbstractBeforeAfterRule.java:46)
>>>    [junit4]   1>        at org.apache.lucene.util.TestRuleStoreClassName$1.evaluate(TestRuleStoreClassName.java:42)
>>>    [junit4]   1>        at com.carrotsearch.randomizedtesting.rules.SystemPropertiesInvariantRule$1.evaluate(SystemPropertiesInvariantRule.java:55)
>>>    [junit4]   1>        at com.carrotsearch.randomizedtesting.rules.NoShadowingOrOverridesOnMethodsRule$1.evaluate(NoShadowingOrOverridesOnMethodsRule.java:39)
>>>    [junit4]   1>        at com.carrotsearch.randomizedtesting.rules.NoShadowingOrOverridesOnMethodsRule$1.evaluate(NoShadowingOrOverridesOnMethodsRule.java:39)
>>>    [junit4]   1>        at com.carrotsearch.randomizedtesting.rules.StatementAdapter.evaluate(StatementAdapter.java:36)
>>>    [junit4]   1>        at org.apache.lucene.util.TestRuleAssertionsRequired$1.evaluate(TestRuleAssertionsRequired.java:43)
>>>    [junit4]   1>        at org.apache.lucene.util.TestRuleMarkFailure$1.evaluate(TestRuleMarkFailure.java:48)
>>>    [junit4]   1>        at org.apache.lucene.util.TestRuleIgnoreAfterMaxFailures$1.evaluate(TestRuleIgnoreAfterMaxFailures.java:70)
>>>    [junit4]   1>        at org.apache.lucene.util.TestRuleIgnoreTestSuites$1.evaluate(TestRuleIgnoreTestSuites.java:55)
>>>    [junit4]   1>        at com.carrotsearch.randomizedtesting.rules.StatementAdapter.evaluate(StatementAdapter.java:36)
>>>    [junit4]   1>        at com.carrotsearch.randomizedtesting.ThreadLeakControl$StatementRunner.run(ThreadLeakControl.java:358)
>>>    [junit4]   1>        at java.lang.Thread.run(Thread.java:724)
>>>    [junit4]   1>     test: docvalues...........OK [0 docvalues fields; 0 BINARY; 0 NUMERIC; 0 SORTED; 0 SORTED_SET]
>>>    [junit4]   1> FAILED
>>>    [junit4]   1>     WARNING: fixIndex() would remove reference to this segment; full exception:
>>>    [junit4]   1> java.lang.RuntimeException: Term Vector test failed
>>>    [junit4]   1>        at org.apache.lucene.index.CheckIndex.checkIndex(CheckIndex.java:624)
>>>    [junit4]   1>        at org.apache.lucene.util._TestUtil.checkIndex(_TestUtil.java:223)
>>>    [junit4]   1>        at org.apache.lucene.store.MockDirectoryWrapper.close(MockDirectoryWrapper.java:659)
>>>    [junit4]   1>        at org.apache.lucene.classification.ClassificationTestBase.tearDown(ClassificationTestBase.java:70)
>>>    [junit4]   1>        at sun.reflect.NativeMethodAccessorImpl.invoke0(Native Method)
>>>    [junit4]   1>        at sun.reflect.NativeMethodAccessorImpl.invoke(NativeMethodAccessorImpl.java:57)
>>>    [junit4]   1>        at sun.reflect.DelegatingMethodAccessorImpl.invoke(DelegatingMethodAccessorImpl.java:43)
>>>    [junit4]   1>        at java.lang.reflect.Method.invoke(Method.java:606)
>>>    [junit4]   1>        at com.carrotsearch.randomizedtesting.RandomizedRunner.invoke(RandomizedRunner.java:1559)
>>>    [junit4]   1>        at com.carrotsearch.randomizedtesting.RandomizedRunner.access$600(RandomizedRunner.java:79)
>>>    [junit4]   1>        at com.carrotsearch.randomizedtesting.RandomizedRunner$8.evaluate(RandomizedRunner.java:795)
>>>    [junit4]   1>        at org.apache.lucene.util.TestRuleSetupTeardownChained$1.evaluate(TestRuleSetupTeardownChained.java:50)
>>>    [junit4]   1>        at org.apache.lucene.util.TestRuleFieldCacheSanity$1.evaluate(TestRuleFieldCacheSanity.java:51)
>>>    [junit4]   1>        at org.apache.lucene.util.AbstractBeforeAfterRule$1.evaluate(AbstractBeforeAfterRule.java:46)
>>>    [junit4]   1>        at com.carrotsearch.randomizedtesting.rules.SystemPropertiesInvariantRule$1.evaluate(SystemPropertiesInvariantRule.java:55)
>>>    [junit4]   1>        at org.apache.lucene.util.TestRuleThreadAndTestName$1.evaluate(TestRuleThreadAndTestName.java:49)
>>>    [junit4]   1>        at org.apache.lucene.util.TestRuleIgnoreAfterMaxFailures$1.evaluate(TestRuleIgnoreAfterMaxFailures.java:70)
>>>    [junit4]   1>        at org.apache.lucene.util.TestRuleMarkFailure$1.evaluate(TestRuleMarkFailure.java:48)
>>>    [junit4]   1>        at com.carrotsearch.randomizedtesting.rules.StatementAdapter.evaluate(StatementAdapter.java:36)
>>>    [junit4]   1>        at com.carrotsearch.randomizedtesting.ThreadLeakControl$StatementRunner.run(ThreadLeakControl.java:358)
>>>    [junit4]   1>        at com.carrotsearch.randomizedtesting.ThreadLeakControl.forkTimeoutingTask(ThreadLeakControl.java:782)
>>>    [junit4]   1>        at com.carrotsearch.randomizedtesting.ThreadLeakControl$3.evaluate(ThreadLeakControl.java:442)
>>>    [junit4]   1>        at com.carrotsearch.randomizedtesting.RandomizedRunner.runSingleTest(RandomizedRunner.java:746)
>>>    [junit4]   1>        at com.carrotsearch.randomizedtesting.RandomizedRunner$3.evaluate(RandomizedRunner.java:648)
>>>    [junit4]   1>        at com.carrotsearch.randomizedtesting.RandomizedRunner$4.evaluate(RandomizedRunner.java:682)
>>>    [junit4]   1>        at com.carrotsearch.randomizedtesting.RandomizedRunner$5.evaluate(RandomizedRunner.java:693)
>>>    [junit4]   1>        at org.apache.lucene.util.AbstractBeforeAfterRule$1.evaluate(AbstractBeforeAfterRule.java:46)
>>>    [junit4]   1>        at org.apache.lucene.util.TestRuleStoreClassName$1.evaluate(TestRuleStoreClassName.java:42)
>>>    [junit4]   1>        at com.carrotsearch.randomizedtesting.rules.SystemPropertiesInvariantRule$1.evaluate(SystemPropertiesInvariantRule.java:55)
>>>    [junit4]   1>        at com.carrotsearch.randomizedtesting.rules.NoShadowingOrOverridesOnMethodsRule$1.evaluate(NoShadowingOrOverridesOnMethodsRule.java:39)
>>>    [junit4]   1>        at com.carrotsearch.randomizedtesting.rules.NoShadowingOrOverridesOnMethodsRule$1.evaluate(NoShadowingOrOverridesOnMethodsRule.java:39)
>>>    [junit4]   1>        at com.carrotsearch.randomizedtesting.rules.StatementAdapter.evaluate(StatementAdapter.java:36)
>>>    [junit4]   1>        at org.apache.lucene.util.TestRuleAssertionsRequired$1.evaluate(TestRuleAssertionsRequired.java:43)
>>>    [junit4]   1>        at org.apache.lucene.util.TestRuleMarkFailure$1.evaluate(TestRuleMarkFailure.java:48)
>>>    [junit4]   1>        at org.apache.lucene.util.TestRuleIgnoreAfterMaxFailures$1.evaluate(TestRuleIgnoreAfterMaxFailures.java:70)
>>>    [junit4]   1>        at org.apache.lucene.util.TestRuleIgnoreTestSuites$1.evaluate(TestRuleIgnoreTestSuites.java:55)
>>>    [junit4]   1>        at com.carrotsearch.randomizedtesting.rules.StatementAdapter.evaluate(StatementAdapter.java:36)
>>>    [junit4]   1>        at com.carrotsearch.randomizedtesting.ThreadLeakControl$StatementRunner.run(ThreadLeakControl.java:358)
>>>    [junit4]   1>        at java.lang.Thread.run(Thread.java:724)
>>>    [junit4]   1>
>>>    [junit4]   1>   2 of 2: name=_1 docCount=102
>>>    [junit4]   1>     codec=FastDecompressionCompressingStoredFields(storedFieldsFormat=CompressingStoredFieldsFormat(compressionMode=FAST_DECOMPRESSION, chunkSize=16384), termVectorsFormat=CompressingTermVectorsFormat(compressionMode=FAST_DECOMPRESSION, chunkSize=16384))
>>>    [junit4]   1>     compound=true
>>>    [junit4]   1>     numFiles=3
>>>    [junit4]   1>     size (MB)=0.034
>>>    [junit4]   1>     diagnostics = {timestamp=1378977956167, os=Linux, os.version=3.2.0-53-generic, source=flush, lucene.version=5.0-SNAPSHOT, os.arch=amd64, java.version=1.7.0_40, java.vendor=Oracle Corporation}
>>>    [junit4]   1>     no deletions
>>>    [junit4]   1>     test: open reader.........OK
>>>    [junit4]   1>     test: fields..............OK [3 fields]
>>>    [junit4]   1>     test: field norms.........OK [3 fields]
>>>    [junit4]   1>     test: terms, freq, prox...OK [1297 terms; 1894 terms/docs pairs; 1912 tokens]
>>>    [junit4]   1>     test: stored fields.......OK [306 total field count; avg 3 fields per doc]
>>>    [junit4]   1>     test: term vectors........OK [306 total vector count; avg 3 term/freq vector fields per doc]
>>>    [junit4]   1>     test: docvalues...........OK [0 docvalues fields; 0 BINARY; 0 NUMERIC; 0 SORTED; 0 SORTED_SET]
>>>    [junit4]   1>
>>>    [junit4]   1> WARNING: 1 broken segments (containing 898 documents) detected
>>>    [junit4]   1>
>>>    [junit4]   2> NOTE: reproduce with: ant test  -Dtestcase=KNearestNeighborClassifierTest -Dtests.method=testPerformance -Dtests.seed=68F81CB00E47182B -Dtests.multiplier=3 -Dtests.slow=true -Dtests.locale=es_BO -Dtests.timezone=NST -Dtests.file.encoding=UTF-8
>>>    [junit4] ERROR   2.72s J0 | KNearestNeighborClassifierTest.testPerformance <<<
>>>    [junit4]    > Throwable #1: java.lang.RuntimeException: CheckIndex failed
>>>    [junit4]    >        at __randomizedtesting.SeedInfo.seed([68F81CB00E47182B:AF19EE9265F32084]:0)
>>>    [junit4]    >        at org.apache.lucene.util._TestUtil.checkIndex(_TestUtil.java:227)
>>>    [junit4]    >        at org.apache.lucene.store.MockDirectoryWrapper.close(MockDirectoryWrapper.java:659)
>>>    [junit4]    >        at org.apache.lucene.classification.ClassificationTestBase.tearDown(ClassificationTestBase.java:70)
>>>    [junit4]    >        at java.lang.Thread.run(Thread.java:724)
>>>    [junit4]   2> NOTE: test params are: codec=FastDecompressionCompressingStoredFields(storedFieldsFormat=CompressingStoredFieldsFormat(compressionMode=FAST_DECOMPRESSION, chunkSize=168), termVectorsFormat=CompressingTermVectorsFormat(compressionMode=FAST_DECOMPRESSION, chunkSize=168)), sim=RandomSimilarityProvider(queryNorm=true,coord=yes): {text=DFR GB1, cat=DFR I(n)B1, bool=DFR G2}, locale=es_BO, timezone=NST
>>>    [junit4]   2> NOTE: Linux 3.2.0-53-generic amd64/Oracle Corporation 1.7.0_40 (64-bit)/cpus=8,threads=1,free=59466608,total=131072000
>>>    [junit4]   2> NOTE: All tests run in this JVM: [DataSplitterTest, KNearestNeighborClassifierTest]
>>>    [junit4] Completed on J0 in 2.91s, 2 tests, 1 error <<< FAILURES!
>>>
>>> [...truncated 13 lines...]
>>> BUILD FAILED
>>> /mnt/ssd/jenkins/workspace/Lucene-Solr-trunk-Linux/build.xml:396: The following error occurred while executing this line:
>>> /mnt/ssd/jenkins/workspace/Lucene-Solr-trunk-Linux/build.xml:376: The following error occurred while executing this line:
>>> /mnt/ssd/jenkins/workspace/Lucene-Solr-trunk-Linux/build.xml:39: The following error occurred while executing this line:
>>> /mnt/ssd/jenkins/workspace/Lucene-Solr-trunk-Linux/lucene/build.xml:556: The following error occurred while executing this line:
>>> /mnt/ssd/jenkins/workspace/Lucene-Solr-trunk-Linux/lucene/common-build.xml:1885: The following error occurred while executing this line:
>>> /mnt/ssd/jenkins/workspace/Lucene-Solr-trunk-Linux/lucene/module-build.xml:61: The following error occurred while executing this line:
>>> /mnt/ssd/jenkins/workspace/Lucene-Solr-trunk-Linux/lucene/common-build.xml:1230: The following error occurred while executing this line:
>>> /mnt/ssd/jenkins/workspace/Lucene-Solr-trunk-Linux/lucene/common-build.xml:873: There were test failures: 4 suites, 10 tests, 1 error
>>>
>>> Total time: 12 minutes 29 seconds
>>> Build step 'Invoke Ant' marked build as failure
>>> Description set: Java: 64bit/jdk1.7.0_40 -XX:-UseCompressedOops -XX:+UseG1GC
>>> Archiving artifacts
>>> Recording test results
>>> Email was triggered for: Failure
>>> Sending email for trigger: Failure
>>>
>>>
>>>
>>>
>>> ---------------------------------------------------------------------
>>> To unsubscribe, e-mail: dev-unsubscribe@lucene.apache.org
>>> For additional commands, e-mail: dev-help@lucene.apache.org
>>
>> ---------------------------------------------------------------------
>> To unsubscribe, e-mail: dev-unsubscribe@lucene.apache.org
>> For additional commands, e-mail: dev-help@lucene.apache.org
>>
>
> ---------------------------------------------------------------------
> To unsubscribe, e-mail: dev-unsubscribe@lucene.apache.org
> For additional commands, e-mail: dev-help@lucene.apache.org
>

---------------------------------------------------------------------
To unsubscribe, e-mail: dev-unsubscribe@lucene.apache.org
For additional commands, e-mail: dev-help@lucene.apache.org


Re: [JENKINS] Lucene-Solr-trunk-Linux (64bit/jdk1.7.0_40) - Build # 7427 - Still Failing!

Posted by Robert Muir <rc...@gmail.com>.
Maybe it will reproduce with the master seed.


On Fri, Sep 13, 2013 at 7:14 AM, Michael McCandless
<lu...@mikemccandless.com> wrote:
> This doesn't repro on current trunk ...
>
> Mike McCandless
>
> http://blog.mikemccandless.com
>
>
> On Thu, Sep 12, 2013 at 5:26 AM, Policeman Jenkins Server
> <je...@thetaphi.de> wrote:
>> Build: http://jenkins.thetaphi.de/job/Lucene-Solr-trunk-Linux/7427/
>> Java: 64bit/jdk1.7.0_40 -XX:-UseCompressedOops -XX:+UseG1GC
>>
>> 1 tests failed.
>> REGRESSION:  org.apache.lucene.classification.KNearestNeighborClassifierTest.testPerformance
>>
>> Error Message:
>> CheckIndex failed
>>
>> Stack Trace:
>> java.lang.RuntimeException: CheckIndex failed
>>         at __randomizedtesting.SeedInfo.seed([68F81CB00E47182B:AF19EE9265F32084]:0)
>>         at org.apache.lucene.util._TestUtil.checkIndex(_TestUtil.java:227)
>>         at org.apache.lucene.store.MockDirectoryWrapper.close(MockDirectoryWrapper.java:659)
>>         at org.apache.lucene.classification.ClassificationTestBase.tearDown(ClassificationTestBase.java:70)
>>         at sun.reflect.NativeMethodAccessorImpl.invoke0(Native Method)
>>         at sun.reflect.NativeMethodAccessorImpl.invoke(NativeMethodAccessorImpl.java:57)
>>         at sun.reflect.DelegatingMethodAccessorImpl.invoke(DelegatingMethodAccessorImpl.java:43)
>>         at java.lang.reflect.Method.invoke(Method.java:606)
>>         at com.carrotsearch.randomizedtesting.RandomizedRunner.invoke(RandomizedRunner.java:1559)
>>         at com.carrotsearch.randomizedtesting.RandomizedRunner.access$600(RandomizedRunner.java:79)
>>         at com.carrotsearch.randomizedtesting.RandomizedRunner$8.evaluate(RandomizedRunner.java:795)
>>         at org.apache.lucene.util.TestRuleSetupTeardownChained$1.evaluate(TestRuleSetupTeardownChained.java:50)
>>         at org.apache.lucene.util.TestRuleFieldCacheSanity$1.evaluate(TestRuleFieldCacheSanity.java:51)
>>         at org.apache.lucene.util.AbstractBeforeAfterRule$1.evaluate(AbstractBeforeAfterRule.java:46)
>>         at com.carrotsearch.randomizedtesting.rules.SystemPropertiesInvariantRule$1.evaluate(SystemPropertiesInvariantRule.java:55)
>>         at org.apache.lucene.util.TestRuleThreadAndTestName$1.evaluate(TestRuleThreadAndTestName.java:49)
>>         at org.apache.lucene.util.TestRuleIgnoreAfterMaxFailures$1.evaluate(TestRuleIgnoreAfterMaxFailures.java:70)
>>         at org.apache.lucene.util.TestRuleMarkFailure$1.evaluate(TestRuleMarkFailure.java:48)
>>         at com.carrotsearch.randomizedtesting.rules.StatementAdapter.evaluate(StatementAdapter.java:36)
>>         at com.carrotsearch.randomizedtesting.ThreadLeakControl$StatementRunner.run(ThreadLeakControl.java:358)
>>         at com.carrotsearch.randomizedtesting.ThreadLeakControl.forkTimeoutingTask(ThreadLeakControl.java:782)
>>         at com.carrotsearch.randomizedtesting.ThreadLeakControl$3.evaluate(ThreadLeakControl.java:442)
>>         at com.carrotsearch.randomizedtesting.RandomizedRunner.runSingleTest(RandomizedRunner.java:746)
>>         at com.carrotsearch.randomizedtesting.RandomizedRunner$3.evaluate(RandomizedRunner.java:648)
>>         at com.carrotsearch.randomizedtesting.RandomizedRunner$4.evaluate(RandomizedRunner.java:682)
>>         at com.carrotsearch.randomizedtesting.RandomizedRunner$5.evaluate(RandomizedRunner.java:693)
>>         at org.apache.lucene.util.AbstractBeforeAfterRule$1.evaluate(AbstractBeforeAfterRule.java:46)
>>         at org.apache.lucene.util.TestRuleStoreClassName$1.evaluate(TestRuleStoreClassName.java:42)
>>         at com.carrotsearch.randomizedtesting.rules.SystemPropertiesInvariantRule$1.evaluate(SystemPropertiesInvariantRule.java:55)
>>         at com.carrotsearch.randomizedtesting.rules.NoShadowingOrOverridesOnMethodsRule$1.evaluate(NoShadowingOrOverridesOnMethodsRule.java:39)
>>         at com.carrotsearch.randomizedtesting.rules.NoShadowingOrOverridesOnMethodsRule$1.evaluate(NoShadowingOrOverridesOnMethodsRule.java:39)
>>         at com.carrotsearch.randomizedtesting.rules.StatementAdapter.evaluate(StatementAdapter.java:36)
>>         at org.apache.lucene.util.TestRuleAssertionsRequired$1.evaluate(TestRuleAssertionsRequired.java:43)
>>         at org.apache.lucene.util.TestRuleMarkFailure$1.evaluate(TestRuleMarkFailure.java:48)
>>         at org.apache.lucene.util.TestRuleIgnoreAfterMaxFailures$1.evaluate(TestRuleIgnoreAfterMaxFailures.java:70)
>>         at org.apache.lucene.util.TestRuleIgnoreTestSuites$1.evaluate(TestRuleIgnoreTestSuites.java:55)
>>         at com.carrotsearch.randomizedtesting.rules.StatementAdapter.evaluate(StatementAdapter.java:36)
>>         at com.carrotsearch.randomizedtesting.ThreadLeakControl$StatementRunner.run(ThreadLeakControl.java:358)
>>         at java.lang.Thread.run(Thread.java:724)
>>
>>
>>
>>
>> Build Log:
>> [...truncated 6618 lines...]
>>    [junit4] Suite: org.apache.lucene.classification.KNearestNeighborClassifierTest
>>    [junit4]   1> CheckIndex failed
>>    [junit4]   1> Segments file=segments_3 numSegments=2 version=5.0 format=
>>    [junit4]   1>   1 of 2: name=_0 docCount=898
>>    [junit4]   1>     codec=FastDecompressionCompressingStoredFields(storedFieldsFormat=CompressingStoredFieldsFormat(compressionMode=FAST_DECOMPRESSION, chunkSize=16384), termVectorsFormat=CompressingTermVectorsFormat(compressionMode=FAST_DECOMPRESSION, chunkSize=16384))
>>    [junit4]   1>     compound=true
>>    [junit4]   1>     numFiles=3
>>    [junit4]   1>     size (MB)=0.283
>>    [junit4]   1>     diagnostics = {timestamp=1378977956101, os=Linux, os.version=3.2.0-53-generic, source=flush, lucene.version=5.0-SNAPSHOT, os.arch=amd64, java.version=1.7.0_40, java.vendor=Oracle Corporation}
>>    [junit4]   1>     no deletions
>>    [junit4]   1>     test: open reader.........OK
>>    [junit4]   1>     test: fields..............OK [3 fields]
>>    [junit4]   1>     test: field norms.........OK [3 fields]
>>    [junit4]   1>     test: terms, freq, prox...OK [9449 terms; 16456 terms/docs pairs; 16648 tokens]
>>    [junit4]   1>     test: stored fields.......OK [2694 total field count; avg 3 fields per doc]
>>    [junit4]   1>     test: term vectors........ERROR [2]
>>    [junit4]   1> java.lang.ArrayIndexOutOfBoundsException: 2
>>    [junit4]   1>        at org.apache.lucene.codecs.compressing.CompressingTermVectorsReader.get(CompressingTermVectorsReader.java:393)
>>    [junit4]   1>        at org.apache.lucene.index.SegmentReader.getTermVectors(SegmentReader.java:169)
>>    [junit4]   1>        at org.apache.lucene.index.CheckIndex.testTermVectors(CheckIndex.java:1524)
>>    [junit4]   1>        at org.apache.lucene.index.CheckIndex.checkIndex(CheckIndex.java:611)
>>    [junit4]   1>        at org.apache.lucene.util._TestUtil.checkIndex(_TestUtil.java:223)
>>    [junit4]   1>        at org.apache.lucene.store.MockDirectoryWrapper.close(MockDirectoryWrapper.java:659)
>>    [junit4]   1>        at org.apache.lucene.classification.ClassificationTestBase.tearDown(ClassificationTestBase.java:70)
>>    [junit4]   1>        at sun.reflect.NativeMethodAccessorImpl.invoke0(Native Method)
>>    [junit4]   1>        at sun.reflect.NativeMethodAccessorImpl.invoke(NativeMethodAccessorImpl.java:57)
>>    [junit4]   1>        at sun.reflect.DelegatingMethodAccessorImpl.invoke(DelegatingMethodAccessorImpl.java:43)
>>    [junit4]   1>        at java.lang.reflect.Method.invoke(Method.java:606)
>>    [junit4]   1>        at com.carrotsearch.randomizedtesting.RandomizedRunner.invoke(RandomizedRunner.java:1559)
>>    [junit4]   1>        at com.carrotsearch.randomizedtesting.RandomizedRunner.access$600(RandomizedRunner.java:79)
>>    [junit4]   1>        at com.carrotsearch.randomizedtesting.RandomizedRunner$8.evaluate(RandomizedRunner.java:795)
>>    [junit4]   1>        at org.apache.lucene.util.TestRuleSetupTeardownChained$1.evaluate(TestRuleSetupTeardownChained.java:50)
>>    [junit4]   1>        at org.apache.lucene.util.TestRuleFieldCacheSanity$1.evaluate(TestRuleFieldCacheSanity.java:51)
>>    [junit4]   1>        at org.apache.lucene.util.AbstractBeforeAfterRule$1.evaluate(AbstractBeforeAfterRule.java:46)
>>    [junit4]   1>        at com.carrotsearch.randomizedtesting.rules.SystemPropertiesInvariantRule$1.evaluate(SystemPropertiesInvariantRule.java:55)
>>    [junit4]   1>        at org.apache.lucene.util.TestRuleThreadAndTestName$1.evaluate(TestRuleThreadAndTestName.java:49)
>>    [junit4]   1>        at org.apache.lucene.util.TestRuleIgnoreAfterMaxFailures$1.evaluate(TestRuleIgnoreAfterMaxFailures.java:70)
>>    [junit4]   1>        at org.apache.lucene.util.TestRuleMarkFailure$1.evaluate(TestRuleMarkFailure.java:48)
>>    [junit4]   1>        at com.carrotsearch.randomizedtesting.rules.StatementAdapter.evaluate(StatementAdapter.java:36)
>>    [junit4]   1>        at com.carrotsearch.randomizedtesting.ThreadLeakControl$StatementRunner.run(ThreadLeakControl.java:358)
>>    [junit4]   1>        at com.carrotsearch.randomizedtesting.ThreadLeakControl.forkTimeoutingTask(ThreadLeakControl.java:782)
>>    [junit4]   1>        at com.carrotsearch.randomizedtesting.ThreadLeakControl$3.evaluate(ThreadLeakControl.java:442)
>>    [junit4]   1>        at com.carrotsearch.randomizedtesting.RandomizedRunner.runSingleTest(RandomizedRunner.java:746)
>>    [junit4]   1>        at com.carrotsearch.randomizedtesting.RandomizedRunner$3.evaluate(RandomizedRunner.java:648)
>>    [junit4]   1>        at com.carrotsearch.randomizedtesting.RandomizedRunner$4.evaluate(RandomizedRunner.java:682)
>>    [junit4]   1>        at com.carrotsearch.randomizedtesting.RandomizedRunner$5.evaluate(RandomizedRunner.java:693)
>>    [junit4]   1>        at org.apache.lucene.util.AbstractBeforeAfterRule$1.evaluate(AbstractBeforeAfterRule.java:46)
>>    [junit4]   1>        at org.apache.lucene.util.TestRuleStoreClassName$1.evaluate(TestRuleStoreClassName.java:42)
>>    [junit4]   1>        at com.carrotsearch.randomizedtesting.rules.SystemPropertiesInvariantRule$1.evaluate(SystemPropertiesInvariantRule.java:55)
>>    [junit4]   1>        at com.carrotsearch.randomizedtesting.rules.NoShadowingOrOverridesOnMethodsRule$1.evaluate(NoShadowingOrOverridesOnMethodsRule.java:39)
>>    [junit4]   1>        at com.carrotsearch.randomizedtesting.rules.NoShadowingOrOverridesOnMethodsRule$1.evaluate(NoShadowingOrOverridesOnMethodsRule.java:39)
>>    [junit4]   1>        at com.carrotsearch.randomizedtesting.rules.StatementAdapter.evaluate(StatementAdapter.java:36)
>>    [junit4]   1>        at org.apache.lucene.util.TestRuleAssertionsRequired$1.evaluate(TestRuleAssertionsRequired.java:43)
>>    [junit4]   1>        at org.apache.lucene.util.TestRuleMarkFailure$1.evaluate(TestRuleMarkFailure.java:48)
>>    [junit4]   1>        at org.apache.lucene.util.TestRuleIgnoreAfterMaxFailures$1.evaluate(TestRuleIgnoreAfterMaxFailures.java:70)
>>    [junit4]   1>        at org.apache.lucene.util.TestRuleIgnoreTestSuites$1.evaluate(TestRuleIgnoreTestSuites.java:55)
>>    [junit4]   1>        at com.carrotsearch.randomizedtesting.rules.StatementAdapter.evaluate(StatementAdapter.java:36)
>>    [junit4]   1>        at com.carrotsearch.randomizedtesting.ThreadLeakControl$StatementRunner.run(ThreadLeakControl.java:358)
>>    [junit4]   1>        at java.lang.Thread.run(Thread.java:724)
>>    [junit4]   1>     test: docvalues...........OK [0 docvalues fields; 0 BINARY; 0 NUMERIC; 0 SORTED; 0 SORTED_SET]
>>    [junit4]   1> FAILED
>>    [junit4]   1>     WARNING: fixIndex() would remove reference to this segment; full exception:
>>    [junit4]   1> java.lang.RuntimeException: Term Vector test failed
>>    [junit4]   1>        at org.apache.lucene.index.CheckIndex.checkIndex(CheckIndex.java:624)
>>    [junit4]   1>        at org.apache.lucene.util._TestUtil.checkIndex(_TestUtil.java:223)
>>    [junit4]   1>        at org.apache.lucene.store.MockDirectoryWrapper.close(MockDirectoryWrapper.java:659)
>>    [junit4]   1>        at org.apache.lucene.classification.ClassificationTestBase.tearDown(ClassificationTestBase.java:70)
>>    [junit4]   1>        at sun.reflect.NativeMethodAccessorImpl.invoke0(Native Method)
>>    [junit4]   1>        at sun.reflect.NativeMethodAccessorImpl.invoke(NativeMethodAccessorImpl.java:57)
>>    [junit4]   1>        at sun.reflect.DelegatingMethodAccessorImpl.invoke(DelegatingMethodAccessorImpl.java:43)
>>    [junit4]   1>        at java.lang.reflect.Method.invoke(Method.java:606)
>>    [junit4]   1>        at com.carrotsearch.randomizedtesting.RandomizedRunner.invoke(RandomizedRunner.java:1559)
>>    [junit4]   1>        at com.carrotsearch.randomizedtesting.RandomizedRunner.access$600(RandomizedRunner.java:79)
>>    [junit4]   1>        at com.carrotsearch.randomizedtesting.RandomizedRunner$8.evaluate(RandomizedRunner.java:795)
>>    [junit4]   1>        at org.apache.lucene.util.TestRuleSetupTeardownChained$1.evaluate(TestRuleSetupTeardownChained.java:50)
>>    [junit4]   1>        at org.apache.lucene.util.TestRuleFieldCacheSanity$1.evaluate(TestRuleFieldCacheSanity.java:51)
>>    [junit4]   1>        at org.apache.lucene.util.AbstractBeforeAfterRule$1.evaluate(AbstractBeforeAfterRule.java:46)
>>    [junit4]   1>        at com.carrotsearch.randomizedtesting.rules.SystemPropertiesInvariantRule$1.evaluate(SystemPropertiesInvariantRule.java:55)
>>    [junit4]   1>        at org.apache.lucene.util.TestRuleThreadAndTestName$1.evaluate(TestRuleThreadAndTestName.java:49)
>>    [junit4]   1>        at org.apache.lucene.util.TestRuleIgnoreAfterMaxFailures$1.evaluate(TestRuleIgnoreAfterMaxFailures.java:70)
>>    [junit4]   1>        at org.apache.lucene.util.TestRuleMarkFailure$1.evaluate(TestRuleMarkFailure.java:48)
>>    [junit4]   1>        at com.carrotsearch.randomizedtesting.rules.StatementAdapter.evaluate(StatementAdapter.java:36)
>>    [junit4]   1>        at com.carrotsearch.randomizedtesting.ThreadLeakControl$StatementRunner.run(ThreadLeakControl.java:358)
>>    [junit4]   1>        at com.carrotsearch.randomizedtesting.ThreadLeakControl.forkTimeoutingTask(ThreadLeakControl.java:782)
>>    [junit4]   1>        at com.carrotsearch.randomizedtesting.ThreadLeakControl$3.evaluate(ThreadLeakControl.java:442)
>>    [junit4]   1>        at com.carrotsearch.randomizedtesting.RandomizedRunner.runSingleTest(RandomizedRunner.java:746)
>>    [junit4]   1>        at com.carrotsearch.randomizedtesting.RandomizedRunner$3.evaluate(RandomizedRunner.java:648)
>>    [junit4]   1>        at com.carrotsearch.randomizedtesting.RandomizedRunner$4.evaluate(RandomizedRunner.java:682)
>>    [junit4]   1>        at com.carrotsearch.randomizedtesting.RandomizedRunner$5.evaluate(RandomizedRunner.java:693)
>>    [junit4]   1>        at org.apache.lucene.util.AbstractBeforeAfterRule$1.evaluate(AbstractBeforeAfterRule.java:46)
>>    [junit4]   1>        at org.apache.lucene.util.TestRuleStoreClassName$1.evaluate(TestRuleStoreClassName.java:42)
>>    [junit4]   1>        at com.carrotsearch.randomizedtesting.rules.SystemPropertiesInvariantRule$1.evaluate(SystemPropertiesInvariantRule.java:55)
>>    [junit4]   1>        at com.carrotsearch.randomizedtesting.rules.NoShadowingOrOverridesOnMethodsRule$1.evaluate(NoShadowingOrOverridesOnMethodsRule.java:39)
>>    [junit4]   1>        at com.carrotsearch.randomizedtesting.rules.NoShadowingOrOverridesOnMethodsRule$1.evaluate(NoShadowingOrOverridesOnMethodsRule.java:39)
>>    [junit4]   1>        at com.carrotsearch.randomizedtesting.rules.StatementAdapter.evaluate(StatementAdapter.java:36)
>>    [junit4]   1>        at org.apache.lucene.util.TestRuleAssertionsRequired$1.evaluate(TestRuleAssertionsRequired.java:43)
>>    [junit4]   1>        at org.apache.lucene.util.TestRuleMarkFailure$1.evaluate(TestRuleMarkFailure.java:48)
>>    [junit4]   1>        at org.apache.lucene.util.TestRuleIgnoreAfterMaxFailures$1.evaluate(TestRuleIgnoreAfterMaxFailures.java:70)
>>    [junit4]   1>        at org.apache.lucene.util.TestRuleIgnoreTestSuites$1.evaluate(TestRuleIgnoreTestSuites.java:55)
>>    [junit4]   1>        at com.carrotsearch.randomizedtesting.rules.StatementAdapter.evaluate(StatementAdapter.java:36)
>>    [junit4]   1>        at com.carrotsearch.randomizedtesting.ThreadLeakControl$StatementRunner.run(ThreadLeakControl.java:358)
>>    [junit4]   1>        at java.lang.Thread.run(Thread.java:724)
>>    [junit4]   1>
>>    [junit4]   1>   2 of 2: name=_1 docCount=102
>>    [junit4]   1>     codec=FastDecompressionCompressingStoredFields(storedFieldsFormat=CompressingStoredFieldsFormat(compressionMode=FAST_DECOMPRESSION, chunkSize=16384), termVectorsFormat=CompressingTermVectorsFormat(compressionMode=FAST_DECOMPRESSION, chunkSize=16384))
>>    [junit4]   1>     compound=true
>>    [junit4]   1>     numFiles=3
>>    [junit4]   1>     size (MB)=0.034
>>    [junit4]   1>     diagnostics = {timestamp=1378977956167, os=Linux, os.version=3.2.0-53-generic, source=flush, lucene.version=5.0-SNAPSHOT, os.arch=amd64, java.version=1.7.0_40, java.vendor=Oracle Corporation}
>>    [junit4]   1>     no deletions
>>    [junit4]   1>     test: open reader.........OK
>>    [junit4]   1>     test: fields..............OK [3 fields]
>>    [junit4]   1>     test: field norms.........OK [3 fields]
>>    [junit4]   1>     test: terms, freq, prox...OK [1297 terms; 1894 terms/docs pairs; 1912 tokens]
>>    [junit4]   1>     test: stored fields.......OK [306 total field count; avg 3 fields per doc]
>>    [junit4]   1>     test: term vectors........OK [306 total vector count; avg 3 term/freq vector fields per doc]
>>    [junit4]   1>     test: docvalues...........OK [0 docvalues fields; 0 BINARY; 0 NUMERIC; 0 SORTED; 0 SORTED_SET]
>>    [junit4]   1>
>>    [junit4]   1> WARNING: 1 broken segments (containing 898 documents) detected
>>    [junit4]   1>
>>    [junit4]   2> NOTE: reproduce with: ant test  -Dtestcase=KNearestNeighborClassifierTest -Dtests.method=testPerformance -Dtests.seed=68F81CB00E47182B -Dtests.multiplier=3 -Dtests.slow=true -Dtests.locale=es_BO -Dtests.timezone=NST -Dtests.file.encoding=UTF-8
>>    [junit4] ERROR   2.72s J0 | KNearestNeighborClassifierTest.testPerformance <<<
>>    [junit4]    > Throwable #1: java.lang.RuntimeException: CheckIndex failed
>>    [junit4]    >        at __randomizedtesting.SeedInfo.seed([68F81CB00E47182B:AF19EE9265F32084]:0)
>>    [junit4]    >        at org.apache.lucene.util._TestUtil.checkIndex(_TestUtil.java:227)
>>    [junit4]    >        at org.apache.lucene.store.MockDirectoryWrapper.close(MockDirectoryWrapper.java:659)
>>    [junit4]    >        at org.apache.lucene.classification.ClassificationTestBase.tearDown(ClassificationTestBase.java:70)
>>    [junit4]    >        at java.lang.Thread.run(Thread.java:724)
>>    [junit4]   2> NOTE: test params are: codec=FastDecompressionCompressingStoredFields(storedFieldsFormat=CompressingStoredFieldsFormat(compressionMode=FAST_DECOMPRESSION, chunkSize=168), termVectorsFormat=CompressingTermVectorsFormat(compressionMode=FAST_DECOMPRESSION, chunkSize=168)), sim=RandomSimilarityProvider(queryNorm=true,coord=yes): {text=DFR GB1, cat=DFR I(n)B1, bool=DFR G2}, locale=es_BO, timezone=NST
>>    [junit4]   2> NOTE: Linux 3.2.0-53-generic amd64/Oracle Corporation 1.7.0_40 (64-bit)/cpus=8,threads=1,free=59466608,total=131072000
>>    [junit4]   2> NOTE: All tests run in this JVM: [DataSplitterTest, KNearestNeighborClassifierTest]
>>    [junit4] Completed on J0 in 2.91s, 2 tests, 1 error <<< FAILURES!
>>
>> [...truncated 13 lines...]
>> BUILD FAILED
>> /mnt/ssd/jenkins/workspace/Lucene-Solr-trunk-Linux/build.xml:396: The following error occurred while executing this line:
>> /mnt/ssd/jenkins/workspace/Lucene-Solr-trunk-Linux/build.xml:376: The following error occurred while executing this line:
>> /mnt/ssd/jenkins/workspace/Lucene-Solr-trunk-Linux/build.xml:39: The following error occurred while executing this line:
>> /mnt/ssd/jenkins/workspace/Lucene-Solr-trunk-Linux/lucene/build.xml:556: The following error occurred while executing this line:
>> /mnt/ssd/jenkins/workspace/Lucene-Solr-trunk-Linux/lucene/common-build.xml:1885: The following error occurred while executing this line:
>> /mnt/ssd/jenkins/workspace/Lucene-Solr-trunk-Linux/lucene/module-build.xml:61: The following error occurred while executing this line:
>> /mnt/ssd/jenkins/workspace/Lucene-Solr-trunk-Linux/lucene/common-build.xml:1230: The following error occurred while executing this line:
>> /mnt/ssd/jenkins/workspace/Lucene-Solr-trunk-Linux/lucene/common-build.xml:873: There were test failures: 4 suites, 10 tests, 1 error
>>
>> Total time: 12 minutes 29 seconds
>> Build step 'Invoke Ant' marked build as failure
>> Description set: Java: 64bit/jdk1.7.0_40 -XX:-UseCompressedOops -XX:+UseG1GC
>> Archiving artifacts
>> Recording test results
>> Email was triggered for: Failure
>> Sending email for trigger: Failure
>>
>>
>>
>>
>> ---------------------------------------------------------------------
>> To unsubscribe, e-mail: dev-unsubscribe@lucene.apache.org
>> For additional commands, e-mail: dev-help@lucene.apache.org
>
> ---------------------------------------------------------------------
> To unsubscribe, e-mail: dev-unsubscribe@lucene.apache.org
> For additional commands, e-mail: dev-help@lucene.apache.org
>

---------------------------------------------------------------------
To unsubscribe, e-mail: dev-unsubscribe@lucene.apache.org
For additional commands, e-mail: dev-help@lucene.apache.org


Re: [JENKINS] Lucene-Solr-trunk-Linux (64bit/jdk1.7.0_40) - Build # 7427 - Still Failing!

Posted by Michael McCandless <lu...@mikemccandless.com>.
This doesn't repro on current trunk ...

Mike McCandless

http://blog.mikemccandless.com


On Thu, Sep 12, 2013 at 5:26 AM, Policeman Jenkins Server
<je...@thetaphi.de> wrote:
> Build: http://jenkins.thetaphi.de/job/Lucene-Solr-trunk-Linux/7427/
> Java: 64bit/jdk1.7.0_40 -XX:-UseCompressedOops -XX:+UseG1GC
>
> 1 tests failed.
> REGRESSION:  org.apache.lucene.classification.KNearestNeighborClassifierTest.testPerformance
>
> Error Message:
> CheckIndex failed
>
> Stack Trace:
> java.lang.RuntimeException: CheckIndex failed
>         at __randomizedtesting.SeedInfo.seed([68F81CB00E47182B:AF19EE9265F32084]:0)
>         at org.apache.lucene.util._TestUtil.checkIndex(_TestUtil.java:227)
>         at org.apache.lucene.store.MockDirectoryWrapper.close(MockDirectoryWrapper.java:659)
>         at org.apache.lucene.classification.ClassificationTestBase.tearDown(ClassificationTestBase.java:70)
>         at sun.reflect.NativeMethodAccessorImpl.invoke0(Native Method)
>         at sun.reflect.NativeMethodAccessorImpl.invoke(NativeMethodAccessorImpl.java:57)
>         at sun.reflect.DelegatingMethodAccessorImpl.invoke(DelegatingMethodAccessorImpl.java:43)
>         at java.lang.reflect.Method.invoke(Method.java:606)
>         at com.carrotsearch.randomizedtesting.RandomizedRunner.invoke(RandomizedRunner.java:1559)
>         at com.carrotsearch.randomizedtesting.RandomizedRunner.access$600(RandomizedRunner.java:79)
>         at com.carrotsearch.randomizedtesting.RandomizedRunner$8.evaluate(RandomizedRunner.java:795)
>         at org.apache.lucene.util.TestRuleSetupTeardownChained$1.evaluate(TestRuleSetupTeardownChained.java:50)
>         at org.apache.lucene.util.TestRuleFieldCacheSanity$1.evaluate(TestRuleFieldCacheSanity.java:51)
>         at org.apache.lucene.util.AbstractBeforeAfterRule$1.evaluate(AbstractBeforeAfterRule.java:46)
>         at com.carrotsearch.randomizedtesting.rules.SystemPropertiesInvariantRule$1.evaluate(SystemPropertiesInvariantRule.java:55)
>         at org.apache.lucene.util.TestRuleThreadAndTestName$1.evaluate(TestRuleThreadAndTestName.java:49)
>         at org.apache.lucene.util.TestRuleIgnoreAfterMaxFailures$1.evaluate(TestRuleIgnoreAfterMaxFailures.java:70)
>         at org.apache.lucene.util.TestRuleMarkFailure$1.evaluate(TestRuleMarkFailure.java:48)
>         at com.carrotsearch.randomizedtesting.rules.StatementAdapter.evaluate(StatementAdapter.java:36)
>         at com.carrotsearch.randomizedtesting.ThreadLeakControl$StatementRunner.run(ThreadLeakControl.java:358)
>         at com.carrotsearch.randomizedtesting.ThreadLeakControl.forkTimeoutingTask(ThreadLeakControl.java:782)
>         at com.carrotsearch.randomizedtesting.ThreadLeakControl$3.evaluate(ThreadLeakControl.java:442)
>         at com.carrotsearch.randomizedtesting.RandomizedRunner.runSingleTest(RandomizedRunner.java:746)
>         at com.carrotsearch.randomizedtesting.RandomizedRunner$3.evaluate(RandomizedRunner.java:648)
>         at com.carrotsearch.randomizedtesting.RandomizedRunner$4.evaluate(RandomizedRunner.java:682)
>         at com.carrotsearch.randomizedtesting.RandomizedRunner$5.evaluate(RandomizedRunner.java:693)
>         at org.apache.lucene.util.AbstractBeforeAfterRule$1.evaluate(AbstractBeforeAfterRule.java:46)
>         at org.apache.lucene.util.TestRuleStoreClassName$1.evaluate(TestRuleStoreClassName.java:42)
>         at com.carrotsearch.randomizedtesting.rules.SystemPropertiesInvariantRule$1.evaluate(SystemPropertiesInvariantRule.java:55)
>         at com.carrotsearch.randomizedtesting.rules.NoShadowingOrOverridesOnMethodsRule$1.evaluate(NoShadowingOrOverridesOnMethodsRule.java:39)
>         at com.carrotsearch.randomizedtesting.rules.NoShadowingOrOverridesOnMethodsRule$1.evaluate(NoShadowingOrOverridesOnMethodsRule.java:39)
>         at com.carrotsearch.randomizedtesting.rules.StatementAdapter.evaluate(StatementAdapter.java:36)
>         at org.apache.lucene.util.TestRuleAssertionsRequired$1.evaluate(TestRuleAssertionsRequired.java:43)
>         at org.apache.lucene.util.TestRuleMarkFailure$1.evaluate(TestRuleMarkFailure.java:48)
>         at org.apache.lucene.util.TestRuleIgnoreAfterMaxFailures$1.evaluate(TestRuleIgnoreAfterMaxFailures.java:70)
>         at org.apache.lucene.util.TestRuleIgnoreTestSuites$1.evaluate(TestRuleIgnoreTestSuites.java:55)
>         at com.carrotsearch.randomizedtesting.rules.StatementAdapter.evaluate(StatementAdapter.java:36)
>         at com.carrotsearch.randomizedtesting.ThreadLeakControl$StatementRunner.run(ThreadLeakControl.java:358)
>         at java.lang.Thread.run(Thread.java:724)
>
>
>
>
> Build Log:
> [...truncated 6618 lines...]
>    [junit4] Suite: org.apache.lucene.classification.KNearestNeighborClassifierTest
>    [junit4]   1> CheckIndex failed
>    [junit4]   1> Segments file=segments_3 numSegments=2 version=5.0 format=
>    [junit4]   1>   1 of 2: name=_0 docCount=898
>    [junit4]   1>     codec=FastDecompressionCompressingStoredFields(storedFieldsFormat=CompressingStoredFieldsFormat(compressionMode=FAST_DECOMPRESSION, chunkSize=16384), termVectorsFormat=CompressingTermVectorsFormat(compressionMode=FAST_DECOMPRESSION, chunkSize=16384))
>    [junit4]   1>     compound=true
>    [junit4]   1>     numFiles=3
>    [junit4]   1>     size (MB)=0.283
>    [junit4]   1>     diagnostics = {timestamp=1378977956101, os=Linux, os.version=3.2.0-53-generic, source=flush, lucene.version=5.0-SNAPSHOT, os.arch=amd64, java.version=1.7.0_40, java.vendor=Oracle Corporation}
>    [junit4]   1>     no deletions
>    [junit4]   1>     test: open reader.........OK
>    [junit4]   1>     test: fields..............OK [3 fields]
>    [junit4]   1>     test: field norms.........OK [3 fields]
>    [junit4]   1>     test: terms, freq, prox...OK [9449 terms; 16456 terms/docs pairs; 16648 tokens]
>    [junit4]   1>     test: stored fields.......OK [2694 total field count; avg 3 fields per doc]
>    [junit4]   1>     test: term vectors........ERROR [2]
>    [junit4]   1> java.lang.ArrayIndexOutOfBoundsException: 2
>    [junit4]   1>        at org.apache.lucene.codecs.compressing.CompressingTermVectorsReader.get(CompressingTermVectorsReader.java:393)
>    [junit4]   1>        at org.apache.lucene.index.SegmentReader.getTermVectors(SegmentReader.java:169)
>    [junit4]   1>        at org.apache.lucene.index.CheckIndex.testTermVectors(CheckIndex.java:1524)
>    [junit4]   1>        at org.apache.lucene.index.CheckIndex.checkIndex(CheckIndex.java:611)
>    [junit4]   1>        at org.apache.lucene.util._TestUtil.checkIndex(_TestUtil.java:223)
>    [junit4]   1>        at org.apache.lucene.store.MockDirectoryWrapper.close(MockDirectoryWrapper.java:659)
>    [junit4]   1>        at org.apache.lucene.classification.ClassificationTestBase.tearDown(ClassificationTestBase.java:70)
>    [junit4]   1>        at sun.reflect.NativeMethodAccessorImpl.invoke0(Native Method)
>    [junit4]   1>        at sun.reflect.NativeMethodAccessorImpl.invoke(NativeMethodAccessorImpl.java:57)
>    [junit4]   1>        at sun.reflect.DelegatingMethodAccessorImpl.invoke(DelegatingMethodAccessorImpl.java:43)
>    [junit4]   1>        at java.lang.reflect.Method.invoke(Method.java:606)
>    [junit4]   1>        at com.carrotsearch.randomizedtesting.RandomizedRunner.invoke(RandomizedRunner.java:1559)
>    [junit4]   1>        at com.carrotsearch.randomizedtesting.RandomizedRunner.access$600(RandomizedRunner.java:79)
>    [junit4]   1>        at com.carrotsearch.randomizedtesting.RandomizedRunner$8.evaluate(RandomizedRunner.java:795)
>    [junit4]   1>        at org.apache.lucene.util.TestRuleSetupTeardownChained$1.evaluate(TestRuleSetupTeardownChained.java:50)
>    [junit4]   1>        at org.apache.lucene.util.TestRuleFieldCacheSanity$1.evaluate(TestRuleFieldCacheSanity.java:51)
>    [junit4]   1>        at org.apache.lucene.util.AbstractBeforeAfterRule$1.evaluate(AbstractBeforeAfterRule.java:46)
>    [junit4]   1>        at com.carrotsearch.randomizedtesting.rules.SystemPropertiesInvariantRule$1.evaluate(SystemPropertiesInvariantRule.java:55)
>    [junit4]   1>        at org.apache.lucene.util.TestRuleThreadAndTestName$1.evaluate(TestRuleThreadAndTestName.java:49)
>    [junit4]   1>        at org.apache.lucene.util.TestRuleIgnoreAfterMaxFailures$1.evaluate(TestRuleIgnoreAfterMaxFailures.java:70)
>    [junit4]   1>        at org.apache.lucene.util.TestRuleMarkFailure$1.evaluate(TestRuleMarkFailure.java:48)
>    [junit4]   1>        at com.carrotsearch.randomizedtesting.rules.StatementAdapter.evaluate(StatementAdapter.java:36)
>    [junit4]   1>        at com.carrotsearch.randomizedtesting.ThreadLeakControl$StatementRunner.run(ThreadLeakControl.java:358)
>    [junit4]   1>        at com.carrotsearch.randomizedtesting.ThreadLeakControl.forkTimeoutingTask(ThreadLeakControl.java:782)
>    [junit4]   1>        at com.carrotsearch.randomizedtesting.ThreadLeakControl$3.evaluate(ThreadLeakControl.java:442)
>    [junit4]   1>        at com.carrotsearch.randomizedtesting.RandomizedRunner.runSingleTest(RandomizedRunner.java:746)
>    [junit4]   1>        at com.carrotsearch.randomizedtesting.RandomizedRunner$3.evaluate(RandomizedRunner.java:648)
>    [junit4]   1>        at com.carrotsearch.randomizedtesting.RandomizedRunner$4.evaluate(RandomizedRunner.java:682)
>    [junit4]   1>        at com.carrotsearch.randomizedtesting.RandomizedRunner$5.evaluate(RandomizedRunner.java:693)
>    [junit4]   1>        at org.apache.lucene.util.AbstractBeforeAfterRule$1.evaluate(AbstractBeforeAfterRule.java:46)
>    [junit4]   1>        at org.apache.lucene.util.TestRuleStoreClassName$1.evaluate(TestRuleStoreClassName.java:42)
>    [junit4]   1>        at com.carrotsearch.randomizedtesting.rules.SystemPropertiesInvariantRule$1.evaluate(SystemPropertiesInvariantRule.java:55)
>    [junit4]   1>        at com.carrotsearch.randomizedtesting.rules.NoShadowingOrOverridesOnMethodsRule$1.evaluate(NoShadowingOrOverridesOnMethodsRule.java:39)
>    [junit4]   1>        at com.carrotsearch.randomizedtesting.rules.NoShadowingOrOverridesOnMethodsRule$1.evaluate(NoShadowingOrOverridesOnMethodsRule.java:39)
>    [junit4]   1>        at com.carrotsearch.randomizedtesting.rules.StatementAdapter.evaluate(StatementAdapter.java:36)
>    [junit4]   1>        at org.apache.lucene.util.TestRuleAssertionsRequired$1.evaluate(TestRuleAssertionsRequired.java:43)
>    [junit4]   1>        at org.apache.lucene.util.TestRuleMarkFailure$1.evaluate(TestRuleMarkFailure.java:48)
>    [junit4]   1>        at org.apache.lucene.util.TestRuleIgnoreAfterMaxFailures$1.evaluate(TestRuleIgnoreAfterMaxFailures.java:70)
>    [junit4]   1>        at org.apache.lucene.util.TestRuleIgnoreTestSuites$1.evaluate(TestRuleIgnoreTestSuites.java:55)
>    [junit4]   1>        at com.carrotsearch.randomizedtesting.rules.StatementAdapter.evaluate(StatementAdapter.java:36)
>    [junit4]   1>        at com.carrotsearch.randomizedtesting.ThreadLeakControl$StatementRunner.run(ThreadLeakControl.java:358)
>    [junit4]   1>        at java.lang.Thread.run(Thread.java:724)
>    [junit4]   1>     test: docvalues...........OK [0 docvalues fields; 0 BINARY; 0 NUMERIC; 0 SORTED; 0 SORTED_SET]
>    [junit4]   1> FAILED
>    [junit4]   1>     WARNING: fixIndex() would remove reference to this segment; full exception:
>    [junit4]   1> java.lang.RuntimeException: Term Vector test failed
>    [junit4]   1>        at org.apache.lucene.index.CheckIndex.checkIndex(CheckIndex.java:624)
>    [junit4]   1>        at org.apache.lucene.util._TestUtil.checkIndex(_TestUtil.java:223)
>    [junit4]   1>        at org.apache.lucene.store.MockDirectoryWrapper.close(MockDirectoryWrapper.java:659)
>    [junit4]   1>        at org.apache.lucene.classification.ClassificationTestBase.tearDown(ClassificationTestBase.java:70)
>    [junit4]   1>        at sun.reflect.NativeMethodAccessorImpl.invoke0(Native Method)
>    [junit4]   1>        at sun.reflect.NativeMethodAccessorImpl.invoke(NativeMethodAccessorImpl.java:57)
>    [junit4]   1>        at sun.reflect.DelegatingMethodAccessorImpl.invoke(DelegatingMethodAccessorImpl.java:43)
>    [junit4]   1>        at java.lang.reflect.Method.invoke(Method.java:606)
>    [junit4]   1>        at com.carrotsearch.randomizedtesting.RandomizedRunner.invoke(RandomizedRunner.java:1559)
>    [junit4]   1>        at com.carrotsearch.randomizedtesting.RandomizedRunner.access$600(RandomizedRunner.java:79)
>    [junit4]   1>        at com.carrotsearch.randomizedtesting.RandomizedRunner$8.evaluate(RandomizedRunner.java:795)
>    [junit4]   1>        at org.apache.lucene.util.TestRuleSetupTeardownChained$1.evaluate(TestRuleSetupTeardownChained.java:50)
>    [junit4]   1>        at org.apache.lucene.util.TestRuleFieldCacheSanity$1.evaluate(TestRuleFieldCacheSanity.java:51)
>    [junit4]   1>        at org.apache.lucene.util.AbstractBeforeAfterRule$1.evaluate(AbstractBeforeAfterRule.java:46)
>    [junit4]   1>        at com.carrotsearch.randomizedtesting.rules.SystemPropertiesInvariantRule$1.evaluate(SystemPropertiesInvariantRule.java:55)
>    [junit4]   1>        at org.apache.lucene.util.TestRuleThreadAndTestName$1.evaluate(TestRuleThreadAndTestName.java:49)
>    [junit4]   1>        at org.apache.lucene.util.TestRuleIgnoreAfterMaxFailures$1.evaluate(TestRuleIgnoreAfterMaxFailures.java:70)
>    [junit4]   1>        at org.apache.lucene.util.TestRuleMarkFailure$1.evaluate(TestRuleMarkFailure.java:48)
>    [junit4]   1>        at com.carrotsearch.randomizedtesting.rules.StatementAdapter.evaluate(StatementAdapter.java:36)
>    [junit4]   1>        at com.carrotsearch.randomizedtesting.ThreadLeakControl$StatementRunner.run(ThreadLeakControl.java:358)
>    [junit4]   1>        at com.carrotsearch.randomizedtesting.ThreadLeakControl.forkTimeoutingTask(ThreadLeakControl.java:782)
>    [junit4]   1>        at com.carrotsearch.randomizedtesting.ThreadLeakControl$3.evaluate(ThreadLeakControl.java:442)
>    [junit4]   1>        at com.carrotsearch.randomizedtesting.RandomizedRunner.runSingleTest(RandomizedRunner.java:746)
>    [junit4]   1>        at com.carrotsearch.randomizedtesting.RandomizedRunner$3.evaluate(RandomizedRunner.java:648)
>    [junit4]   1>        at com.carrotsearch.randomizedtesting.RandomizedRunner$4.evaluate(RandomizedRunner.java:682)
>    [junit4]   1>        at com.carrotsearch.randomizedtesting.RandomizedRunner$5.evaluate(RandomizedRunner.java:693)
>    [junit4]   1>        at org.apache.lucene.util.AbstractBeforeAfterRule$1.evaluate(AbstractBeforeAfterRule.java:46)
>    [junit4]   1>        at org.apache.lucene.util.TestRuleStoreClassName$1.evaluate(TestRuleStoreClassName.java:42)
>    [junit4]   1>        at com.carrotsearch.randomizedtesting.rules.SystemPropertiesInvariantRule$1.evaluate(SystemPropertiesInvariantRule.java:55)
>    [junit4]   1>        at com.carrotsearch.randomizedtesting.rules.NoShadowingOrOverridesOnMethodsRule$1.evaluate(NoShadowingOrOverridesOnMethodsRule.java:39)
>    [junit4]   1>        at com.carrotsearch.randomizedtesting.rules.NoShadowingOrOverridesOnMethodsRule$1.evaluate(NoShadowingOrOverridesOnMethodsRule.java:39)
>    [junit4]   1>        at com.carrotsearch.randomizedtesting.rules.StatementAdapter.evaluate(StatementAdapter.java:36)
>    [junit4]   1>        at org.apache.lucene.util.TestRuleAssertionsRequired$1.evaluate(TestRuleAssertionsRequired.java:43)
>    [junit4]   1>        at org.apache.lucene.util.TestRuleMarkFailure$1.evaluate(TestRuleMarkFailure.java:48)
>    [junit4]   1>        at org.apache.lucene.util.TestRuleIgnoreAfterMaxFailures$1.evaluate(TestRuleIgnoreAfterMaxFailures.java:70)
>    [junit4]   1>        at org.apache.lucene.util.TestRuleIgnoreTestSuites$1.evaluate(TestRuleIgnoreTestSuites.java:55)
>    [junit4]   1>        at com.carrotsearch.randomizedtesting.rules.StatementAdapter.evaluate(StatementAdapter.java:36)
>    [junit4]   1>        at com.carrotsearch.randomizedtesting.ThreadLeakControl$StatementRunner.run(ThreadLeakControl.java:358)
>    [junit4]   1>        at java.lang.Thread.run(Thread.java:724)
>    [junit4]   1>
>    [junit4]   1>   2 of 2: name=_1 docCount=102
>    [junit4]   1>     codec=FastDecompressionCompressingStoredFields(storedFieldsFormat=CompressingStoredFieldsFormat(compressionMode=FAST_DECOMPRESSION, chunkSize=16384), termVectorsFormat=CompressingTermVectorsFormat(compressionMode=FAST_DECOMPRESSION, chunkSize=16384))
>    [junit4]   1>     compound=true
>    [junit4]   1>     numFiles=3
>    [junit4]   1>     size (MB)=0.034
>    [junit4]   1>     diagnostics = {timestamp=1378977956167, os=Linux, os.version=3.2.0-53-generic, source=flush, lucene.version=5.0-SNAPSHOT, os.arch=amd64, java.version=1.7.0_40, java.vendor=Oracle Corporation}
>    [junit4]   1>     no deletions
>    [junit4]   1>     test: open reader.........OK
>    [junit4]   1>     test: fields..............OK [3 fields]
>    [junit4]   1>     test: field norms.........OK [3 fields]
>    [junit4]   1>     test: terms, freq, prox...OK [1297 terms; 1894 terms/docs pairs; 1912 tokens]
>    [junit4]   1>     test: stored fields.......OK [306 total field count; avg 3 fields per doc]
>    [junit4]   1>     test: term vectors........OK [306 total vector count; avg 3 term/freq vector fields per doc]
>    [junit4]   1>     test: docvalues...........OK [0 docvalues fields; 0 BINARY; 0 NUMERIC; 0 SORTED; 0 SORTED_SET]
>    [junit4]   1>
>    [junit4]   1> WARNING: 1 broken segments (containing 898 documents) detected
>    [junit4]   1>
>    [junit4]   2> NOTE: reproduce with: ant test  -Dtestcase=KNearestNeighborClassifierTest -Dtests.method=testPerformance -Dtests.seed=68F81CB00E47182B -Dtests.multiplier=3 -Dtests.slow=true -Dtests.locale=es_BO -Dtests.timezone=NST -Dtests.file.encoding=UTF-8
>    [junit4] ERROR   2.72s J0 | KNearestNeighborClassifierTest.testPerformance <<<
>    [junit4]    > Throwable #1: java.lang.RuntimeException: CheckIndex failed
>    [junit4]    >        at __randomizedtesting.SeedInfo.seed([68F81CB00E47182B:AF19EE9265F32084]:0)
>    [junit4]    >        at org.apache.lucene.util._TestUtil.checkIndex(_TestUtil.java:227)
>    [junit4]    >        at org.apache.lucene.store.MockDirectoryWrapper.close(MockDirectoryWrapper.java:659)
>    [junit4]    >        at org.apache.lucene.classification.ClassificationTestBase.tearDown(ClassificationTestBase.java:70)
>    [junit4]    >        at java.lang.Thread.run(Thread.java:724)
>    [junit4]   2> NOTE: test params are: codec=FastDecompressionCompressingStoredFields(storedFieldsFormat=CompressingStoredFieldsFormat(compressionMode=FAST_DECOMPRESSION, chunkSize=168), termVectorsFormat=CompressingTermVectorsFormat(compressionMode=FAST_DECOMPRESSION, chunkSize=168)), sim=RandomSimilarityProvider(queryNorm=true,coord=yes): {text=DFR GB1, cat=DFR I(n)B1, bool=DFR G2}, locale=es_BO, timezone=NST
>    [junit4]   2> NOTE: Linux 3.2.0-53-generic amd64/Oracle Corporation 1.7.0_40 (64-bit)/cpus=8,threads=1,free=59466608,total=131072000
>    [junit4]   2> NOTE: All tests run in this JVM: [DataSplitterTest, KNearestNeighborClassifierTest]
>    [junit4] Completed on J0 in 2.91s, 2 tests, 1 error <<< FAILURES!
>
> [...truncated 13 lines...]
> BUILD FAILED
> /mnt/ssd/jenkins/workspace/Lucene-Solr-trunk-Linux/build.xml:396: The following error occurred while executing this line:
> /mnt/ssd/jenkins/workspace/Lucene-Solr-trunk-Linux/build.xml:376: The following error occurred while executing this line:
> /mnt/ssd/jenkins/workspace/Lucene-Solr-trunk-Linux/build.xml:39: The following error occurred while executing this line:
> /mnt/ssd/jenkins/workspace/Lucene-Solr-trunk-Linux/lucene/build.xml:556: The following error occurred while executing this line:
> /mnt/ssd/jenkins/workspace/Lucene-Solr-trunk-Linux/lucene/common-build.xml:1885: The following error occurred while executing this line:
> /mnt/ssd/jenkins/workspace/Lucene-Solr-trunk-Linux/lucene/module-build.xml:61: The following error occurred while executing this line:
> /mnt/ssd/jenkins/workspace/Lucene-Solr-trunk-Linux/lucene/common-build.xml:1230: The following error occurred while executing this line:
> /mnt/ssd/jenkins/workspace/Lucene-Solr-trunk-Linux/lucene/common-build.xml:873: There were test failures: 4 suites, 10 tests, 1 error
>
> Total time: 12 minutes 29 seconds
> Build step 'Invoke Ant' marked build as failure
> Description set: Java: 64bit/jdk1.7.0_40 -XX:-UseCompressedOops -XX:+UseG1GC
> Archiving artifacts
> Recording test results
> Email was triggered for: Failure
> Sending email for trigger: Failure
>
>
>
>
> ---------------------------------------------------------------------
> To unsubscribe, e-mail: dev-unsubscribe@lucene.apache.org
> For additional commands, e-mail: dev-help@lucene.apache.org

---------------------------------------------------------------------
To unsubscribe, e-mail: dev-unsubscribe@lucene.apache.org
For additional commands, e-mail: dev-help@lucene.apache.org


[JENKINS] Lucene-Solr-trunk-Linux (64bit/jdk1.7.0_40) - Build # 7427 - Still Failing!

Posted by Policeman Jenkins Server <je...@thetaphi.de>.
Build: http://jenkins.thetaphi.de/job/Lucene-Solr-trunk-Linux/7427/
Java: 64bit/jdk1.7.0_40 -XX:-UseCompressedOops -XX:+UseG1GC

1 tests failed.
REGRESSION:  org.apache.lucene.classification.KNearestNeighborClassifierTest.testPerformance

Error Message:
CheckIndex failed

Stack Trace:
java.lang.RuntimeException: CheckIndex failed
	at __randomizedtesting.SeedInfo.seed([68F81CB00E47182B:AF19EE9265F32084]:0)
	at org.apache.lucene.util._TestUtil.checkIndex(_TestUtil.java:227)
	at org.apache.lucene.store.MockDirectoryWrapper.close(MockDirectoryWrapper.java:659)
	at org.apache.lucene.classification.ClassificationTestBase.tearDown(ClassificationTestBase.java:70)
	at sun.reflect.NativeMethodAccessorImpl.invoke0(Native Method)
	at sun.reflect.NativeMethodAccessorImpl.invoke(NativeMethodAccessorImpl.java:57)
	at sun.reflect.DelegatingMethodAccessorImpl.invoke(DelegatingMethodAccessorImpl.java:43)
	at java.lang.reflect.Method.invoke(Method.java:606)
	at com.carrotsearch.randomizedtesting.RandomizedRunner.invoke(RandomizedRunner.java:1559)
	at com.carrotsearch.randomizedtesting.RandomizedRunner.access$600(RandomizedRunner.java:79)
	at com.carrotsearch.randomizedtesting.RandomizedRunner$8.evaluate(RandomizedRunner.java:795)
	at org.apache.lucene.util.TestRuleSetupTeardownChained$1.evaluate(TestRuleSetupTeardownChained.java:50)
	at org.apache.lucene.util.TestRuleFieldCacheSanity$1.evaluate(TestRuleFieldCacheSanity.java:51)
	at org.apache.lucene.util.AbstractBeforeAfterRule$1.evaluate(AbstractBeforeAfterRule.java:46)
	at com.carrotsearch.randomizedtesting.rules.SystemPropertiesInvariantRule$1.evaluate(SystemPropertiesInvariantRule.java:55)
	at org.apache.lucene.util.TestRuleThreadAndTestName$1.evaluate(TestRuleThreadAndTestName.java:49)
	at org.apache.lucene.util.TestRuleIgnoreAfterMaxFailures$1.evaluate(TestRuleIgnoreAfterMaxFailures.java:70)
	at org.apache.lucene.util.TestRuleMarkFailure$1.evaluate(TestRuleMarkFailure.java:48)
	at com.carrotsearch.randomizedtesting.rules.StatementAdapter.evaluate(StatementAdapter.java:36)
	at com.carrotsearch.randomizedtesting.ThreadLeakControl$StatementRunner.run(ThreadLeakControl.java:358)
	at com.carrotsearch.randomizedtesting.ThreadLeakControl.forkTimeoutingTask(ThreadLeakControl.java:782)
	at com.carrotsearch.randomizedtesting.ThreadLeakControl$3.evaluate(ThreadLeakControl.java:442)
	at com.carrotsearch.randomizedtesting.RandomizedRunner.runSingleTest(RandomizedRunner.java:746)
	at com.carrotsearch.randomizedtesting.RandomizedRunner$3.evaluate(RandomizedRunner.java:648)
	at com.carrotsearch.randomizedtesting.RandomizedRunner$4.evaluate(RandomizedRunner.java:682)
	at com.carrotsearch.randomizedtesting.RandomizedRunner$5.evaluate(RandomizedRunner.java:693)
	at org.apache.lucene.util.AbstractBeforeAfterRule$1.evaluate(AbstractBeforeAfterRule.java:46)
	at org.apache.lucene.util.TestRuleStoreClassName$1.evaluate(TestRuleStoreClassName.java:42)
	at com.carrotsearch.randomizedtesting.rules.SystemPropertiesInvariantRule$1.evaluate(SystemPropertiesInvariantRule.java:55)
	at com.carrotsearch.randomizedtesting.rules.NoShadowingOrOverridesOnMethodsRule$1.evaluate(NoShadowingOrOverridesOnMethodsRule.java:39)
	at com.carrotsearch.randomizedtesting.rules.NoShadowingOrOverridesOnMethodsRule$1.evaluate(NoShadowingOrOverridesOnMethodsRule.java:39)
	at com.carrotsearch.randomizedtesting.rules.StatementAdapter.evaluate(StatementAdapter.java:36)
	at org.apache.lucene.util.TestRuleAssertionsRequired$1.evaluate(TestRuleAssertionsRequired.java:43)
	at org.apache.lucene.util.TestRuleMarkFailure$1.evaluate(TestRuleMarkFailure.java:48)
	at org.apache.lucene.util.TestRuleIgnoreAfterMaxFailures$1.evaluate(TestRuleIgnoreAfterMaxFailures.java:70)
	at org.apache.lucene.util.TestRuleIgnoreTestSuites$1.evaluate(TestRuleIgnoreTestSuites.java:55)
	at com.carrotsearch.randomizedtesting.rules.StatementAdapter.evaluate(StatementAdapter.java:36)
	at com.carrotsearch.randomizedtesting.ThreadLeakControl$StatementRunner.run(ThreadLeakControl.java:358)
	at java.lang.Thread.run(Thread.java:724)




Build Log:
[...truncated 6618 lines...]
   [junit4] Suite: org.apache.lucene.classification.KNearestNeighborClassifierTest
   [junit4]   1> CheckIndex failed
   [junit4]   1> Segments file=segments_3 numSegments=2 version=5.0 format=
   [junit4]   1>   1 of 2: name=_0 docCount=898
   [junit4]   1>     codec=FastDecompressionCompressingStoredFields(storedFieldsFormat=CompressingStoredFieldsFormat(compressionMode=FAST_DECOMPRESSION, chunkSize=16384), termVectorsFormat=CompressingTermVectorsFormat(compressionMode=FAST_DECOMPRESSION, chunkSize=16384))
   [junit4]   1>     compound=true
   [junit4]   1>     numFiles=3
   [junit4]   1>     size (MB)=0.283
   [junit4]   1>     diagnostics = {timestamp=1378977956101, os=Linux, os.version=3.2.0-53-generic, source=flush, lucene.version=5.0-SNAPSHOT, os.arch=amd64, java.version=1.7.0_40, java.vendor=Oracle Corporation}
   [junit4]   1>     no deletions
   [junit4]   1>     test: open reader.........OK
   [junit4]   1>     test: fields..............OK [3 fields]
   [junit4]   1>     test: field norms.........OK [3 fields]
   [junit4]   1>     test: terms, freq, prox...OK [9449 terms; 16456 terms/docs pairs; 16648 tokens]
   [junit4]   1>     test: stored fields.......OK [2694 total field count; avg 3 fields per doc]
   [junit4]   1>     test: term vectors........ERROR [2]
   [junit4]   1> java.lang.ArrayIndexOutOfBoundsException: 2
   [junit4]   1> 	at org.apache.lucene.codecs.compressing.CompressingTermVectorsReader.get(CompressingTermVectorsReader.java:393)
   [junit4]   1> 	at org.apache.lucene.index.SegmentReader.getTermVectors(SegmentReader.java:169)
   [junit4]   1> 	at org.apache.lucene.index.CheckIndex.testTermVectors(CheckIndex.java:1524)
   [junit4]   1> 	at org.apache.lucene.index.CheckIndex.checkIndex(CheckIndex.java:611)
   [junit4]   1> 	at org.apache.lucene.util._TestUtil.checkIndex(_TestUtil.java:223)
   [junit4]   1> 	at org.apache.lucene.store.MockDirectoryWrapper.close(MockDirectoryWrapper.java:659)
   [junit4]   1> 	at org.apache.lucene.classification.ClassificationTestBase.tearDown(ClassificationTestBase.java:70)
   [junit4]   1> 	at sun.reflect.NativeMethodAccessorImpl.invoke0(Native Method)
   [junit4]   1> 	at sun.reflect.NativeMethodAccessorImpl.invoke(NativeMethodAccessorImpl.java:57)
   [junit4]   1> 	at sun.reflect.DelegatingMethodAccessorImpl.invoke(DelegatingMethodAccessorImpl.java:43)
   [junit4]   1> 	at java.lang.reflect.Method.invoke(Method.java:606)
   [junit4]   1> 	at com.carrotsearch.randomizedtesting.RandomizedRunner.invoke(RandomizedRunner.java:1559)
   [junit4]   1> 	at com.carrotsearch.randomizedtesting.RandomizedRunner.access$600(RandomizedRunner.java:79)
   [junit4]   1> 	at com.carrotsearch.randomizedtesting.RandomizedRunner$8.evaluate(RandomizedRunner.java:795)
   [junit4]   1> 	at org.apache.lucene.util.TestRuleSetupTeardownChained$1.evaluate(TestRuleSetupTeardownChained.java:50)
   [junit4]   1> 	at org.apache.lucene.util.TestRuleFieldCacheSanity$1.evaluate(TestRuleFieldCacheSanity.java:51)
   [junit4]   1> 	at org.apache.lucene.util.AbstractBeforeAfterRule$1.evaluate(AbstractBeforeAfterRule.java:46)
   [junit4]   1> 	at com.carrotsearch.randomizedtesting.rules.SystemPropertiesInvariantRule$1.evaluate(SystemPropertiesInvariantRule.java:55)
   [junit4]   1> 	at org.apache.lucene.util.TestRuleThreadAndTestName$1.evaluate(TestRuleThreadAndTestName.java:49)
   [junit4]   1> 	at org.apache.lucene.util.TestRuleIgnoreAfterMaxFailures$1.evaluate(TestRuleIgnoreAfterMaxFailures.java:70)
   [junit4]   1> 	at org.apache.lucene.util.TestRuleMarkFailure$1.evaluate(TestRuleMarkFailure.java:48)
   [junit4]   1> 	at com.carrotsearch.randomizedtesting.rules.StatementAdapter.evaluate(StatementAdapter.java:36)
   [junit4]   1> 	at com.carrotsearch.randomizedtesting.ThreadLeakControl$StatementRunner.run(ThreadLeakControl.java:358)
   [junit4]   1> 	at com.carrotsearch.randomizedtesting.ThreadLeakControl.forkTimeoutingTask(ThreadLeakControl.java:782)
   [junit4]   1> 	at com.carrotsearch.randomizedtesting.ThreadLeakControl$3.evaluate(ThreadLeakControl.java:442)
   [junit4]   1> 	at com.carrotsearch.randomizedtesting.RandomizedRunner.runSingleTest(RandomizedRunner.java:746)
   [junit4]   1> 	at com.carrotsearch.randomizedtesting.RandomizedRunner$3.evaluate(RandomizedRunner.java:648)
   [junit4]   1> 	at com.carrotsearch.randomizedtesting.RandomizedRunner$4.evaluate(RandomizedRunner.java:682)
   [junit4]   1> 	at com.carrotsearch.randomizedtesting.RandomizedRunner$5.evaluate(RandomizedRunner.java:693)
   [junit4]   1> 	at org.apache.lucene.util.AbstractBeforeAfterRule$1.evaluate(AbstractBeforeAfterRule.java:46)
   [junit4]   1> 	at org.apache.lucene.util.TestRuleStoreClassName$1.evaluate(TestRuleStoreClassName.java:42)
   [junit4]   1> 	at com.carrotsearch.randomizedtesting.rules.SystemPropertiesInvariantRule$1.evaluate(SystemPropertiesInvariantRule.java:55)
   [junit4]   1> 	at com.carrotsearch.randomizedtesting.rules.NoShadowingOrOverridesOnMethodsRule$1.evaluate(NoShadowingOrOverridesOnMethodsRule.java:39)
   [junit4]   1> 	at com.carrotsearch.randomizedtesting.rules.NoShadowingOrOverridesOnMethodsRule$1.evaluate(NoShadowingOrOverridesOnMethodsRule.java:39)
   [junit4]   1> 	at com.carrotsearch.randomizedtesting.rules.StatementAdapter.evaluate(StatementAdapter.java:36)
   [junit4]   1> 	at org.apache.lucene.util.TestRuleAssertionsRequired$1.evaluate(TestRuleAssertionsRequired.java:43)
   [junit4]   1> 	at org.apache.lucene.util.TestRuleMarkFailure$1.evaluate(TestRuleMarkFailure.java:48)
   [junit4]   1> 	at org.apache.lucene.util.TestRuleIgnoreAfterMaxFailures$1.evaluate(TestRuleIgnoreAfterMaxFailures.java:70)
   [junit4]   1> 	at org.apache.lucene.util.TestRuleIgnoreTestSuites$1.evaluate(TestRuleIgnoreTestSuites.java:55)
   [junit4]   1> 	at com.carrotsearch.randomizedtesting.rules.StatementAdapter.evaluate(StatementAdapter.java:36)
   [junit4]   1> 	at com.carrotsearch.randomizedtesting.ThreadLeakControl$StatementRunner.run(ThreadLeakControl.java:358)
   [junit4]   1> 	at java.lang.Thread.run(Thread.java:724)
   [junit4]   1>     test: docvalues...........OK [0 docvalues fields; 0 BINARY; 0 NUMERIC; 0 SORTED; 0 SORTED_SET]
   [junit4]   1> FAILED
   [junit4]   1>     WARNING: fixIndex() would remove reference to this segment; full exception:
   [junit4]   1> java.lang.RuntimeException: Term Vector test failed
   [junit4]   1> 	at org.apache.lucene.index.CheckIndex.checkIndex(CheckIndex.java:624)
   [junit4]   1> 	at org.apache.lucene.util._TestUtil.checkIndex(_TestUtil.java:223)
   [junit4]   1> 	at org.apache.lucene.store.MockDirectoryWrapper.close(MockDirectoryWrapper.java:659)
   [junit4]   1> 	at org.apache.lucene.classification.ClassificationTestBase.tearDown(ClassificationTestBase.java:70)
   [junit4]   1> 	at sun.reflect.NativeMethodAccessorImpl.invoke0(Native Method)
   [junit4]   1> 	at sun.reflect.NativeMethodAccessorImpl.invoke(NativeMethodAccessorImpl.java:57)
   [junit4]   1> 	at sun.reflect.DelegatingMethodAccessorImpl.invoke(DelegatingMethodAccessorImpl.java:43)
   [junit4]   1> 	at java.lang.reflect.Method.invoke(Method.java:606)
   [junit4]   1> 	at com.carrotsearch.randomizedtesting.RandomizedRunner.invoke(RandomizedRunner.java:1559)
   [junit4]   1> 	at com.carrotsearch.randomizedtesting.RandomizedRunner.access$600(RandomizedRunner.java:79)
   [junit4]   1> 	at com.carrotsearch.randomizedtesting.RandomizedRunner$8.evaluate(RandomizedRunner.java:795)
   [junit4]   1> 	at org.apache.lucene.util.TestRuleSetupTeardownChained$1.evaluate(TestRuleSetupTeardownChained.java:50)
   [junit4]   1> 	at org.apache.lucene.util.TestRuleFieldCacheSanity$1.evaluate(TestRuleFieldCacheSanity.java:51)
   [junit4]   1> 	at org.apache.lucene.util.AbstractBeforeAfterRule$1.evaluate(AbstractBeforeAfterRule.java:46)
   [junit4]   1> 	at com.carrotsearch.randomizedtesting.rules.SystemPropertiesInvariantRule$1.evaluate(SystemPropertiesInvariantRule.java:55)
   [junit4]   1> 	at org.apache.lucene.util.TestRuleThreadAndTestName$1.evaluate(TestRuleThreadAndTestName.java:49)
   [junit4]   1> 	at org.apache.lucene.util.TestRuleIgnoreAfterMaxFailures$1.evaluate(TestRuleIgnoreAfterMaxFailures.java:70)
   [junit4]   1> 	at org.apache.lucene.util.TestRuleMarkFailure$1.evaluate(TestRuleMarkFailure.java:48)
   [junit4]   1> 	at com.carrotsearch.randomizedtesting.rules.StatementAdapter.evaluate(StatementAdapter.java:36)
   [junit4]   1> 	at com.carrotsearch.randomizedtesting.ThreadLeakControl$StatementRunner.run(ThreadLeakControl.java:358)
   [junit4]   1> 	at com.carrotsearch.randomizedtesting.ThreadLeakControl.forkTimeoutingTask(ThreadLeakControl.java:782)
   [junit4]   1> 	at com.carrotsearch.randomizedtesting.ThreadLeakControl$3.evaluate(ThreadLeakControl.java:442)
   [junit4]   1> 	at com.carrotsearch.randomizedtesting.RandomizedRunner.runSingleTest(RandomizedRunner.java:746)
   [junit4]   1> 	at com.carrotsearch.randomizedtesting.RandomizedRunner$3.evaluate(RandomizedRunner.java:648)
   [junit4]   1> 	at com.carrotsearch.randomizedtesting.RandomizedRunner$4.evaluate(RandomizedRunner.java:682)
   [junit4]   1> 	at com.carrotsearch.randomizedtesting.RandomizedRunner$5.evaluate(RandomizedRunner.java:693)
   [junit4]   1> 	at org.apache.lucene.util.AbstractBeforeAfterRule$1.evaluate(AbstractBeforeAfterRule.java:46)
   [junit4]   1> 	at org.apache.lucene.util.TestRuleStoreClassName$1.evaluate(TestRuleStoreClassName.java:42)
   [junit4]   1> 	at com.carrotsearch.randomizedtesting.rules.SystemPropertiesInvariantRule$1.evaluate(SystemPropertiesInvariantRule.java:55)
   [junit4]   1> 	at com.carrotsearch.randomizedtesting.rules.NoShadowingOrOverridesOnMethodsRule$1.evaluate(NoShadowingOrOverridesOnMethodsRule.java:39)
   [junit4]   1> 	at com.carrotsearch.randomizedtesting.rules.NoShadowingOrOverridesOnMethodsRule$1.evaluate(NoShadowingOrOverridesOnMethodsRule.java:39)
   [junit4]   1> 	at com.carrotsearch.randomizedtesting.rules.StatementAdapter.evaluate(StatementAdapter.java:36)
   [junit4]   1> 	at org.apache.lucene.util.TestRuleAssertionsRequired$1.evaluate(TestRuleAssertionsRequired.java:43)
   [junit4]   1> 	at org.apache.lucene.util.TestRuleMarkFailure$1.evaluate(TestRuleMarkFailure.java:48)
   [junit4]   1> 	at org.apache.lucene.util.TestRuleIgnoreAfterMaxFailures$1.evaluate(TestRuleIgnoreAfterMaxFailures.java:70)
   [junit4]   1> 	at org.apache.lucene.util.TestRuleIgnoreTestSuites$1.evaluate(TestRuleIgnoreTestSuites.java:55)
   [junit4]   1> 	at com.carrotsearch.randomizedtesting.rules.StatementAdapter.evaluate(StatementAdapter.java:36)
   [junit4]   1> 	at com.carrotsearch.randomizedtesting.ThreadLeakControl$StatementRunner.run(ThreadLeakControl.java:358)
   [junit4]   1> 	at java.lang.Thread.run(Thread.java:724)
   [junit4]   1> 
   [junit4]   1>   2 of 2: name=_1 docCount=102
   [junit4]   1>     codec=FastDecompressionCompressingStoredFields(storedFieldsFormat=CompressingStoredFieldsFormat(compressionMode=FAST_DECOMPRESSION, chunkSize=16384), termVectorsFormat=CompressingTermVectorsFormat(compressionMode=FAST_DECOMPRESSION, chunkSize=16384))
   [junit4]   1>     compound=true
   [junit4]   1>     numFiles=3
   [junit4]   1>     size (MB)=0.034
   [junit4]   1>     diagnostics = {timestamp=1378977956167, os=Linux, os.version=3.2.0-53-generic, source=flush, lucene.version=5.0-SNAPSHOT, os.arch=amd64, java.version=1.7.0_40, java.vendor=Oracle Corporation}
   [junit4]   1>     no deletions
   [junit4]   1>     test: open reader.........OK
   [junit4]   1>     test: fields..............OK [3 fields]
   [junit4]   1>     test: field norms.........OK [3 fields]
   [junit4]   1>     test: terms, freq, prox...OK [1297 terms; 1894 terms/docs pairs; 1912 tokens]
   [junit4]   1>     test: stored fields.......OK [306 total field count; avg 3 fields per doc]
   [junit4]   1>     test: term vectors........OK [306 total vector count; avg 3 term/freq vector fields per doc]
   [junit4]   1>     test: docvalues...........OK [0 docvalues fields; 0 BINARY; 0 NUMERIC; 0 SORTED; 0 SORTED_SET]
   [junit4]   1> 
   [junit4]   1> WARNING: 1 broken segments (containing 898 documents) detected
   [junit4]   1> 
   [junit4]   2> NOTE: reproduce with: ant test  -Dtestcase=KNearestNeighborClassifierTest -Dtests.method=testPerformance -Dtests.seed=68F81CB00E47182B -Dtests.multiplier=3 -Dtests.slow=true -Dtests.locale=es_BO -Dtests.timezone=NST -Dtests.file.encoding=UTF-8
   [junit4] ERROR   2.72s J0 | KNearestNeighborClassifierTest.testPerformance <<<
   [junit4]    > Throwable #1: java.lang.RuntimeException: CheckIndex failed
   [junit4]    > 	at __randomizedtesting.SeedInfo.seed([68F81CB00E47182B:AF19EE9265F32084]:0)
   [junit4]    > 	at org.apache.lucene.util._TestUtil.checkIndex(_TestUtil.java:227)
   [junit4]    > 	at org.apache.lucene.store.MockDirectoryWrapper.close(MockDirectoryWrapper.java:659)
   [junit4]    > 	at org.apache.lucene.classification.ClassificationTestBase.tearDown(ClassificationTestBase.java:70)
   [junit4]    > 	at java.lang.Thread.run(Thread.java:724)
   [junit4]   2> NOTE: test params are: codec=FastDecompressionCompressingStoredFields(storedFieldsFormat=CompressingStoredFieldsFormat(compressionMode=FAST_DECOMPRESSION, chunkSize=168), termVectorsFormat=CompressingTermVectorsFormat(compressionMode=FAST_DECOMPRESSION, chunkSize=168)), sim=RandomSimilarityProvider(queryNorm=true,coord=yes): {text=DFR GB1, cat=DFR I(n)B1, bool=DFR G2}, locale=es_BO, timezone=NST
   [junit4]   2> NOTE: Linux 3.2.0-53-generic amd64/Oracle Corporation 1.7.0_40 (64-bit)/cpus=8,threads=1,free=59466608,total=131072000
   [junit4]   2> NOTE: All tests run in this JVM: [DataSplitterTest, KNearestNeighborClassifierTest]
   [junit4] Completed on J0 in 2.91s, 2 tests, 1 error <<< FAILURES!

[...truncated 13 lines...]
BUILD FAILED
/mnt/ssd/jenkins/workspace/Lucene-Solr-trunk-Linux/build.xml:396: The following error occurred while executing this line:
/mnt/ssd/jenkins/workspace/Lucene-Solr-trunk-Linux/build.xml:376: The following error occurred while executing this line:
/mnt/ssd/jenkins/workspace/Lucene-Solr-trunk-Linux/build.xml:39: The following error occurred while executing this line:
/mnt/ssd/jenkins/workspace/Lucene-Solr-trunk-Linux/lucene/build.xml:556: The following error occurred while executing this line:
/mnt/ssd/jenkins/workspace/Lucene-Solr-trunk-Linux/lucene/common-build.xml:1885: The following error occurred while executing this line:
/mnt/ssd/jenkins/workspace/Lucene-Solr-trunk-Linux/lucene/module-build.xml:61: The following error occurred while executing this line:
/mnt/ssd/jenkins/workspace/Lucene-Solr-trunk-Linux/lucene/common-build.xml:1230: The following error occurred while executing this line:
/mnt/ssd/jenkins/workspace/Lucene-Solr-trunk-Linux/lucene/common-build.xml:873: There were test failures: 4 suites, 10 tests, 1 error

Total time: 12 minutes 29 seconds
Build step 'Invoke Ant' marked build as failure
Description set: Java: 64bit/jdk1.7.0_40 -XX:-UseCompressedOops -XX:+UseG1GC
Archiving artifacts
Recording test results
Email was triggered for: Failure
Sending email for trigger: Failure