You are viewing a plain text version of this content. The canonical link for it is here.
Posted to yarn-dev@hadoop.apache.org by Apache Jenkins Server <je...@builds.apache.org> on 2015/04/01 00:15:36 UTC
Failed: YARN-3318 PreCommit Build #7175
Jira: https://issues.apache.org/jira/browse/YARN-3318
Build: https://builds.apache.org/job/PreCommit-YARN-Build/7175/
###################################################################################
########################## LAST 60 LINES OF THE CONSOLE ###########################
[...truncated 4626 lines...]
http://issues.apache.org/jira/secure/attachment/12708491/YARN-3318.36.patch
against trunk revision 79f7f2a.
{color:green}+1 @author{color}. The patch does not contain any @author tags.
{color:green}+1 tests included{color}. The patch appears to include 9 new or modified test files.
{color:red}-1 javac{color}. The applied patch generated 1149 javac compiler warnings (more than the trunk's current 1148 warnings).
{color:green}+1 javadoc{color}. There were no new javadoc warning messages.
{color:green}+1 eclipse:eclipse{color}. The patch built with eclipse:eclipse.
{color:green}+1 findbugs{color}. The patch does not introduce any new Findbugs (version 2.0.3) warnings.
{color:green}+1 release audit{color}. The applied patch does not increase the total number of release audit warnings.
{color:red}-1 core tests{color}. The patch failed these unit tests in hadoop-yarn-project/hadoop-yarn/hadoop-yarn-api hadoop-yarn-project/hadoop-yarn/hadoop-yarn-client hadoop-yarn-project/hadoop-yarn/hadoop-yarn-common hadoop-yarn-project/hadoop-yarn/hadoop-yarn-server/hadoop-yarn-server-resourcemanager:
org.apache.hadoop.yarn.server.resourcemanager.TestRM
Test results: https://builds.apache.org/job/PreCommit-YARN-Build/7175//testReport/
Javac warnings: https://builds.apache.org/job/PreCommit-YARN-Build/7175//artifact/patchprocess/diffJavacWarnings.txt
Console output: https://builds.apache.org/job/PreCommit-YARN-Build/7175//console
This message is automatically generated.
======================================================================
======================================================================
Adding comment to Jira.
======================================================================
======================================================================
Comment added.
9fc9bdd01eb3813934146a95807290645dc30661 logged out
======================================================================
======================================================================
Finished build.
======================================================================
======================================================================
Build step 'Execute shell' marked build as failure
Archiving artifacts
Sending artifact delta relative to PreCommit-YARN-Build #7173
Archived 31 artifacts
Archive block size is 32768
Received 54 blocks and 8118876 bytes
Compression is 17.9%
Took 2.7 sec
[description-setter] Could not determine description.
Recording test results
Publish JUnit test result report is waiting for a checkpoint on PreCommit-YARN-Build #7174
Email was triggered for: Failure
Sending email for trigger: Failure
###################################################################################
############################## FAILED TESTS (if any) ##############################
1 tests failed.
FAILED: org.apache.hadoop.yarn.server.resourcemanager.TestRM.testAppOnMultiNode[1]
Error Message:
test timed out after 30000 milliseconds
Stack Trace:
java.lang.Exception: test timed out after 30000 milliseconds
at java.lang.Thread.sleep(Native Method)
at org.apache.hadoop.yarn.server.resourcemanager.TestRM.testAppOnMultiNode(TestRM.java:192)