You are viewing a plain text version of this content. The canonical link for it is here.
Posted to dev@lucene.apache.org by Policeman Jenkins Server <je...@thetaphi.de> on 2016/06/17 13:55:42 UTC

[JENKINS-EA] Lucene-Solr-6.x-Linux (32bit/jdk-9-ea+122) - Build # 908 - Failure!

Build: http://jenkins.thetaphi.de/job/Lucene-Solr-6.x-Linux/908/
Java: 32bit/jdk-9-ea+122 -server -XX:+UseConcMarkSweepGC

1 tests failed.
FAILED:  org.apache.solr.handler.TestReqParamsAPI.test

Error Message:
Could not get expected value  'f' for path 'params/fixed' full output: {   "responseHeader":{     "status":0,     "QTime":0},   "params":{     "add":"second",     "a":"A val",     "fixed":"changeit",     "b":"B val",     "wt":"json"},   "context":{     "webapp":"",     "path":"/dump1",     "httpMethod":"GET"}},  from server:  https://127.0.0.1:36231/collection1

Stack Trace:
java.lang.AssertionError: Could not get expected value  'f' for path 'params/fixed' full output: {
  "responseHeader":{
    "status":0,
    "QTime":0},
  "params":{
    "add":"second",
    "a":"A val",
    "fixed":"changeit",
    "b":"B val",
    "wt":"json"},
  "context":{
    "webapp":"",
    "path":"/dump1",
    "httpMethod":"GET"}},  from server:  https://127.0.0.1:36231/collection1
	at __randomizedtesting.SeedInfo.seed([79BE3FF9B8578C12:F1EA002316ABE1EA]:0)
	at org.junit.Assert.fail(Assert.java:93)
	at org.junit.Assert.assertTrue(Assert.java:43)
	at org.apache.solr.core.TestSolrConfigHandler.testForResponseElement(TestSolrConfigHandler.java:481)
	at org.apache.solr.handler.TestReqParamsAPI.testReqParams(TestReqParamsAPI.java:241)
	at org.apache.solr.handler.TestReqParamsAPI.test(TestReqParamsAPI.java:61)
	at jdk.internal.reflect.NativeMethodAccessorImpl.invoke0(java.base@9-ea/Native Method)
	at jdk.internal.reflect.NativeMethodAccessorImpl.invoke(java.base@9-ea/NativeMethodAccessorImpl.java:62)
	at jdk.internal.reflect.DelegatingMethodAccessorImpl.invoke(java.base@9-ea/DelegatingMethodAccessorImpl.java:43)
	at java.lang.reflect.Method.invoke(java.base@9-ea/Method.java:531)
	at com.carrotsearch.randomizedtesting.RandomizedRunner.invoke(RandomizedRunner.java:1764)
	at com.carrotsearch.randomizedtesting.RandomizedRunner$8.evaluate(RandomizedRunner.java:871)
	at com.carrotsearch.randomizedtesting.RandomizedRunner$9.evaluate(RandomizedRunner.java:907)
	at com.carrotsearch.randomizedtesting.RandomizedRunner$10.evaluate(RandomizedRunner.java:921)
	at org.apache.solr.BaseDistributedSearchTestCase$ShardsRepeatRule$ShardsFixedStatement.callStatement(BaseDistributedSearchTestCase.java:992)
	at org.apache.solr.BaseDistributedSearchTestCase$ShardsRepeatRule$ShardsStatement.evaluate(BaseDistributedSearchTestCase.java:967)
	at com.carrotsearch.randomizedtesting.rules.SystemPropertiesRestoreRule$1.evaluate(SystemPropertiesRestoreRule.java:57)
	at org.apache.lucene.util.TestRuleSetupTeardownChained$1.evaluate(TestRuleSetupTeardownChained.java:49)
	at org.apache.lucene.util.AbstractBeforeAfterRule$1.evaluate(AbstractBeforeAfterRule.java:45)
	at org.apache.lucene.util.TestRuleThreadAndTestName$1.evaluate(TestRuleThreadAndTestName.java:48)
	at org.apache.lucene.util.TestRuleIgnoreAfterMaxFailures$1.evaluate(TestRuleIgnoreAfterMaxFailures.java:64)
	at org.apache.lucene.util.TestRuleMarkFailure$1.evaluate(TestRuleMarkFailure.java:47)
	at com.carrotsearch.randomizedtesting.rules.StatementAdapter.evaluate(StatementAdapter.java:36)
	at com.carrotsearch.randomizedtesting.ThreadLeakControl$StatementRunner.run(ThreadLeakControl.java:367)
	at com.carrotsearch.randomizedtesting.ThreadLeakControl.forkTimeoutingTask(ThreadLeakControl.java:809)
	at com.carrotsearch.randomizedtesting.ThreadLeakControl$3.evaluate(ThreadLeakControl.java:460)
	at com.carrotsearch.randomizedtesting.RandomizedRunner.runSingleTest(RandomizedRunner.java:880)
	at com.carrotsearch.randomizedtesting.RandomizedRunner$5.evaluate(RandomizedRunner.java:781)
	at com.carrotsearch.randomizedtesting.RandomizedRunner$6.evaluate(RandomizedRunner.java:816)
	at com.carrotsearch.randomizedtesting.RandomizedRunner$7.evaluate(RandomizedRunner.java:827)
	at com.carrotsearch.randomizedtesting.rules.StatementAdapter.evaluate(StatementAdapter.java:36)
	at com.carrotsearch.randomizedtesting.rules.SystemPropertiesRestoreRule$1.evaluate(SystemPropertiesRestoreRule.java:57)
	at org.apache.lucene.util.AbstractBeforeAfterRule$1.evaluate(AbstractBeforeAfterRule.java:45)
	at com.carrotsearch.randomizedtesting.rules.StatementAdapter.evaluate(StatementAdapter.java:36)
	at org.apache.lucene.util.TestRuleStoreClassName$1.evaluate(TestRuleStoreClassName.java:41)
	at com.carrotsearch.randomizedtesting.rules.NoShadowingOrOverridesOnMethodsRule$1.evaluate(NoShadowingOrOverridesOnMethodsRule.java:40)
	at com.carrotsearch.randomizedtesting.rules.NoShadowingOrOverridesOnMethodsRule$1.evaluate(NoShadowingOrOverridesOnMethodsRule.java:40)
	at com.carrotsearch.randomizedtesting.rules.StatementAdapter.evaluate(StatementAdapter.java:36)
	at com.carrotsearch.randomizedtesting.rules.StatementAdapter.evaluate(StatementAdapter.java:36)
	at com.carrotsearch.randomizedtesting.rules.StatementAdapter.evaluate(StatementAdapter.java:36)
	at org.apache.lucene.util.TestRuleAssertionsRequired$1.evaluate(TestRuleAssertionsRequired.java:53)
	at org.apache.lucene.util.TestRuleMarkFailure$1.evaluate(TestRuleMarkFailure.java:47)
	at org.apache.lucene.util.TestRuleIgnoreAfterMaxFailures$1.evaluate(TestRuleIgnoreAfterMaxFailures.java:64)
	at org.apache.lucene.util.TestRuleIgnoreTestSuites$1.evaluate(TestRuleIgnoreTestSuites.java:54)
	at com.carrotsearch.randomizedtesting.rules.StatementAdapter.evaluate(StatementAdapter.java:36)
	at com.carrotsearch.randomizedtesting.ThreadLeakControl$StatementRunner.run(ThreadLeakControl.java:367)
	at java.lang.Thread.run(java.base@9-ea/Thread.java:843)




Build Log:
[...truncated 12228 lines...]
   [junit4] Suite: org.apache.solr.handler.TestReqParamsAPI
   [junit4]   2> Creating dataDir: /home/jenkins/workspace/Lucene-Solr-6.x-Linux/solr/build/solr-core/test/J1/temp/solr.handler.TestReqParamsAPI_79BE3FF9B8578C12-001/init-core-data-001
   [junit4]   2> 2173522 INFO  (SUITE-TestReqParamsAPI-seed#[79BE3FF9B8578C12]-worker) [    ] o.a.s.SolrTestCaseJ4 Randomized ssl (true) and clientAuth (true) via: @org.apache.solr.util.RandomizeSSL(reason=, ssl=NaN, value=NaN, clientAuth=NaN)
   [junit4]   2> 2173522 INFO  (SUITE-TestReqParamsAPI-seed#[79BE3FF9B8578C12]-worker) [    ] o.a.s.BaseDistributedSearchTestCase Setting hostContext system property: /
   [junit4]   2> 2173524 INFO  (TEST-TestReqParamsAPI.test-seed#[79BE3FF9B8578C12]) [    ] o.a.s.c.ZkTestServer STARTING ZK TEST SERVER
   [junit4]   2> 2173524 INFO  (Thread-3923) [    ] o.a.s.c.ZkTestServer client port:0.0.0.0/0.0.0.0:0
   [junit4]   2> 2173524 INFO  (Thread-3923) [    ] o.a.s.c.ZkTestServer Starting server
   [junit4]   2> 2173624 INFO  (TEST-TestReqParamsAPI.test-seed#[79BE3FF9B8578C12]) [    ] o.a.s.c.ZkTestServer start zk server on port:41331
   [junit4]   2> 2173624 INFO  (TEST-TestReqParamsAPI.test-seed#[79BE3FF9B8578C12]) [    ] o.a.s.c.c.SolrZkClient Using default ZkCredentialsProvider
   [junit4]   2> 2173625 INFO  (TEST-TestReqParamsAPI.test-seed#[79BE3FF9B8578C12]) [    ] o.a.s.c.c.ConnectionManager Waiting for client to connect to ZooKeeper
   [junit4]   2> 2173626 INFO  (zkCallback-2596-thread-1) [    ] o.a.s.c.c.ConnectionManager Watcher org.apache.solr.common.cloud.ConnectionManager@1768ac9 name:ZooKeeperConnection Watcher:127.0.0.1:41331 got event WatchedEvent state:SyncConnected type:None path:null path:null type:None
   [junit4]   2> 2173626 INFO  (TEST-TestReqParamsAPI.test-seed#[79BE3FF9B8578C12]) [    ] o.a.s.c.c.ConnectionManager Client is connected to ZooKeeper
   [junit4]   2> 2173626 INFO  (TEST-TestReqParamsAPI.test-seed#[79BE3FF9B8578C12]) [    ] o.a.s.c.c.SolrZkClient Using default ZkACLProvider
   [junit4]   2> 2173627 INFO  (TEST-TestReqParamsAPI.test-seed#[79BE3FF9B8578C12]) [    ] o.a.s.c.c.SolrZkClient makePath: /solr
   [junit4]   2> 2173627 INFO  (TEST-TestReqParamsAPI.test-seed#[79BE3FF9B8578C12]) [    ] o.a.s.c.c.SolrZkClient Using default ZkCredentialsProvider
   [junit4]   2> 2173628 INFO  (TEST-TestReqParamsAPI.test-seed#[79BE3FF9B8578C12]) [    ] o.a.s.c.c.ConnectionManager Waiting for client to connect to ZooKeeper
   [junit4]   2> 2173628 INFO  (zkCallback-2597-thread-1) [    ] o.a.s.c.c.ConnectionManager Watcher org.apache.solr.common.cloud.ConnectionManager@1470062 name:ZooKeeperConnection Watcher:127.0.0.1:41331/solr got event WatchedEvent state:SyncConnected type:None path:null path:null type:None
   [junit4]   2> 2173628 INFO  (TEST-TestReqParamsAPI.test-seed#[79BE3FF9B8578C12]) [    ] o.a.s.c.c.ConnectionManager Client is connected to ZooKeeper
   [junit4]   2> 2173628 INFO  (TEST-TestReqParamsAPI.test-seed#[79BE3FF9B8578C12]) [    ] o.a.s.c.c.SolrZkClient Using default ZkACLProvider
   [junit4]   2> 2173629 INFO  (TEST-TestReqParamsAPI.test-seed#[79BE3FF9B8578C12]) [    ] o.a.s.c.c.SolrZkClient makePath: /collections/collection1
   [junit4]   2> 2173630 INFO  (TEST-TestReqParamsAPI.test-seed#[79BE3FF9B8578C12]) [    ] o.a.s.c.c.SolrZkClient makePath: /collections/collection1/shards
   [junit4]   2> 2173630 INFO  (TEST-TestReqParamsAPI.test-seed#[79BE3FF9B8578C12]) [    ] o.a.s.c.c.SolrZkClient makePath: /collections/control_collection
   [junit4]   2> 2173631 INFO  (TEST-TestReqParamsAPI.test-seed#[79BE3FF9B8578C12]) [    ] o.a.s.c.c.SolrZkClient makePath: /collections/control_collection/shards
   [junit4]   2> 2173631 INFO  (TEST-TestReqParamsAPI.test-seed#[79BE3FF9B8578C12]) [    ] o.a.s.c.AbstractZkTestCase put /home/jenkins/workspace/Lucene-Solr-6.x-Linux/solr/core/src/test-files/solr/collection1/conf/solrconfig-tlog.xml to /configs/conf1/solrconfig.xml
   [junit4]   2> 2173631 INFO  (TEST-TestReqParamsAPI.test-seed#[79BE3FF9B8578C12]) [    ] o.a.s.c.c.SolrZkClient makePath: /configs/conf1/solrconfig.xml
   [junit4]   2> 2173632 INFO  (TEST-TestReqParamsAPI.test-seed#[79BE3FF9B8578C12]) [    ] o.a.s.c.AbstractZkTestCase put /home/jenkins/workspace/Lucene-Solr-6.x-Linux/solr/core/src/test-files/solr/collection1/conf/schema.xml to /configs/conf1/schema.xml
   [junit4]   2> 2173632 INFO  (TEST-TestReqParamsAPI.test-seed#[79BE3FF9B8578C12]) [    ] o.a.s.c.c.SolrZkClient makePath: /configs/conf1/schema.xml
   [junit4]   2> 2173633 INFO  (TEST-TestReqParamsAPI.test-seed#[79BE3FF9B8578C12]) [    ] o.a.s.c.AbstractZkTestCase put /home/jenkins/workspace/Lucene-Solr-6.x-Linux/solr/core/src/test-files/solr/collection1/conf/solrconfig.snippet.randomindexconfig.xml to /configs/conf1/solrconfig.snippet.randomindexconfig.xml
   [junit4]   2> 2173633 INFO  (TEST-TestReqParamsAPI.test-seed#[79BE3FF9B8578C12]) [    ] o.a.s.c.c.SolrZkClient makePath: /configs/conf1/solrconfig.snippet.randomindexconfig.xml
   [junit4]   2> 2173636 INFO  (TEST-TestReqParamsAPI.test-seed#[79BE3FF9B8578C12]) [    ] o.a.s.c.AbstractZkTestCase put /home/jenkins/workspace/Lucene-Solr-6.x-Linux/solr/core/src/test-files/solr/collection1/conf/stopwords.txt to /configs/conf1/stopwords.txt
   [junit4]   2> 2173636 INFO  (TEST-TestReqParamsAPI.test-seed#[79BE3FF9B8578C12]) [    ] o.a.s.c.c.SolrZkClient makePath: /configs/conf1/stopwords.txt
   [junit4]   2> 2173638 INFO  (TEST-TestReqParamsAPI.test-seed#[79BE3FF9B8578C12]) [    ] o.a.s.c.AbstractZkTestCase put /home/jenkins/workspace/Lucene-Solr-6.x-Linux/solr/core/src/test-files/solr/collection1/conf/protwords.txt to /configs/conf1/protwords.txt
   [junit4]   2> 2173638 INFO  (TEST-TestReqParamsAPI.test-seed#[79BE3FF9B8578C12]) [    ] o.a.s.c.c.SolrZkClient makePath: /configs/conf1/protwords.txt
   [junit4]   2> 2173638 INFO  (TEST-TestReqParamsAPI.test-seed#[79BE3FF9B8578C12]) [    ] o.a.s.c.AbstractZkTestCase put /home/jenkins/workspace/Lucene-Solr-6.x-Linux/solr/core/src/test-files/solr/collection1/conf/currency.xml to /configs/conf1/currency.xml
   [junit4]   2> 2173638 INFO  (TEST-TestReqParamsAPI.test-seed#[79BE3FF9B8578C12]) [    ] o.a.s.c.c.SolrZkClient makePath: /configs/conf1/currency.xml
   [junit4]   2> 2173639 INFO  (TEST-TestReqParamsAPI.test-seed#[79BE3FF9B8578C12]) [    ] o.a.s.c.AbstractZkTestCase put /home/jenkins/workspace/Lucene-Solr-6.x-Linux/solr/core/src/test-files/solr/collection1/conf/enumsConfig.xml to /configs/conf1/enumsConfig.xml
   [junit4]   2> 2173639 INFO  (TEST-TestReqParamsAPI.test-seed#[79BE3FF9B8578C12]) [    ] o.a.s.c.c.SolrZkClient makePath: /configs/conf1/enumsConfig.xml
   [junit4]   2> 2173639 INFO  (TEST-TestReqParamsAPI.test-seed#[79BE3FF9B8578C12]) [    ] o.a.s.c.AbstractZkTestCase put /home/jenkins/workspace/Lucene-Solr-6.x-Linux/solr/core/src/test-files/solr/collection1/conf/open-exchange-rates.json to /configs/conf1/open-exchange-rates.json
   [junit4]   2> 2173639 INFO  (TEST-TestReqParamsAPI.test-seed#[79BE3FF9B8578C12]) [    ] o.a.s.c.c.SolrZkClient makePath: /configs/conf1/open-exchange-rates.json
   [junit4]   2> 2173640 INFO  (TEST-TestReqParamsAPI.test-seed#[79BE3FF9B8578C12]) [    ] o.a.s.c.AbstractZkTestCase put /home/jenkins/workspace/Lucene-Solr-6.x-Linux/solr/core/src/test-files/solr/collection1/conf/mapping-ISOLatin1Accent.txt to /configs/conf1/mapping-ISOLatin1Accent.txt
   [junit4]   2> 2173640 INFO  (TEST-TestReqParamsAPI.test-seed#[79BE3FF9B8578C12]) [    ] o.a.s.c.c.SolrZkClient makePath: /configs/conf1/mapping-ISOLatin1Accent.txt
   [junit4]   2> 2173640 INFO  (TEST-TestReqParamsAPI.test-seed#[79BE3FF9B8578C12]) [    ] o.a.s.c.AbstractZkTestCase put /home/jenkins/workspace/Lucene-Solr-6.x-Linux/solr/core/src/test-files/solr/collection1/conf/old_synonyms.txt to /configs/conf1/old_synonyms.txt
   [junit4]   2> 2173641 INFO  (TEST-TestReqParamsAPI.test-seed#[79BE3FF9B8578C12]) [    ] o.a.s.c.c.SolrZkClient makePath: /configs/conf1/old_synonyms.txt
   [junit4]   2> 2173641 INFO  (TEST-TestReqParamsAPI.test-seed#[79BE3FF9B8578C12]) [    ] o.a.s.c.AbstractZkTestCase put /home/jenkins/workspace/Lucene-Solr-6.x-Linux/solr/core/src/test-files/solr/collection1/conf/synonyms.txt to /configs/conf1/synonyms.txt
   [junit4]   2> 2173641 INFO  (TEST-TestReqParamsAPI.test-seed#[79BE3FF9B8578C12]) [    ] o.a.s.c.c.SolrZkClient makePath: /configs/conf1/synonyms.txt
   [junit4]   2> 2173642 INFO  (TEST-TestReqParamsAPI.test-seed#[79BE3FF9B8578C12]) [    ] o.a.s.c.c.SolrZkClient Using default ZkCredentialsProvider
   [junit4]   2> 2173642 INFO  (TEST-TestReqParamsAPI.test-seed#[79BE3FF9B8578C12]) [    ] o.a.s.c.c.ConnectionManager Waiting for client to connect to ZooKeeper
   [junit4]   2> 2173643 INFO  (zkCallback-2599-thread-1) [    ] o.a.s.c.c.ConnectionManager Watcher org.apache.solr.common.cloud.ConnectionManager@f125f8 name:ZooKeeperConnection Watcher:127.0.0.1:41331/solr got event WatchedEvent state:SyncConnected type:None path:null path:null type:None
   [junit4]   2> 2173643 INFO  (TEST-TestReqParamsAPI.test-seed#[79BE3FF9B8578C12]) [    ] o.a.s.c.c.ConnectionManager Client is connected to ZooKeeper
   [junit4]   2> 2173643 INFO  (TEST-TestReqParamsAPI.test-seed#[79BE3FF9B8578C12]) [    ] o.a.s.c.c.SolrZkClient Using default ZkACLProvider
   [junit4]   2> 2173719 INFO  (TEST-TestReqParamsAPI.test-seed#[79BE3FF9B8578C12]) [    ] o.a.s.SolrTestCaseJ4 Writing core.properties file to /home/jenkins/workspace/Lucene-Solr-6.x-Linux/solr/build/solr-core/test/J1/temp/solr.handler.TestReqParamsAPI_79BE3FF9B8578C12-001/control-001/cores/collection1
   [junit4]   2> 2173720 INFO  (TEST-TestReqParamsAPI.test-seed#[79BE3FF9B8578C12]) [    ] o.e.j.s.Server jetty-9.3.8.v20160314
   [junit4]   2> 2173722 INFO  (TEST-TestReqParamsAPI.test-seed#[79BE3FF9B8578C12]) [    ] o.e.j.s.h.ContextHandler Started o.e.j.s.ServletContextHandler@10dc63c{/,null,AVAILABLE}
   [junit4]   2> 2173724 INFO  (TEST-TestReqParamsAPI.test-seed#[79BE3FF9B8578C12]) [    ] o.e.j.s.ServerConnector Started ServerConnector@1cb988d{SSL,[ssl, http/1.1]}{127.0.0.1:46064}
   [junit4]   2> 2173724 INFO  (TEST-TestReqParamsAPI.test-seed#[79BE3FF9B8578C12]) [    ] o.e.j.s.Server Started @2175827ms
   [junit4]   2> 2173724 INFO  (TEST-TestReqParamsAPI.test-seed#[79BE3FF9B8578C12]) [    ] o.a.s.c.s.e.JettySolrRunner Jetty properties: {hostContext=/, solr.data.dir=/home/jenkins/workspace/Lucene-Solr-6.x-Linux/solr/build/solr-core/test/J1/temp/solr.handler.TestReqParamsAPI_79BE3FF9B8578C12-001/tempDir-001/control/data, hostPort=46064, coreRootDirectory=/home/jenkins/workspace/Lucene-Solr-6.x-Linux/solr/build/solr-core/test/J1/temp/solr.handler.TestReqParamsAPI_79BE3FF9B8578C12-001/control-001/cores}
   [junit4]   2> 2173724 INFO  (TEST-TestReqParamsAPI.test-seed#[79BE3FF9B8578C12]) [    ] o.a.s.s.SolrDispatchFilter SolrDispatchFilter.init(): jdk.internal.loader.ClassLoaders$AppClassLoader@1a10788
   [junit4]   2> 2173724 INFO  (TEST-TestReqParamsAPI.test-seed#[79BE3FF9B8578C12]) [    ] o.a.s.c.SolrResourceLoader new SolrResourceLoader for directory: '/home/jenkins/workspace/Lucene-Solr-6.x-Linux/solr/build/solr-core/test/J1/temp/solr.handler.TestReqParamsAPI_79BE3FF9B8578C12-001/control-001'
   [junit4]   2> 2173724 INFO  (TEST-TestReqParamsAPI.test-seed#[79BE3FF9B8578C12]) [    ] o.a.s.c.SolrResourceLoader JNDI not configured for solr (NoInitialContextEx)
   [junit4]   2> 2173724 INFO  (TEST-TestReqParamsAPI.test-seed#[79BE3FF9B8578C12]) [    ] o.a.s.c.SolrResourceLoader solr home defaulted to 'solr/' (could not find system property or JNDI)
   [junit4]   2> 2173725 INFO  (TEST-TestReqParamsAPI.test-seed#[79BE3FF9B8578C12]) [    ] o.a.s.c.c.SolrZkClient Using default ZkCredentialsProvider
   [junit4]   2> 2173725 INFO  (TEST-TestReqParamsAPI.test-seed#[79BE3FF9B8578C12]) [    ] o.a.s.c.c.ConnectionManager Waiting for client to connect to ZooKeeper
   [junit4]   2> 2173725 INFO  (zkCallback-2600-thread-1) [    ] o.a.s.c.c.ConnectionManager Watcher org.apache.solr.common.cloud.ConnectionManager@196f5c6 name:ZooKeeperConnection Watcher:127.0.0.1:41331/solr got event WatchedEvent state:SyncConnected type:None path:null path:null type:None
   [junit4]   2> 2173726 INFO  (TEST-TestReqParamsAPI.test-seed#[79BE3FF9B8578C12]) [    ] o.a.s.c.c.ConnectionManager Client is connected to ZooKeeper
   [junit4]   2> 2173726 INFO  (TEST-TestReqParamsAPI.test-seed#[79BE3FF9B8578C12]) [    ] o.a.s.c.c.SolrZkClient Using default ZkACLProvider
   [junit4]   2> 2173726 INFO  (TEST-TestReqParamsAPI.test-seed#[79BE3FF9B8578C12]) [    ] o.a.s.s.SolrDispatchFilter Loading solr.xml from SolrHome (not found in ZooKeeper)
   [junit4]   2> 2173726 INFO  (TEST-TestReqParamsAPI.test-seed#[79BE3FF9B8578C12]) [    ] o.a.s.c.SolrXmlConfig Loading container configuration from /home/jenkins/workspace/Lucene-Solr-6.x-Linux/solr/build/solr-core/test/J1/temp/solr.handler.TestReqParamsAPI_79BE3FF9B8578C12-001/control-001/solr.xml
   [junit4]   2> 2173730 INFO  (TEST-TestReqParamsAPI.test-seed#[79BE3FF9B8578C12]) [    ] o.a.s.c.CorePropertiesLocator Config-defined core root directory: /home/jenkins/workspace/Lucene-Solr-6.x-Linux/solr/build/solr-core/test/J1/temp/solr.handler.TestReqParamsAPI_79BE3FF9B8578C12-001/control-001/cores
   [junit4]   2> 2173730 INFO  (TEST-TestReqParamsAPI.test-seed#[79BE3FF9B8578C12]) [    ] o.a.s.c.CoreContainer New CoreContainer 18186699
   [junit4]   2> 2173730 INFO  (TEST-TestReqParamsAPI.test-seed#[79BE3FF9B8578C12]) [    ] o.a.s.c.CoreContainer Loading cores into CoreContainer [instanceDir=/home/jenkins/workspace/Lucene-Solr-6.x-Linux/solr/build/solr-core/test/J1/temp/solr.handler.TestReqParamsAPI_79BE3FF9B8578C12-001/control-001]
   [junit4]   2> 2173731 WARN  (TEST-TestReqParamsAPI.test-seed#[79BE3FF9B8578C12]) [    ] o.a.s.c.CoreContainer Couldn't add files from /home/jenkins/workspace/Lucene-Solr-6.x-Linux/solr/build/solr-core/test/J1/temp/solr.handler.TestReqParamsAPI_79BE3FF9B8578C12-001/control-001/lib to classpath: /home/jenkins/workspace/Lucene-Solr-6.x-Linux/solr/build/solr-core/test/J1/temp/solr.handler.TestReqParamsAPI_79BE3FF9B8578C12-001/control-001/lib
   [junit4]   2> 2173731 INFO  (TEST-TestReqParamsAPI.test-seed#[79BE3FF9B8578C12]) [    ] o.a.s.h.c.HttpShardHandlerFactory created with socketTimeout : 90000,urlScheme : ,connTimeout : 15000,maxConnectionsPerHost : 20,maxConnections : 10000,corePoolSize : 0,maximumPoolSize : 2147483647,maxThreadIdleTime : 5,sizeOfQueue : -1,fairnessPolicy : false,useRetries : false,
   [junit4]   2> 2173732 INFO  (TEST-TestReqParamsAPI.test-seed#[79BE3FF9B8578C12]) [    ] o.a.s.u.UpdateShardHandler Creating UpdateShardHandler HTTP client with params: socketTimeout=340000&connTimeout=45000&retry=true
   [junit4]   2> 2173732 INFO  (TEST-TestReqParamsAPI.test-seed#[79BE3FF9B8578C12]) [    ] o.a.s.l.LogWatcher SLF4J impl is org.slf4j.impl.Log4jLoggerFactory
   [junit4]   2> 2173732 INFO  (TEST-TestReqParamsAPI.test-seed#[79BE3FF9B8578C12]) [    ] o.a.s.l.LogWatcher Registering Log Listener [Log4j (org.slf4j.impl.Log4jLoggerFactory)]
   [junit4]   2> 2173732 INFO  (TEST-TestReqParamsAPI.test-seed#[79BE3FF9B8578C12]) [    ] o.a.s.c.ZkContainer Zookeeper client=127.0.0.1:41331/solr
   [junit4]   2> 2173732 INFO  (TEST-TestReqParamsAPI.test-seed#[79BE3FF9B8578C12]) [    ] o.a.s.c.ZkController zkHost includes chroot
   [junit4]   2> 2173732 INFO  (TEST-TestReqParamsAPI.test-seed#[79BE3FF9B8578C12]) [    ] o.a.s.c.c.SolrZkClient Using default ZkCredentialsProvider
   [junit4]   2> 2173733 INFO  (TEST-TestReqParamsAPI.test-seed#[79BE3FF9B8578C12]) [    ] o.a.s.c.c.ConnectionManager Waiting for client to connect to ZooKeeper
   [junit4]   2> 2173734 INFO  (zkCallback-2603-thread-1) [    ] o.a.s.c.c.ConnectionManager Watcher org.apache.solr.common.cloud.ConnectionManager@4fdbb9 name:ZooKeeperConnection Watcher:127.0.0.1:41331 got event WatchedEvent state:SyncConnected type:None path:null path:null type:None
   [junit4]   2> 2173734 INFO  (TEST-TestReqParamsAPI.test-seed#[79BE3FF9B8578C12]) [    ] o.a.s.c.c.ConnectionManager Client is connected to ZooKeeper
   [junit4]   2> 2173734 INFO  (TEST-TestReqParamsAPI.test-seed#[79BE3FF9B8578C12]) [    ] o.a.s.c.c.SolrZkClient Using default ZkACLProvider
   [junit4]   2> 2173735 INFO  (TEST-TestReqParamsAPI.test-seed#[79BE3FF9B8578C12]) [    ] o.a.s.c.ZkController Added new OnReconnect listener org.apache.solr.cloud.ZkController$$Lambda$180/11341953@1ee2534
   [junit4]   2> 2173735 INFO  (TEST-TestReqParamsAPI.test-seed#[79BE3FF9B8578C12]) [    ] o.a.s.c.c.ConnectionManager Waiting for client to connect to ZooKeeper
   [junit4]   2> 2173736 INFO  (zkCallback-2604-thread-1) [    ] o.a.s.c.c.ConnectionManager Watcher org.apache.solr.common.cloud.ConnectionManager@b61d90 name:ZooKeeperConnection Watcher:127.0.0.1:41331/solr got event WatchedEvent state:SyncConnected type:None path:null path:null type:None
   [junit4]   2> 2173736 INFO  (TEST-TestReqParamsAPI.test-seed#[79BE3FF9B8578C12]) [    ] o.a.s.c.c.ConnectionManager Client is connected to ZooKeeper
   [junit4]   2> 2173736 INFO  (TEST-TestReqParamsAPI.test-seed#[79BE3FF9B8578C12]) [    ] o.a.s.c.c.SolrZkClient makePath: /overseer/queue
   [junit4]   2> 2173737 INFO  (TEST-TestReqParamsAPI.test-seed#[79BE3FF9B8578C12]) [    ] o.a.s.c.c.SolrZkClient makePath: /overseer/collection-queue-work
   [junit4]   2> 2173738 INFO  (TEST-TestReqParamsAPI.test-seed#[79BE3FF9B8578C12]) [    ] o.a.s.c.c.SolrZkClient makePath: /overseer/collection-map-running
   [junit4]   2> 2173739 INFO  (TEST-TestReqParamsAPI.test-seed#[79BE3FF9B8578C12]) [    ] o.a.s.c.c.SolrZkClient makePath: /overseer/collection-map-completed
   [junit4]   2> 2173739 INFO  (TEST-TestReqParamsAPI.test-seed#[79BE3FF9B8578C12]) [    ] o.a.s.c.c.SolrZkClient makePath: /overseer/collection-map-failure
   [junit4]   2> 2173740 INFO  (TEST-TestReqParamsAPI.test-seed#[79BE3FF9B8578C12]) [    ] o.a.s.c.c.SolrZkClient makePath: /live_nodes
   [junit4]   2> 2173740 INFO  (TEST-TestReqParamsAPI.test-seed#[79BE3FF9B8578C12]) [    ] o.a.s.c.c.SolrZkClient makePath: /aliases.json
   [junit4]   2> 2173741 INFO  (TEST-TestReqParamsAPI.test-seed#[79BE3FF9B8578C12]) [    ] o.a.s.c.c.SolrZkClient makePath: /clusterstate.json
   [junit4]   2> 2173741 INFO  (TEST-TestReqParamsAPI.test-seed#[79BE3FF9B8578C12]) [    ] o.a.s.c.c.SolrZkClient makePath: /security.json
   [junit4]   2> 2173741 INFO  (TEST-TestReqParamsAPI.test-seed#[79BE3FF9B8578C12]) [    ] o.a.s.c.c.ZkStateReader Updating cluster state from ZooKeeper... 
   [junit4]   2> 2173742 INFO  (TEST-TestReqParamsAPI.test-seed#[79BE3FF9B8578C12]) [    ] o.a.s.c.c.ZkStateReader Loaded cluster properties: {urlScheme=https}
   [junit4]   2> 2173742 INFO  (TEST-TestReqParamsAPI.test-seed#[79BE3FF9B8578C12]) [    ] o.a.s.c.c.ZkStateReader Updated live nodes from ZooKeeper... (0) -> (0)
   [junit4]   2> 2173742 INFO  (TEST-TestReqParamsAPI.test-seed#[79BE3FF9B8578C12]) [    ] o.a.s.c.c.SolrZkClient makePath: /overseer_elect
   [junit4]   2> 2173743 INFO  (TEST-TestReqParamsAPI.test-seed#[79BE3FF9B8578C12]) [    ] o.a.s.c.c.SolrZkClient makePath: /overseer_elect/election
   [junit4]   2> 2173743 INFO  (TEST-TestReqParamsAPI.test-seed#[79BE3FF9B8578C12]) [    ] o.a.s.c.Overseer Overseer (id=null) closing
   [junit4]   2> 2173744 INFO  (TEST-TestReqParamsAPI.test-seed#[79BE3FF9B8578C12]) [    ] o.a.s.c.LeaderElector Joined leadership election with path: /overseer_elect/election/96087017251667973-127.0.0.1:46064_-n_0000000000
   [junit4]   2> 2173744 INFO  (TEST-TestReqParamsAPI.test-seed#[79BE3FF9B8578C12]) [    ] o.a.s.c.OverseerElectionContext I am going to be the leader 127.0.0.1:46064_
   [junit4]   2> 2173744 INFO  (TEST-TestReqParamsAPI.test-seed#[79BE3FF9B8578C12]) [    ] o.a.s.c.c.SolrZkClient makePath: /overseer_elect/leader
   [junit4]   2> 2173744 INFO  (TEST-TestReqParamsAPI.test-seed#[79BE3FF9B8578C12]) [    ] o.a.s.c.Overseer Overseer (id=96087017251667973-127.0.0.1:46064_-n_0000000000) starting
   [junit4]   2> 2173745 INFO  (TEST-TestReqParamsAPI.test-seed#[79BE3FF9B8578C12]) [    ] o.a.s.c.c.SolrZkClient makePath: /overseer/queue-work
   [junit4]   2> 2173747 INFO  (TEST-TestReqParamsAPI.test-seed#[79BE3FF9B8578C12]) [    ] o.a.s.c.OverseerAutoReplicaFailoverThread Starting OverseerAutoReplicaFailoverThread autoReplicaFailoverWorkLoopDelay=10000 autoReplicaFailoverWaitAfterExpiration=30000 autoReplicaFailoverBadNodeExpiration=60000
   [junit4]   2> 2173747 INFO  (OverseerCollectionConfigSetProcessor-96087017251667973-127.0.0.1:46064_-n_0000000000) [    ] o.a.s.c.OverseerTaskProcessor Process current queue of overseer operations
   [junit4]   2> 2173747 INFO  (OverseerStateUpdate-96087017251667973-127.0.0.1:46064_-n_0000000000) [    ] o.a.s.c.Overseer Starting to work on the main queue
   [junit4]   2> 2173747 INFO  (TEST-TestReqParamsAPI.test-seed#[79BE3FF9B8578C12]) [    ] o.a.s.c.ZkController Register node as live in ZooKeeper:/live_nodes/127.0.0.1:46064_
   [junit4]   2> 2173748 INFO  (TEST-TestReqParamsAPI.test-seed#[79BE3FF9B8578C12]) [    ] o.a.s.c.c.SolrZkClient makePath: /live_nodes/127.0.0.1:46064_
   [junit4]   2> 2173748 INFO  (OverseerStateUpdate-96087017251667973-127.0.0.1:46064_-n_0000000000) [    ] o.a.s.c.c.ZkStateReader Updated live nodes from ZooKeeper... (0) -> (0)
   [junit4]   2> 2173748 INFO  (zkCallback-2604-thread-1) [    ] o.a.s.c.c.ZkStateReader A live node change: [WatchedEvent state:SyncConnected type:NodeChildrenChanged path:/live_nodes], has occurred - updating... (live nodes size: [0])
   [junit4]   2> 2173748 INFO  (zkCallback-2604-thread-1) [    ] o.a.s.c.c.ZkStateReader Updated live nodes from ZooKeeper... (0) -> (1)
   [junit4]   2> 2173787 INFO  (TEST-TestReqParamsAPI.test-seed#[79BE3FF9B8578C12]) [    ] o.a.s.c.CoreContainer Security conf doesn't exist. Skipping setup for authorization module.
   [junit4]   2> 2173787 INFO  (TEST-TestReqParamsAPI.test-seed#[79BE3FF9B8578C12]) [    ] o.a.s.c.CoreContainer No authentication plugin used.
   [junit4]   2> 2173788 INFO  (TEST-TestReqParamsAPI.test-seed#[79BE3FF9B8578C12]) [    ] o.a.s.c.CorePropertiesLocator Looking for core definitions underneath /home/jenkins/workspace/Lucene-Solr-6.x-Linux/solr/build/solr-core/test/J1/temp/solr.handler.TestReqParamsAPI_79BE3FF9B8578C12-001/control-001/cores
   [junit4]   2> 2173788 INFO  (TEST-TestReqParamsAPI.test-seed#[79BE3FF9B8578C12]) [    ] o.a.s.c.CoreDescriptor Created CoreDescriptor: {schema=schema.xml, dataDir=data/, collection=control_collection, loadOnStartup=true, coreNodeName=, transient=false, name=collection1, shard=, config=solrconfig.xml, configSetProperties=configsetprops.json}
   [junit4]   2> 2173788 INFO  (TEST-TestReqParamsAPI.test-seed#[79BE3FF9B8578C12]) [    ] o.a.s.c.CorePropertiesLocator Found core collection1 in /home/jenkins/workspace/Lucene-Solr-6.x-Linux/solr/build/solr-core/test/J1/temp/solr.handler.TestReqParamsAPI_79BE3FF9B8578C12-001/control-001/cores/collection1
   [junit4]   2> 2173788 INFO  (TEST-TestReqParamsAPI.test-seed#[79BE3FF9B8578C12]) [    ] o.a.s.c.CorePropertiesLocator Found 1 core definitions
   [junit4]   2> 2173789 INFO  (TEST-TestReqParamsAPI.test-seed#[79BE3FF9B8578C12]) [    ] o.a.s.s.SolrDispatchFilter user.dir=/home/jenkins/workspace/Lucene-Solr-6.x-Linux/solr/build/solr-core/test/J1
   [junit4]   2> 2173789 INFO  (TEST-TestReqParamsAPI.test-seed#[79BE3FF9B8578C12]) [    ] o.a.s.s.SolrDispatchFilter SolrDispatchFilter.init() done
   [junit4]   2> 2173789 INFO  (coreLoadExecutor-5651-thread-1) [    ] o.a.s.c.ZkController publishing state=down
   [junit4]   2> 2173789 INFO  (coreLoadExecutor-5651-thread-1) [    ] o.a.s.c.ZkController numShards not found on descriptor - reading it from system property
   [junit4]   2> 2173790 INFO  (coreLoadExecutor-5651-thread-1) [    ] o.a.s.c.ZkController Collection control_collection not visible yet, but flagging it so a watch is registered when it becomes visible
   [junit4]   2> 2173790 INFO  (OverseerStateUpdate-96087017251667973-127.0.0.1:46064_-n_0000000000) [    ] o.a.s.c.Overseer processMessage: queueSize: 1, message = {
   [junit4]   2>   "core":"collection1",
   [junit4]   2>   "roles":null,
   [junit4]   2>   "base_url":"https://127.0.0.1:46064",
   [junit4]   2>   "node_name":"127.0.0.1:46064_",
   [junit4]   2>   "numShards":"1",
   [junit4]   2>   "state":"down",
   [junit4]   2>   "shard":null,
   [junit4]   2>   "collection":"control_collection",
   [junit4]   2>   "operation":"state"} current state version: 0
   [junit4]   2> 2173790 INFO  (OverseerStateUpdate-96087017251667973-127.0.0.1:46064_-n_0000000000) [    ] o.a.s.c.o.ReplicaMutator Update state numShards=1 message={
   [junit4]   2>   "core":"collection1",
   [junit4]   2>   "roles":null,
   [junit4]   2>   "base_url":"https://127.0.0.1:46064",
   [junit4]   2>   "node_name":"127.0.0.1:46064_",
   [junit4]   2>   "numShards":"1",
   [junit4]   2>   "state":"down",
   [junit4]   2>   "shard":null,
   [junit4]   2>   "collection":"control_collection",
   [junit4]   2>   "operation":"state"}
   [junit4]   2> 2173790 INFO  (coreLoadExecutor-5651-thread-1) [    ] o.a.s.c.c.ZkStateReader Deleting data for [control_collection]
   [junit4]   2> 2173790 INFO  (OverseerStateUpdate-96087017251667973-127.0.0.1:46064_-n_0000000000) [    ] o.a.s.c.o.ClusterStateMutator building a new cName: control_collection
   [junit4]   2> 2173790 INFO  (OverseerStateUpdate-96087017251667973-127.0.0.1:46064_-n_0000000000) [    ] o.a.s.c.o.ReplicaMutator Assigning new node to shard shard=shard1
   [junit4]   2> 2173790 INFO  (coreLoadExecutor-5651-thread-1) [    ] o.a.s.c.ZkController look for our core node name
   [junit4]   2> 2173791 INFO  (zkCallback-2604-thread-1) [    ] o.a.s.c.c.ZkStateReader A cluster state change: [WatchedEvent state:SyncConnected type:NodeDataChanged path:/clusterstate.json], has occurred - updating... (live nodes size: [1])
   [junit4]   2> 2174791 INFO  (coreLoadExecutor-5651-thread-1) [    ] o.a.s.c.ZkController waiting to find shard id in clusterstate for collection1
   [junit4]   2> 2174791 INFO  (coreLoadExecutor-5651-thread-1) [    ] o.a.s.c.ZkController Check for collection zkNode:control_collection
   [junit4]   2> 2174791 INFO  (coreLoadExecutor-5651-thread-1) [    ] o.a.s.c.ZkController Collection zkNode exists
   [junit4]   2> 2174791 INFO  (coreLoadExecutor-5651-thread-1) [    ] o.a.s.c.c.ZkStateReader Load collection config from: [/collections/control_collection]
   [junit4]   2> 2174791 INFO  (coreLoadExecutor-5651-thread-1) [    ] o.a.s.c.c.ZkStateReader path=[/collections/control_collection] [configName]=[conf1] specified config exists in ZooKeeper
   [junit4]   2> 2174791 INFO  (coreLoadExecutor-5651-thread-1) [    ] o.a.s.c.SolrResourceLoader new SolrResourceLoader for directory: '/home/jenkins/workspace/Lucene-Solr-6.x-Linux/solr/build/solr-core/test/J1/temp/solr.handler.TestReqParamsAPI_79BE3FF9B8578C12-001/control-001/cores/collection1'
   [junit4]   2> 2174792 INFO  (coreLoadExecutor-5651-thread-1) [    ] o.a.s.c.SolrResourceLoader JNDI not configured for solr (NoInitialContextEx)
   [junit4]   2> 2174792 INFO  (coreLoadExecutor-5651-thread-1) [    ] o.a.s.c.SolrResourceLoader solr home defaulted to 'solr/' (could not find system property or JNDI)
   [junit4]   2> 2174793 INFO  (coreLoadExecutor-5651-thread-1) [    ] o.a.s.c.Config loaded config solrconfig.xml with version 0 
   [junit4]   2> 2174799 INFO  (coreLoadExecutor-5651-thread-1) [    ] o.a.s.c.SolrConfig current version of requestparams : -1
   [junit4]   2> 2174803 INFO  (coreLoadExecutor-5651-thread-1) [    ] o.a.s.c.SolrConfig Using Lucene MatchVersion: 6.2.0
   [junit4]   2> 2174814 INFO  (coreLoadExecutor-5651-thread-1) [    ] o.a.s.c.SolrConfig Loaded SolrConfig: solrconfig.xml
   [junit4]   2> 2174823 INFO  (coreLoadExecutor-5651-thread-1) [    ] o.a.s.s.IndexSchema [collection1] Schema name=test
   [junit4]   2> 2174927 INFO  (coreLoadExecutor-5651-thread-1) [    ] o.a.s.s.OpenExchangeRatesOrgProvider Initialized with rates=open-exchange-rates.json, refreshInterval=1440.
   [junit4]   2> 2174930 INFO  (coreLoadExecutor-5651-thread-1) [    ] o.a.s.s.IndexSchema default search field in schema is text
   [junit4]   2> 2174931 INFO  (coreLoadExecutor-5651-thread-1) [    ] o.a.s.s.IndexSchema unique key field: id
   [junit4]   2> 2174935 INFO  (coreLoadExecutor-5651-thread-1) [    ] o.a.s.s.FileExchangeRateProvider Reloading exchange rates from file currency.xml
   [junit4]   2> 2174936 INFO  (coreLoadExecutor-5651-thread-1) [    ] o.a.s.s.FileExchangeRateProvider Reloading exchange rates from file currency.xml
   [junit4]   2> 2174938 INFO  (coreLoadExecutor-5651-thread-1) [    ] o.a.s.s.OpenExchangeRatesOrgProvider Reloading exchange rates from open-exchange-rates.json
   [junit4]   2> 2174938 INFO  (coreLoadExecutor-5651-thread-1) [    ] o.a.s.s.OpenExchangeRatesOrgProvider Reloading exchange rates from open-exchange-rates.json
   [junit4]   2> 2174939 INFO  (coreLoadExecutor-5651-thread-1) [    ] o.a.s.c.ConfigSetProperties Did not find ConfigSet properties, assuming default properties: Can't find resource 'configsetprops.json' in classpath or '/configs/conf1', cwd=/home/jenkins/workspace/Lucene-Solr-6.x-Linux/solr/build/solr-core/test/J1
   [junit4]   2> 2174939 INFO  (coreLoadExecutor-5651-thread-1) [    ] o.a.s.c.CoreContainer Creating SolrCore 'collection1' using configuration from collection control_collection
   [junit4]   2> 2174939 INFO  (coreLoadExecutor-5651-thread-1) [    ] o.a.s.c.SolrCore org.apache.solr.core.MockDirectoryFactory
   [junit4]   2> 2174939 INFO  (coreLoadExecutor-5651-thread-1) [    ] o.a.s.c.SolrCore [[collection1] ] Opening new SolrCore at [/home/jenkins/workspace/Lucene-Solr-6.x-Linux/solr/build/solr-core/test/J1/temp/solr.handler.TestReqParamsAPI_79BE3FF9B8578C12-001/control-001/cores/collection1], dataDir=[/home/jenkins/workspace/Lucene-Solr-6.x-Linux/solr/build/solr-core/test/J1/temp/solr.handler.TestReqParamsAPI_79BE3FF9B8578C12-001/control-001/cores/collection1/data/]
   [junit4]   2> 2174939 INFO  (coreLoadExecutor-5651-thread-1) [    ] o.a.s.c.JmxMonitoredMap JMX monitoring is enabled. Adding Solr mbeans to JMX Server: com.sun.jmx.mbeanserver.JmxMBeanServer@720629
   [junit4]   2> 2174939 INFO  (coreLoadExecutor-5651-thread-1) [    ] o.a.s.c.CachingDirectoryFactory return new directory for /home/jenkins/workspace/Lucene-Solr-6.x-Linux/solr/build/solr-core/test/J1/temp/solr.handler.TestReqParamsAPI_79BE3FF9B8578C12-001/control-001/cores/collection1/data
   [junit4]   2> 2174939 INFO  (coreLoadExecutor-5651-thread-1) [    ] o.a.s.c.SolrCore New index directory detected: old=null new=/home/jenkins/workspace/Lucene-Solr-6.x-Linux/solr/build/solr-core/test/J1/temp/solr.handler.TestReqParamsAPI_79BE3FF9B8578C12-001/control-001/cores/collection1/data/index/
   [junit4]   2> 2174940 WARN  (coreLoadExecutor-5651-thread-1) [    ] o.a.s.c.SolrCore [collection1] Solr index directory '/home/jenkins/workspace/Lucene-Solr-6.x-Linux/solr/build/solr-core/test/J1/temp/solr.handler.TestReqParamsAPI_79BE3FF9B8578C12-001/control-001/cores/collection1/data/index' doesn't exist. Creating new index...
   [junit4]   2> 2174940 INFO  (coreLoadExecutor-5651-thread-1) [    ] o.a.s.c.CachingDirectoryFactory return new directory for /home/jenkins/workspace/Lucene-Solr-6.x-Linux/solr/build/solr-core/test/J1/temp/solr.handler.TestReqParamsAPI_79BE3FF9B8578C12-001/control-001/cores/collection1/data/index
   [junit4]   2> 2174940 INFO  (coreLoadExecutor-5651-thread-1) [    ] o.a.s.u.RandomMergePolicy RandomMergePolicy wrapping class org.apache.lucene.index.TieredMergePolicy: [TieredMergePolicy: maxMergeAtOnce=17, maxMergeAtOnceExplicit=18, maxMergedSegmentMB=9.505859375, floorSegmentMB=0.205078125, forceMergeDeletesPctAllowed=16.152260197736293, segmentsPerTier=47.0, maxCFSSegmentSizeMB=8.796093022207999E12, noCFSRatio=1.0
   [junit4]   2> 2174940 INFO  (coreLoadExecutor-5651-thread-1) [    ] o.a.s.c.SolrDeletionPolicy SolrDeletionPolicy.onCommit: commits: num=1
   [junit4]   2> 	commit{dir=MockDirectoryWrapper(RAMDirectory@61e26b lockFactory=org.apache.lucene.store.SingleInstanceLockFactory@59b8d4),segFN=segments_1,generation=1}
   [junit4]   2> 2174940 INFO  (coreLoadExecutor-5651-thread-1) [    ] o.a.s.c.SolrDeletionPolicy newest commit generation = 1
   [junit4]   2> 2174940 INFO  (OldIndexDirectoryCleanupThreadForCore-collection1) [    ] o.a.s.c.SolrCore Looking for old index directories to cleanup for core collection1 in /home/jenkins/workspace/Lucene-Solr-6.x-Linux/solr/build/solr-core/test/J1/temp/solr.handler.TestReqParamsAPI_79BE3FF9B8578C12-001/control-001/cores/collection1/data/
   [junit4]   2> 2174940 WARN  (OldIndexDirectoryCleanupThreadForCore-collection1) [    ] o.a.s.c.DirectoryFactory /home/jenkins/workspace/Lucene-Solr-6.x-Linux/solr/build/solr-core/test/J1/temp/solr.handler.TestReqParamsAPI_79BE3FF9B8578C12-001/control-001/cores/collection1/data/ does not point to a valid data directory; skipping clean-up of old index directories.
   [junit4]   2> 2174942 INFO  (coreLoadExecutor-5651-thread-1) [    ] o.a.s.u.p.UpdateRequestProcessorChain creating updateRequestProcessorChain "nodistrib"
   [junit4]   2> 2174942 INFO  (coreLoadExecutor-5651-thread-1) [    ] o.a.s.u.p.UpdateRequestProcessorChain creating updateRequestProcessorChain "dedupe"
   [junit4]   2> 2174942 INFO  (coreLoadExecutor-5651-thread-1) [    ] o.a.s.u.p.UpdateRequestProcessorChain inserting DistributedUpdateProcessorFactory into updateRequestProcessorChain "dedupe"
   [junit4]   2> 2174942 INFO  (coreLoadExecutor-5651-thread-1) [    ] o.a.s.u.p.UpdateRequestProcessorChain creating updateRequestProcessorChain "stored_sig"
   [junit4]   2> 2174942 INFO  (coreLoadExecutor-5651-thread-1) [    ] o.a.s.u.p.UpdateRequestProcessorChain inserting DistributedUpdateProcessorFactory into updateRequestProcessorChain "stored_sig"
   [junit4]   2> 2174942 INFO  (coreLoadExecutor-5651-thread-1) [    ] o.a.s.u.p.UpdateRequestProcessorChain creating updateRequestProcessorChain "distrib-dup-test-chain-explicit"
   [junit4]   2> 2174942 INFO  (coreLoadExecutor-5651-thread-1) [    ] o.a.s.u.p.UpdateRequestProcessorChain creating updateRequestProcessorChain "distrib-dup-test-chain-implicit"
   [junit4]   2> 2174943 INFO  (coreLoadExecutor-5651-thread-1) [    ] o.a.s.u.p.UpdateRequestProcessorChain inserting DistributedUpdateProcessorFactory into updateRequestProcessorChain "distrib-dup-test-chain-implicit"
   [junit4]   2> 2174943 INFO  (coreLoadExecutor-5651-thread-1) [    ] o.a.s.c.SolrCore no updateRequestProcessorChain defined as default, creating implicit default
   [junit4]   2> 2174943 WARN  (coreLoadExecutor-5651-thread-1) [    ] o.a.s.c.RequestHandlers INVALID paramSet a in requestHandler {type = requestHandler,name = /dump,class = DumpRequestHandler,args = {defaults={a=A,b=B}}}
   [junit4]   2> 2174944 INFO  (coreLoadExecutor-5651-thread-1) [    ] o.a.s.h.l.XMLLoader xsltCacheLifetimeSeconds=60
   [junit4]   2> 2174944 INFO  (coreLoadExecutor-5651-thread-1) [    ] o.a.s.h.l.XMLLoader xsltCacheLifetimeSeconds=60
   [junit4]   2> 2174945 INFO  (coreLoadExecutor-5651-thread-1) [    ] o.a.s.h.l.XMLLoader xsltCacheLifetimeSeconds=60
   [junit4]   2> 2174946 INFO  (coreLoadExecutor-5651-thread-1) [    ] o.a.s.h.l.XMLLoader xsltCacheLifetimeSeconds=60
   [junit4]   2> 2174947 INFO  (coreLoadExecutor-5651-thread-1) [    ] o.a.s.c.RequestHandlers Registered paths: /admin/mbeans,standard,/update/json/docs,/admin/luke,/export,/get,/admin/properties,/update/json,/admin/threads,/dump,/update/csv,/sql,/graph,/admin/segments,/admin/system,/replication,/config,/stream,/schema,/admin/plugins,/admin/logging,/admin/ping,/update,/admin/file
   [junit4]   2> 2174947 INFO  (coreLoadExecutor-5651-thread-1) [    ] o.a.s.c.SolrCore Using default statsCache cache: org.apache.solr.search.stats.LocalStatsCache
   [junit4]   2> 2174948 INFO  (coreLoadExecutor-5651-thread-1) [    ] o.a.s.u.UpdateHandler Using UpdateLog implementation: org.apache.solr.update.UpdateLog
   [junit4]   2> 2174948 INFO  (coreLoadExecutor-5651-thread-1) [    ] o.a.s.u.UpdateLog Initializing UpdateLog: dataDir= defaultSyncLevel=FLUSH numRecordsToKeep=100 maxNumLogsToKeep=10 numVersionBuckets=65536
   [junit4]   2> 2174948 INFO  (coreLoadExecutor-5651-thread-1) [    ] o.a.s.u.CommitTracker Hard AutoCommit: disabled
   [junit4]   2> 2174948 INFO  (coreLoadExecutor-5651-thread-1) [    ] o.a.s.u.CommitTracker Soft AutoCommit: disabled
   [junit4]   2> 2174948 INFO  (coreLoadExecutor-5651-thread-1) [    ] o.a.s.u.RandomMergePolicy RandomMergePolicy wrapping class org.apache.lucene.index.LogByteSizeMergePolicy: [LogByteSizeMergePolicy: minMergeSize=1677721, mergeFactor=32, maxMergeSize=2147483648, maxMergeSizeForForcedMerge=9223372036854775807, calibrateSizeByDeletes=true, maxMergeDocs=2147483647, maxCFSSegmentSizeMB=8.796093022207999E12, noCFSRatio=1.0]
   [junit4]   2> 2174949 INFO  (coreLoadExecutor-5651-thread-1) [    ] o.a.s.c.SolrDeletionPolicy SolrDeletionPolicy.onInit: commits: num=1
   [junit4]   2> 	commit{dir=MockDirectoryWrapper(RAMDirectory@61e26b lockFactory=org.apache.lucene.store.SingleInstanceLockFactory@59b8d4),segFN=segments_1,generation=1}
   [junit4]   2> 2174949 INFO  (coreLoadExecutor-5651-thread-1) [    ] o.a.s.c.SolrDeletionPolicy newest commit generation = 1
   [junit4]   2> 2174949 INFO  (coreLoadExecutor-5651-thread-1) [    ] o.a.s.s.SolrIndexSearcher Opening [Searcher@c50f19[collection1] main]
   [junit4]   2> 2174949 INFO  (coreLoadExecutor-5651-thread-1) [    ] o.a.s.c.c.ZkStateReader Load collection config from: [/collections/control_collection]
   [junit4]   2> 2174950 INFO  (coreLoadExecutor-5651-thread-1) [    ] o.a.s.c.c.ZkStateReader path=[/collections/control_collection] [configName]=[conf1] specified config exists in ZooKeeper
   [junit4]   2> 2174950 INFO  (coreLoadExecutor-5651-thread-1) [    ] o.a.s.r.ManagedResourceStorage Setting up ZooKeeper-based storage for the RestManager with znodeBase: /configs/conf1
   [junit4]   2> 2174950 INFO  (coreLoadExecutor-5651-thread-1) [    ] o.a.s.r.ManagedResourceStorage Configured ZooKeeperStorageIO with znodeBase: /configs/conf1
   [junit4]   2> 2174950 INFO  (coreLoadExecutor-5651-thread-1) [    ] o.a.s.r.RestManager Initializing RestManager with initArgs: {}
   [junit4]   2> 2174950 INFO  (coreLoadExecutor-5651-thread-1) [    ] o.a.s.r.ManagedResourceStorage Reading _rest_managed.json using ZooKeeperStorageIO:path=/configs/conf1
   [junit4]   2> 2174950 INFO  (coreLoadExecutor-5651-thread-1) [    ] o.a.s.r.ManagedResourceStorage No data found for znode /configs/conf1/_rest_managed.json
   [junit4]   2> 2174950 INFO  (coreLoadExecutor-5651-thread-1) [    ] o.a.s.r.ManagedResourceStorage Loaded null at path _rest_managed.json using ZooKeeperStorageIO:path=/configs/conf1
   [junit4]   2> 2174950 INFO  (coreLoadExecutor-5651-thread-1) [    ] o.a.s.r.RestManager Initializing 0 registered ManagedResources
   [junit4]   2> 2174950 INFO  (coreLoadExecutor-5651-thread-1) [    ] o.a.s.h.ReplicationHandler Commits will be reserved for  10000
   [junit4]   2> 2174951 INFO  (searcherExecutor-5652-thread-1) [    ] o.a.s.c.SolrCore [collection1] Registered new searcher Searcher@c50f19[collection1] main{ExitableDirectoryReader(UninvertingDirectoryReader())}
   [junit4]   2> 2174951 INFO  (coreLoadExecutor-5651-thread-1) [    ] o.a.s.u.UpdateLog Looking up max value of version field to seed version buckets
   [junit4]   2> 2174951 INFO  (coreLoadExecutor-5651-thread-1) [    ] o.a.s.u.VersionInfo Refreshing highest value of _version_ for 65536 version buckets from index
   [junit4]   2> 2174951 INFO  (coreLoadExecutor-5651-thread-1) [    ] o.a.s.u.VersionInfo No terms found for _version_, cannot seed version bucket highest value from index
   [junit4]   2> 2174951 INFO  (coreLoadExecutor-5651-thread-1) [    ] o.a.s.u.UpdateLog Could not find max version in index or recent updates, using new clock 1537392277521956864
   [junit4]   2> 2174952 INFO  (coreLoadExecutor-5651-thread-1) [    ] o.a.s.u.UpdateLog Took 1.0ms to seed version buckets with highest version 1537392277521956864
   [junit4]   2> 2174952 INFO  (coreLoadExecutor-5651-thread-1) [    ] o.a.s.c.ZkController watch zkdir /configs/conf1
   [junit4]   2> 2174953 INFO  (coreLoadExecutor-5651-thread-1) [    ] o.a.s.c.CoreContainer registering core: collection1
   [junit4]   2> 2174953 INFO  (coreZkRegister-5645-thread-1) [    ] o.a.s.c.ZkController Register replica - core:collection1 address:https://127.0.0.1:46064 collection:control_collection shard:shard1
   [junit4]   2> 2174953 INFO  (coreZkRegister-5645-thread-1) [    ] o.a.s.c.c.SolrZkClient makePath: /collections/control_collection/leader_elect/shard1/election
   [junit4]   2> 2174954 INFO  (coreZkRegister-5645-thread-1) [    ] o.a.s.c.LeaderElector Joined leadership election with path: /collections/control_collection/leader_elect/shard1/election/96087017251667973-core_node1-n_0000000000
   [junit4]   2> 2174954 INFO  (coreZkRegister-5645-thread-1) [    ] o.a.s.c.ShardLeaderElectionContext Running the leader process for shard=shard1 and weAreReplacement=false and leaderVoteWait=10000
   [junit4]   2> 2174955 INFO  (coreZkRegister-5645-thread-1) [    ] o.a.s.c.ShardLeaderElectionContext Enough replicas found to continue.
   [junit4]   2> 2174955 INFO  (coreZkRegister-5645-thread-1) [    ] o.a.s.c.ShardLeaderElectionContext I may be the new leader - try and sync
   [junit4]   2> 2174955 INFO  (OverseerStateUpdate-96087017251667973-127.0.0.1:46064_-n_0000000000) [    ] o.a.s.c.Overseer processMessage: queueSize: 1, message = {
   [junit4]   2>   "operation":"leader",
   [junit4]   2>   "shard":"shard1",
   [junit4]   2>   "collection":"control_collection"} current state version: 1
   [junit4]   2> 2174955 INFO  (coreZkRegister-5645-thread-1) [    ] o.a.s.c.SyncStrategy Sync replicas to https://127.0.0.1:46064/collection1/
   [junit4]   2> 2174955 INFO  (coreZkRegister-5645-thread-1) [    ] o.a.s.c.SyncStrategy Sync Success - now sync replicas to me
   [junit4]   2> 2174955 INFO  (coreZkRegister-5645-thread-1) [    ] o.a.s.c.SyncStrategy https://127.0.0.1:46064/collection1/ has no replicas
   [junit4]   2> 2174955 INFO  (coreZkRegister-5645-thread-1) [    ] o.a.s.c.c.SolrZkClient makePath: /collections/control_collection/leaders/shard1
   [junit4]   2> 2174956 INFO  (coreZkRegister-5645-thread-1) [    ] o.a.s.c.ShardLeaderElectionContextBase Creating leader registration node /collections/control_collection/leaders/shard1/leader after winning as /collections/control_collection/leader_elect/shard1/election/96087017251667973-core_node1-n_0000000000
   [junit4]   2> 2174957 INFO  (coreZkRegister-5645-thread-1) [    ] o.a.s.c.ShardLeaderElectionContext I am the new leader: https://127.0.0.1:46064/collection1/ shard1
   [junit4]   2> 2174958 INFO  (OverseerStateUpdate-96087017251667973-127.0.0.1:46064_-n_0000000000) [    ] o.a.s.c.Overseer processMessage: queueSize: 1, message = {
   [junit4]   2>   "operation":"leader",
   [junit4]   2>   "shard":"shard1",
   [junit4]   2>   "collection":"control_collection",
   [junit4]   2>   "base_url":"https://127.0.0.1:46064",
   [junit4]   2>   "core":"collection1",
   [junit4]   2>   "state":"active"} current state version: 1
   [junit4]   2> 2175059 INFO  (zkCallback-2604-thread-1) [    ] o.a.s.c.c.ZkStateReader A cluster state change: [WatchedEvent state:SyncConnected type:NodeDataChanged path:/clusterstate.json], has occurred - updating... (live nodes size: [1])
   [junit4]   2> 2175108 INFO  (coreZkRegister-5645-thread-1) [    ] o.a.s.c.ZkController We are https://127.0.0.1:46064/collection1/ and leader is https://127.0.0.1:46064/collection1/
   [junit4]   2> 2175108 INFO  (coreZkRegister-5645-thread-1) [    ] o.a.s.c.ZkController No LogReplay needed for core=collection1 baseURL=https://127.0.0.1:46064
   [junit4]   2> 2175108 INFO  (coreZkRegister-5645-thread-1) [    ] o.a.s.c.ZkController I am the leader, no recovery necessary
   [junit4]   2> 2175108 INFO  (coreZkRegister-5645-thread-1) [    ] o.a.s.c.ZkController publishing state=active
   [junit4]   2> 2175108 INFO  (coreZkRegister-5645-thread-1) [    ] o.a.s.c.ZkController numShards not found on descriptor - reading it from system property
   [junit4]   2> 2175109 INFO  (OverseerStateUpdate-96087017251667973-127.0.0.1:46064_-n_0000000000) [    ] o.a.s.c.Overseer processMessage: queueSize: 1, message = {
   [junit4]   2>   "core":"collection1",
   [junit4]   2>   "core_node_name":"core_node1",
   [junit4]   2>   "roles":null,
   [junit4]   2>   "base_url":"https://127.0.0.1:46064",
   [junit4]   2>   "node_name":"127.0.0.1:46064_",
   [junit4]   2>   "numShards":"1",
   [junit4]   2>   "state":"active",
   [junit4]   2>   "shard":"shard1",
   [junit4]   2>   "collection":"control_collection",
   [junit4]   2>   "operation":"state"} current state version: 2
   [junit4]   2> 2175109 INFO  (OverseerStateUpdate-96087017251667973-127.0.0.1:46064_-n_0000000000) [    ] o.a.s.c.o.ReplicaMutator Update state numShards=1 message={
   [junit4]   2>   "core":"collection1",
   [junit4]   2>   "core_node_name":"core_node1",
   [junit4]   2>   "roles":null,
   [junit4]   2>   "base_url":"https://127.0.0.1:46064",
   [junit4]   2>   "node_name":"127.0.0.1:46064_",
   [junit4]   2>   "numShards":"1",
   [junit4]   2>   "state":"active",
   [junit4]   2>   "shard":"shard1",
   [junit4]   2>   "collection":"control_collection",
   [junit4]   2>   "operation":"state"}
   [junit4]   2> 2175210 INFO  (zkCallback-2604-thread-2) [    ] o.a.s.c.c.ZkStateReader A cluster state change: [WatchedEvent state:SyncConnected type:NodeDataChanged path:/clusterstate.json], has occurred - updating... (live nodes size: [1])
   [junit4]   2> 2175290 INFO  (TEST-TestReqParamsAPI.test-seed#[79BE3FF9B8578C12]) [    ] o.a.s.c.c.SolrZkClient Using default ZkCredentialsProvider
   [junit4]   2> 2175291 INFO  (TEST-TestReqParamsAPI.test-seed#[79BE3FF9B8578C12]) [    ] o.a.s.c.c.ConnectionManager Waiting for client to connect to ZooKeeper
   [junit4]   2> 2175291 INFO  (zkCallback-2608-thread-1) [    ] o.a.s.c.c.ConnectionManager Watcher org.apache.solr.common.cloud.ConnectionManager@12d170c name:ZooKeeperConnection Watcher:127.0.0.1:41331/solr got event WatchedEvent state:SyncConnected type:None path:null path:null type:None
   [junit4]   2> 2175291 INFO  (TEST-TestReqParamsAPI.test-seed#[79BE3FF9B8578C12]) [    ] o.a.s.c.c.ConnectionManager Client is connected to ZooKeeper
   [junit4]   2> 2175292 INFO  (TEST-TestReqParamsAPI.test-seed#[79BE3FF9B8578C12]) [    ] o.a.s.c.c.SolrZkClient Using default ZkACLProvider
   [junit4]   2> 2175292 INFO  (TEST-TestReqParamsAPI.test-seed#[79BE3FF9B8578C12]) [    ] o.a.s.c.c.ZkStateReader Updating cluster state from ZooKeeper... 
   [junit4]   2> 2175292 INFO  (TEST-TestReqParamsAPI.test-seed#[79BE3FF9B8578C12]) [    ] o.a.s.c.c.ZkStateReader Loaded cluster properties: {urlScheme=https}
   [junit4]   2> 2175292 INFO  (TEST-TestReqParamsAPI.test-seed#[79BE3FF9B8578C12]) [    ] o.a.s.c.c.ZkStateReader Updated live nodes from ZooKeeper... (0) -> (1)
   [junit4]   2> 2175292 INFO  (TEST-TestReqParamsAPI.test-seed#[79BE3FF9B8578C12]) [    ] o.a.s.c.ChaosMonkey monkey: init - expire sessions:false cause connection loss:false
   [junit4]   2> 2175363 INFO  (TEST-TestReqParamsAPI.test-seed#[79BE3FF9B8578C12]) [    ] o.a.s.SolrTestCaseJ4 Writing core.properties file to /home/jenkins/workspace/Lucene-Solr-6.x-Linux/solr/build/solr-core/test/J1/temp/solr.handler.TestReqParamsAPI_79BE3FF9B8578C12-001/shard-1-001/cores/collection1
   [junit4]   2> 2175364 INFO  (TEST-TestReqParamsAPI.test-seed#[79BE3FF9B8578C12]) [    ] o.a.s.c.AbstractFullDistribZkTestBase create jetty 1 in directory /home/jenkins/workspace/Lucene-Solr-6.x-Linux/solr/build/solr-core/test/J1/temp/solr.handler.TestReqParamsAPI_79BE3FF9B8578C12-001/shard-1-001
   [junit4]   2> 2175364 INFO  (TEST-TestReqParamsAPI.test-seed#[79BE3FF9B8578C12]) [    ] o.e.j.s.Server jetty-9.3.8.v20160314
   [junit4]   2> 2175366 INFO  (TEST-TestReqParamsAPI.test-seed#[79BE3FF9B8578C12]) [    ] o.e.j.s.h.ContextHandler Started o.e.j.s.ServletContextHandler@eebad7{/,null,AVAILABLE}
   [junit4]   2> 2175366 INFO  (TEST-TestReqParamsAPI.test-seed#[79BE3FF9B8578C12]) [    ] o.e.j.s.ServerConnector Started ServerConnector@1d4405e{SSL,[ssl, http/1.1]}{127.0.0.1:36231}
   [junit4]   2> 2175366 INFO  (TEST-TestReqParamsAPI.test-seed#[79BE3FF9B8578C12]) [    ] o.e.j.s.Server Started @2177469ms
   [junit4]   2> 2175366 INFO  (TEST-TestReqParamsAPI.test-seed#[79BE3FF9B8578C12]) [    ] o.a.s.c.s.e.JettySolrRunner Jetty properties: {hostContext=/, solrconfig=solrconfig.xml, solr.data.dir=/home/jenkins/workspace/Lucene-Solr-6.x-Linux/solr/build/solr-core/test/J1/temp/solr.handler.TestReqParamsAPI_79BE3FF9B8578C12-001/tempDir-001/jetty1, hostPort=36231, coreRootDirectory=/home/jenkins/workspace/Lucene-Solr-6.x-Linux/solr/build/solr-core/test/J1/temp/solr.handler.TestReqParamsAPI_79BE3FF9B8578C12-001/shard-1-001/cores}
   [junit4]   2> 2175366 INFO  (TEST-TestReqParamsAPI.test-seed#[79BE3FF9B8578C12]) [    ] o.a.s.s.SolrDispatchFilter SolrDispatchFilter.init(): jdk.internal.loader.ClassLoaders$AppClassLoader@1a10788
   [junit4]   2> 2175367 INFO  (TEST-TestReqParamsAPI.test-seed#[79BE3FF9B8578C12]) [    ] o.a.s.c.SolrResourceLoader new SolrResourceLoader for directory: '/home/jenkins/workspace/Lucene-Solr-6.x-Linux/solr/build/solr-core/test/J1/temp/solr.handler.TestReqParamsAPI_79BE3FF9B8578C12-001/shard-1-001'
   [junit4]   2> 2175367 INFO  (TEST-TestReqParamsAPI.test-seed#[79BE3FF9B8578C12]) [    ] o.a.s.c.SolrResourceLoader JNDI not configured for solr (NoInitialContextEx)
   [junit4]   2> 2175367 INFO  (TEST-TestReqParamsAPI.test-seed#[79BE3FF9B8578C12]) [    ] o.a.s.c.SolrResourceLoader solr home defaulted to 'solr/' (could not find system property or JNDI)
   [junit4]   2> 2175367 INFO  (TEST-TestReqParamsAPI.test-seed#[79BE3FF9B8578C12]) [    ] o.a.s.c.c.SolrZkClient Using default ZkCredentialsProvider
   [junit4]   2> 2175367 INFO  (TEST-TestReqParamsAPI.test-seed#[79BE3FF9B8578C12]) [    ] o.a.s.c.c.ConnectionManager Waiting for client to connect to ZooKeeper
   [junit4]   2> 2175368 INFO  (zkCallback-2609-thread-1) [    ] o.a.s.c.c.ConnectionManager Watcher org.apache.solr.common.cloud.ConnectionManager@72d9da name:ZooKeeperConnection Watcher:127.0.0.1:41331/solr got event WatchedEvent state:SyncConnected type:None path:null path:null type:None
   [junit4]   2> 2175368 INFO  (TEST-TestReqParamsAPI.test-seed#[79BE3FF9B8578C12]) [    ] o.a.s.c.c.ConnectionManager Client is connected to ZooKeeper
   [junit4]   2> 2175368 INFO  (TEST-TestReqParamsAPI.test-seed#[79BE3FF9B8578C12]) [    ] o.a.s.c.c.SolrZkClient Using default ZkACLProvider
   [junit4]   2> 2175369 INFO  (TEST-TestReqParamsAPI.test-seed#[79BE3FF9B8578C12]) [    ] o.a.s.s.SolrDispatchFilter Loading solr.xml from SolrHome (not found in ZooKeeper)
   [junit4]   2> 2175369 INFO  (TEST-TestReqParamsAPI.test-seed#[79BE3FF9B8578C12]) [    ] o.a.s.c.SolrXmlConfig Loading container configuration from /home/jenkins/workspace/Lucene-Solr-6.x-Linux/solr/build/solr-core/test/J1/temp/solr.handler.TestReqParamsAPI_79BE3FF9B8578C12-001/shard-1-001/solr.xml
   [junit4]   2> 2175372 INFO  (TEST-TestReqParamsAPI.test-seed#[79BE3FF9B8578C12]) [    ] o.a.s.c.CorePropertiesLocator Config-defined core root directory: /home/jenkins/workspace/Lucene-Solr-6.x-Linux/solr/build/solr-core/test/J1/temp/solr.handler.TestReqParamsAPI_79BE3FF9B8578C12-001/shard-1-001/cores
   [junit4]   2> 2175372 INFO  (TEST-TestReqParamsAPI.test-seed#[79BE3FF9B8578C12]) [    ] o.a.s.c.CoreContainer New CoreContainer 22336970
   [junit4]   2> 2175372 INFO  (TEST-TestReqParamsAPI.test-seed#[79BE3FF9B8578C12]) [    ] o.a.s.c.CoreContainer Loading cores into CoreContainer [instanceDir=/home/jenkins/workspace/Lucene-Solr-6.x-Linux/solr/build/solr-core/test/J1/temp/solr.handler.TestReqParamsAPI_79BE3FF9B8578C12-001/shard-1-001]
   [junit4]   2> 2175372 WARN  (TEST-TestReqParamsAPI.test-seed#[79BE3FF9B8578C12]) [    ] o.a.s.c.CoreContainer Couldn't add files from /home/jenkins/workspace/Lucene-Solr-6.x-Linux/solr/build/solr-core/test/J1/temp/solr.handler.TestReqParamsAPI_79BE3FF9B8578C12-001/shard-1-001/lib to classpath: /home/jenkins/workspace/Lucene-Solr-6.x-Linux/solr/build/solr-core/test/J1/temp/solr.handler.TestReqParamsAPI_79BE3FF9B8578C12-001/shard-1-001/lib
   [junit4]   2> 2175372 INFO  (TEST-TestReqParamsAPI.test-seed#[79BE3FF9B8578C12]) [    ] o.a.s.h.c.HttpShardHandlerFactory created with socketTimeout : 90000,urlScheme : ,connTimeout : 15000,maxConnectionsPerHost : 20,maxConnections : 10000,corePoolSize : 0,maximumPoolSize : 2147483647,maxThreadIdleTime : 5,sizeOfQueue : -1,fairnessPolicy : false,useRetries : false,
   [junit4]   2> 2175373 INFO  (TEST-TestReqParamsAPI.test-seed#[79BE3FF9B8578C12]) [    ] o.a.s.u.UpdateShardHandler Creating UpdateShardHandler HTTP client with params: socketTimeout=340000&connTimeout=45000&retry=true
   [junit4]   2> 2175373 INFO  (TEST-TestReqParamsAPI.test-seed#[79BE3FF9B8578C12]) [    ] o.a.s.l.LogWatcher SLF4J impl is org.slf4j.impl.Log4jLoggerFactory
   [junit4]   2> 2175374 INFO  (TEST-TestReqParamsAPI.test-seed#[79BE3FF9B8578C12]) [    ] o.a.s.l.LogWatcher Registering Log Listener [Log4j (org.slf4j.impl.Log4jLoggerFactory)]
   [junit4]   2> 2175374 INFO  (TEST-TestReqParamsAPI.test-seed#[79BE3FF9B8578C12]) [    ] o.a.s.c.ZkContainer Zookeeper client=127.0.0.1:41331/solr
   [junit4]   2> 2175374 INFO  (TEST-TestReqParamsAPI.test-seed#[79BE3FF9B8578C12]) [    ] o.a.s.c.ZkController zkHost includes chroot
   [junit4]   2> 2175374 INFO  (TEST-TestReqParamsAPI.test-seed#[79BE3FF9B8578C12]) [    ] o.a.s.c.c.SolrZkClient Using default ZkCredentialsProvider
   [junit4]   2> 2175374 INFO  (TEST-TestReqParamsAPI.test-seed#[79BE3FF9B8578C12]) [    ] o.a.s.c.c.ConnectionManager Waiting for client to connect to ZooKeeper
   [junit4]   2> 2175375 INFO  (zkCallback-2612-thread-1) [    ] o.a.s.c.c.ConnectionManager Watcher org.apache.solr.common.cloud.ConnectionManager@1dacb0a name:ZooKeeperConnection Watcher:127.0.0.1:41331 got event WatchedEvent state:SyncConnected type:None path:null path:null type:None
   [junit4]   2> 2175375 INFO  (TEST-TestReqParamsAPI.test-seed#[79BE3FF9B8578C12]) [    ] o.a.s.c.c.ConnectionManager Client is connected to ZooKeeper
   [junit4]   2> 2175375 INFO  (TEST-TestReqParamsAPI.test-seed#[79BE3FF9B8578C12]) [    ] o.a.s.c.c.SolrZkClient Using default ZkACLProvider
   [junit4]   2> 2175376 INFO  (TEST-TestReqParamsAPI.test-seed#[79BE3FF9B8578C12]) [    ] o.a.s.c.ZkController Added new OnReconnect listener org.apache.solr.cloud.ZkController$$Lambda$180/11341953@17d4852
   [junit4]   2> 2175376 INFO  (TEST-TestReqParamsAPI.test-seed#[79BE3FF9B8578C12]) [    ] o.a.s.c.c.ConnectionManager Waiting for client to connect to ZooKeeper
   [junit4]   2> 2175376 INFO  (zkCallback-2613-thread-1) [    ] o.a.s.c.c.ConnectionManager Watcher org.apache.solr.common.cloud.ConnectionManager@d8f7c7 name:ZooKeeperConnection Watcher:127.0.0.1:41331/solr got event WatchedEvent state:SyncConnected type:None path:null path:null type:None
   [junit4]   2> 2175376 INFO  (TEST-TestReqParamsAPI.test-seed#[79BE3FF9B8578C12]) [    ] o.a.s.c.c.ConnectionManager Client is connected to ZooKeeper
   [junit4]   2> 2175379 INFO  (TEST-TestReqParamsAPI.test-seed#[79BE3FF9B8578C12]) [    ] o.a.s.c.c.ZkStateReader Updating cluster state from ZooKeeper... 
   [junit4]   2> 2175379 INFO  (TEST-TestReqParamsAPI.test-seed#[79BE3FF9B8578C12]) [    ] o.a.s.c.c.ZkStateReader Loaded cluster properties: {urlScheme=https}
   [junit4]   2> 2175379 INFO  (TEST-TestReqParamsAPI.test-seed#[79BE3FF9B8578C12]) [    ] o.a.s.c.c.ZkStateReader Updated live nodes from ZooKeeper... (0) -> (1)
   [junit4]   2> 2175380 INFO  (TEST-TestReqParamsAPI.test-seed#[79BE3FF9B8578C12]) [    ] o.a.s.c.Overseer Overseer (id=null) closing
   [junit4]   2> 2175380 INFO  (TEST-TestReqParamsAPI.test-seed#[79BE3FF9B8578C12]) [    ] o.a.s.c.LeaderElector Joined leadership election with path: /overseer_elect/election/96087017251667977-127.0.0.1:36231_-n_0000000001
   [junit4]   2> 2175381 INFO  (TEST-TestReqParamsAPI.test-seed#[79BE3FF9B8578C12]) [    ] o.a.s.c.LeaderElector Watching path /overseer_elect/election/96087017251667973-127.0.0.1:46064_-n_0000000000 to know if I could be the leader
   [junit4]   2> 2175381 INFO  (TEST-TestReqParamsAPI.test-seed#[79BE3FF9B8578C12]) [    ] o.a.s.c.ZkController Publish node=127.0.0.1:36231_ as DOWN
   [junit4]   2> 2175381 INFO  (OverseerStateUpdate-96087017251667973-127.0.0.1:46064_-n_0000000000) [    ] o.a.s.c.Overseer processMessage: queueSize: 1, message = {
   [junit4]   2>   "operation":"downnode",
   [junit4]   2>   "node_name":"127.0.0.1:36231_"} current state version: 3
   [junit4]   2> 2175381 INFO  (OverseerStateUpdate-96087017251667973-127.0.0.1:46064_-n_0000000000) [    ] o.a.s.c.o.NodeMutator DownNode state invoked for node: 127.0.0.1:36231_
   [junit4]   2> 2175482 INFO  (zkCallback-2604-thread-2) [    ] o.a.s.c.c.ZkStateReader A cluster state change: [WatchedEvent state:SyncConnected type:NodeDataChanged path:/clusterstate.json], has occurred - updating... (live nodes size: [1])
   [junit4]   2> 2175482 INFO  (zkCallback-2608-thread-1) [    ] o.a.s.c.c.ZkStateReader A cluster state change: [WatchedEvent state:SyncConnected type:NodeDataChanged path:/clusterstate.json], has occurred - updating... (live nodes size: [1])
   [junit4]   2> 2175482 INFO  (zkCallback-2613-thread-1) [    ] o.a.s.c.c.ZkStateReader A cluster state change: [WatchedEvent state:SyncConnected type:NodeDataChanged path:/clusterstate.json], has occurred - updating... (live nodes size: [1])
   [junit4]   2> 2176381 INFO  (TEST-TestReqParamsAPI.test-seed#[79BE3FF9B8578C12]) [    ] o.a.s.c.ZkController Register node as live in ZooKeeper:/live_nodes/127.0.0.1:36231_
   [junit4]   2> 2176382 INFO  (TEST-TestReqParamsAPI.test-seed#[79BE3FF9B8578C12]) [    ] o.a.s.c.c.SolrZkClient makePath: /live_nodes/127.0.0.1:36231_
   [junit4]   2> 2176382 INFO  (zkCallback-2613-thread-1) [    ] o.a.s.c.c.ZkStateReader A live node change: [WatchedEvent state:SyncConnected type:NodeChildrenChanged path:/live_nodes], has occurred - updating... (live nodes size: [1])
   [junit4]   2> 2176382 INFO  (zkCallback-2608-thread-1) [    ] o.a.s.c.c.ZkStateReader A live node change: [WatchedEvent state:SyncConnected type:NodeChildrenChanged path:/live_nodes], has occurred - updating... (live nodes size: [1])
   [junit4]   2> 2176382 INFO  (zkCallback-2604-thread-2) [    ] o.a.s.c.c.ZkStateReader A live node change: [WatchedEvent state:SyncConnected type:NodeChildrenChanged path:/live_nodes], has occurred - updating... (live nodes size: [1])
   [junit4]   2> 2176382 INFO  (zkCallback-2613-thread-1) [    ] o.a.s.c.c.ZkStateReader Updated live nodes from ZooKeeper... (1) -> (2)
   [junit4]   2> 2176382 INFO  (zkCallback-2608-thread-1) [    ] o.a.s.c.c.ZkStateReader Updated live nodes from ZooKeeper... (1) -> (2)
   [junit4]   2> 2176382 INFO  (zkCallback-2604-thread-2) [    ] o.a.s.c.c.ZkStateReader Updated live nodes from ZooKeeper... (1) -> (2)
   [junit4]   2> 2176407 INFO  (TEST-TestReqParamsAPI.test-seed#[79BE3FF9B8578C12]) [    ] o.a.s.c.CoreContainer Security conf doesn't exist. Skipping setup for authorization module.
   [junit4]   2> 2176407 INFO  (TEST-TestReqParamsAPI.test-seed#[79BE3FF9B8578C12]) [    ] o.a.s.c.CoreContainer No authentication plugin used.
   [junit4]   2> 2176408 INFO  (TEST-TestReqParamsAPI.test-seed#[79BE3FF9B8578C12]) [    ] o.a.s.c.CorePropertiesLocator Looking for core definitions underneath /home/jenkins/workspace/Lucene-Solr-6.x-Linux/solr/build/solr-core/test/J1/temp/solr.handler.TestReqParamsAPI_79BE3FF9B8578C12-001/shard-1-001/cores
   [junit4]   2> 2176408 INFO  (TEST-TestReqParamsAPI.test-seed#[79BE3FF9B8578C12]) [    ] o.a.s.c.CoreDescriptor Created CoreDescriptor: {schema=schema.xml, dataDir=data/, collection=collection1, loadOnStartup=true, coreNodeName=, transient=false, name=collection1, shard=, config=solrconfig.xml, configSetProperties=configsetprops.json}
   [junit4]   2> 2176408 INFO  (TEST-TestReqParamsAPI.test-seed#[79BE3FF9B8578C12]) [    ] o.a.s.c.CorePropertiesLocator Found core collection1 in /home/jenkins/workspace/Lucene-Solr-6.x-Linux/solr/build/solr-core/test/J1/temp/solr.handler.TestReqParamsAPI_79BE3FF9B8578C12-001/shard-1-001/cores/collection1
   [junit4]   2> 2176408 INFO  (TEST-TestReqParamsAPI.test-seed#[79BE3FF9B8578C12]) [    ] o.a.s.c.CorePropertiesLocator Found 1 core definitions
   [junit4]   2> 2176409 INFO  (TEST-TestReqParamsAPI.test-seed#[79BE3FF9B8578C12]) [    ] o.a.s.s.SolrDispatchFilter user.dir=/home/jenkins/workspace/Lucene-Solr-6.x-Linux/solr/build/solr-core/test/J1
   [junit4]   2> 2176409 INFO  (TEST-TestReqParamsAPI.test-seed#[79BE3FF9B8578C12]) [    ] o.a.s.s.SolrDispatchFilter SolrDispatchFilter.init() done
   [junit4]   2> 2176409 INFO  (coreLoadExecutor-5662-thread-1) [    ] o.a.s.c.ZkController publishing state=down
   [junit4]   2> 2176409 INFO  (coreLoadExecutor-5662-thread-1) [    ] o.a.s.c.ZkController numShards not found on descriptor - reading it from system property
   [junit4]   2> 2176410 INFO  (coreLoadExecutor-5662-thread-1) [    ] o.a.s.c.ZkController Collection collection1 not visible yet, but flagging it so a watch is registered when it becomes visible
   [junit4]   2> 2176410 INFO  (OverseerStateUpdate-96087017251667973-127.0.0.1:46064_-n_0000000000) [    ] o.a.s.c.Overseer processMessage: queueSize: 1, message = {
   [junit4]   2>   "core":"collection1",
   [junit4]   2>   "roles":null,
   [junit4]   2>   "base_url":"https://127.0.0.1:36231",
   [junit4]   2>   "node_name":"127.0.0.1:36231_",
   [junit4]   2>   "numShards":"2",
   [junit4]   2>   "state":"down",
   [junit4]   2>   "shard":null,
   [junit4]   2>   "collection":"collection1",
   [junit4]   2>   "operation":"state"} current state version: 4
   [junit4]   2> 2176410 INFO  (coreLoadExecutor-5662-thread-1) [    ] o.a.s.c.c.ZkStateReader Deleting data for [collection1]
   [junit4]   2> 2176410 INFO  (OverseerStateUpdate-96087017251667973-127.0.0.1:46064_-n_0000000000) [    ] o.a.s.c.o.ReplicaMutator Update state numShards=2 message={
   [junit4]   2>   "core":"collection1",
   [junit4]   2>   "roles":null,
   [junit4]   2>   "base_url":"https://127.0.0.1:36231",
   [junit4]   2>   "node_name":"127.0.0.1:36231_",
   [junit4]   2>   "numShards":"2",
   [junit4]   2>   "state":"down",
   [junit4]   2>   "shard":null,
   [junit4]   2>   "collection":"collection1",
   [junit4]   2>   "operation":"state"}
   [junit4]   2> 2176410 INFO  (OverseerStateUpdate-96087017251667973-127.0.0.1:46064_-n_0000000000) [    ] o.a.s.c.o.ClusterStateMutator building a new cName: collection1
   [junit4]   2> 2176410 INFO  (OverseerStateUpdate-96087017251667973-127.0.0.1:46064_-n_0000000000) [    ] o.a.s.c.o.ReplicaMutator Assigning new node to shard shard=shard2
   [junit4]   2> 2176410 INFO  (coreLoadExecutor-5662-thread-1) [    ] o.a.s.c.ZkController look for our core node name
   [junit4]   2> 2176511 INFO  (zkCallback-2604-thread-1) [    ] o.a.s.c.c.ZkStateReader A cluster state change: [WatchedEvent state:SyncConnected type:NodeDataChanged path:/clusterstate.json], has occurred - updating... (live nodes size: [2])
   [junit4]   2> 2176511 INFO  (zkCallback-2613-thread-1) [    ] o.a.s.c.c.ZkStateReader A cluster state change: [WatchedEvent state:SyncConnected type:NodeDataChanged path:/clusterstate.json], has occurred - updating... (live nodes size: [2])
   [junit4]   2> 2176511 INFO  (zkCallback-2608-thread-1) [    ] o.a.s.c.c.ZkStateReader A cluster state change: [WatchedEvent state:SyncConnected type:NodeDataChanged path:/clusterstate.json], has occurred - updating... (live nodes size: [2])
   [junit4]   2> 2177411 INFO  (coreLoadExecutor-5662-thread-1) [    ] o.a.s.c.ZkController waiting to find shard id in clusterstate for collection1
   [junit4]   2> 2177411 INFO  (coreLoadExecutor-5662-thread-1) [    ] o.a.s.c.ZkController Check for collection zkNode:collection1
   [junit4]   2> 2177411 INFO  (coreLoadExecutor-5662-thread-1) [    ] o.a.s.c.ZkController Collection zkNode exists
   [junit4]   2> 2177411 INFO  (coreLoadExecutor-5662-thread-1) [    ] o.a.s.c.c.ZkStateReader Load collection config from: [/collections/collection1]
   [junit4]   2> 2177411 INFO  (coreLoadExecutor-5662-thread-1) [    ] o.a.s.c.c.ZkStateReader path=[/collections/collection1] [configName]=[conf1] specified config exists in ZooKeeper
   [junit4]   2> 2177411 INFO  (coreLoadExecutor-5662-thread-1) [    ] o.a.s.c.SolrResourceLoader new SolrResourceLoader for directory: '/home/jenkins/workspace/Lucene-Solr-6.x-Linux/solr/build/solr-core/test/J1/temp/solr.handler.TestReqParamsAPI_79BE3FF9B8578C12-001/shard-1-001/cores/collection1'
   [junit4]   2> 2177412 INFO  (coreLoadExecutor-5662-thread-1) [    ] o.a.s.c.SolrResourceLoader JNDI not configured for solr (NoInitialContextEx)
   [junit4]   2> 2177412 INFO  (coreLoadExecutor-5662-thread-1) [    ] o.a.s.c.SolrResourceLoader solr home defaulted to 'solr/' (could not find system property or JNDI)
   [junit4]   2> 2177412 INFO  (coreLoadExecutor-5662-thread-1) [    ] o.a.s.c.Config loaded config solrconfig.xml with version 0 
   [junit4]   2> 2177415 INFO  (coreLoadExecutor-5662-thread-1) [    ] o.a.s.c.SolrConfig current version of requestparams : -1
   [junit4]   2> 2177423 INFO  (coreLoadExecutor-5662-thread-1) [    ] o.a.s.c.SolrConfig Using Lucene MatchVersion: 6.2.0
   [junit4]   2> 2177432 INFO  (coreLoadExecutor-5662-thread-1) [    ] o.a.s.c.SolrConfig Loaded SolrConfig: solrconfig.xml
   [junit4]   2> 2177435 INFO  (coreLoadExecutor-5662-thread-1) [    ] o.a.s.s.IndexSchema [collection1] Schema name=test
   [junit4]   2> 2177527 INFO  (coreLoadExecutor-5662-thread-1) [    ] o.a.s.s.OpenExchangeRatesOrgProvider Initialized with rates=open-exchange-rates.json, refreshInterval=1440.
   [junit4]   2> 2177530 INFO  (coreLoadExecutor-5662-thread-1) [    ] o.a.s.s.IndexSchema default search field in schema is text
   [junit4]   2> 2177531 INFO  (coreLoadExecutor-5662-thread-1) [    ] o.a.s.s.IndexSchema unique key field: id
   [junit4]   2> 2177539 INFO  (coreLoadExecutor-5662-thread-1) [    ] o.a.s.s.FileExchangeRateProvider Reloading exchange rates from file currency.xml
   [junit4]   2> 2177540 INFO  (coreLoadExecutor-5662-thread-1) [    ] o.a.s.s.FileExchangeRateProvider Reloading exchange rates from file currency.xml
   [junit4]   2> 2177542 INFO  (coreLoadExecutor-5662-thread-1) [    ] o.a.s.s.OpenExchangeRatesOrgProvider Reloading exchange rates from open-exchange-rates.json
   [junit4]   2> 2177542 INFO  (coreLoadExecutor-5662-thread-1) [    ] o.a.s.s.OpenExchangeRatesOrgProvider Reloading exchange rates from open-exchange-rates.json
   [junit4]   2> 2177543 INFO  (coreLoadExecutor-5662-thread-1) [    ] o.a.s.c.ConfigSetProperties Did not find ConfigSet properties, assuming default properties: Can't find resource 'configsetprops.json' in classpath or '/configs/conf1', cwd=/home/jenkins/workspace/Lucene-Solr-6.x-Linux/solr/build/solr-core/test/J1
   [junit4]   2> 2177543 INFO  (coreLoadExecutor-5662-thread-1) [    ] o.a.s.c.CoreContainer Creating SolrCore 'collection1' using configuration from collection collection1
   [junit4]   2> 2177543 INFO  (coreLoadExecutor-5662-thread-1) [    ] o.a.s.c.SolrCore org.apache.solr.core.MockDirectoryFactory
   [junit4]   2> 2177543 INFO  (coreLoadExecutor-5662-thread-1) [    ] o.a.s.c.SolrCore [[collection1] ] Opening new SolrCore at [/home/jenkins/workspace/Lucene-Solr-6.x-Linux/solr/build/solr-core/test/J1/temp/solr.handler.TestReqParamsAPI_79BE3FF9B8578C12-001/shard-1-001/cores/collection1], dataDir=[/home/jenkins/workspace/Lucene-Solr-6.x-Linux/solr/build/solr-core/test/J1/temp/solr.handler.TestReqParamsAPI_79BE3FF9B8578C12-001/shard-1-001/cores/collection1/data/]
   [junit4]   2> 2177543 INFO  (coreLoadExecutor-5662-thread-1) [    ] o.a.s.c.JmxMonitoredMap JMX monitoring is enabled. Adding Solr mbeans to JMX Server: com.sun.jmx.mbeanserver.JmxMBeanServer@720629
   [junit4]   2> 2177544 INFO  (coreLoadExecutor-5662-thread-1) [    ] o.a.s.c.CachingDirectoryFactory return new directory for /home/jenkins/workspace/Lucene-Solr-6.x-Linux/solr/build/solr-core/test/J1/temp/solr.handler.TestReqParamsAPI_79BE3FF9B8578C12-001/shard-1-001/cores/collection1/data
   [junit4]   2> 2177544 INFO  (coreLoadExecutor-5662-thread-1) [    ] o.a.s.c.SolrCore New index directory detected: old=null new=/home/jenkins/workspace/Lucene-Solr-6.x-Linux/solr/build/solr-core/test/J1/temp/solr.handler.TestReqParamsAPI_79BE3FF9B8578C12-001/shard-1-001/cores/collection1/data/index/
   [junit4]   2> 2177544 WARN  (coreLoadExecutor-5662-thread-1) [    ] o.a.s.c.SolrCore [collection1] Solr index directory '/home/jenkins/workspace/Lucene-Solr-6.x-Linux/solr/build/solr-core/test/J1/temp/solr.handler.TestReqParamsAPI_79BE3FF9B8578C12-001/shard-1-001/cores/collection1/data/index' doesn't exist. Creating new index...
   [junit4]   2> 2177544 INFO  (coreLoadExecutor-5662-thread-1) [    ] o.a.s.c.CachingDirectoryFactory return new directory for /home/jenkins/workspace/Lucene-Solr-6.x-Linux/solr/build/solr-core/test/J1/temp/solr.handler.TestReqParamsAPI_79BE3FF9B8578C12-001/shard-1-001/cores/collection1/data/index
   [junit4]   2> 2177545 INFO  (coreLoadExecutor-5662-thread-1) [    ] o.a.s.u.RandomMergePolicy RandomMergePolicy wrapping class org.apache.lucene.index.TieredMergePolicy: [TieredMergePolicy: maxMergeAtOnce=17, maxMergeAtOnceExplicit=18, maxMergedSegmentMB=9.505859375, floorSegmentMB=0.205078125, forceMergeDeletesPctAllowed=16.152260197736293, segmentsPerTier=47.0, maxCFSSegmentSizeMB=8.796093022207999E12, noCFSRatio=1.0
   [junit4]   2> 2177545 INFO  (coreLoadExecutor-5662-thread-1) [    ] o.a.s.c.SolrDeletionPolicy SolrDeletionPolicy.onCommit: commits: num=1
   [junit4]   2> 	commit{dir=MockDirectoryWrapper(RAMDirectory@105a503 lockFactory=org.apache.lucene.store.SingleInstanceLockFactory@a38445),segFN=segments_1,generation=1}
   [junit4]   2> 2177545 INFO  (coreLoadExecutor-5662-thread-1) [    ] o.a.s.c.SolrDeletionPolicy newest commit generation = 1
   [junit4]   2> 2177545 INFO  (OldIndexDirectoryCleanupThreadForCore-collection1) [    ] o.a.s.c.SolrCore Looking for old index directories to cleanup for core collection1 in /home/jenkins/workspace/Lucene-Solr-6.x-Linux/solr/build/solr-core/test/J1/temp/solr.handler.TestReqParamsAPI_79BE3FF9B8578C12-001/shard-1-001/cores/collection1/data/
   [junit4]   2> 2177545 WARN  (OldIndexDirectoryCleanupThreadForCore-collection1) [    ] o.a.s.c.DirectoryFactory /home/jenkins/workspace/Lucene-Solr-6.x-Linux/solr/build/solr-core/test/J1/temp/solr.handler.TestReqParamsAPI_79BE3FF9B8578C12-001/shard-1-001/cores/collection1/data/ does not point to a valid data directory; skipping clean-up of old index directories.
   [junit4]   2> 2177548 INFO  (coreLoadExecutor-5662-thread-1) [    ] o.a.s.u.p.UpdateRequestProcessorChain creating updateRequestProcessorChain "nodistrib"
   [junit4]   2> 2177548 INFO  (coreLoadExecutor-5662-thread-1) [    ] o.a.s.u.p.UpdateRequestProcessorChain creating updateRequestProcessorChain "dedupe"
   [junit4]   2> 2177549 INFO  (coreLoadExecutor-5662-thread-1) [    ] o.a.s.u.p.UpdateRequestProcessorChain inserting DistributedUpdateProcessorFactory into updateRequestProcessorChain "dedupe"
   [junit4]   2> 2177549 INFO  (coreLoadExecutor-5662-thread-1) [    ] o.a.s.u.p.UpdateRequestProcessorChain creating updateRequestProcessorChain "stored_sig"
   [junit4]   2> 2177549 INFO  (coreLoadExecutor-5662-thread-1) [    ] o.a.s.u.p.UpdateRequestProcessorChain inserting DistributedUpdateProcessorFactory into updateRequestProcessorChain "stored_sig"
   [junit4]   2> 2177549 INFO  (coreLoadExecutor-5662-thread-1) [    ] o.a.s.u.p.UpdateRequestProcessorChain creating updateRequestProcessorChain "distrib-dup-test-chain-explicit"
   [junit4]   2> 2177549 INFO  (coreLoadExecutor-5662-thread-1) [    ] o.a.s.u.p.UpdateRequestProcessorChain creating updateRequestProcessorChain "distrib-dup-test-chain-implicit"
   [junit4]   2> 2177549 INFO  (coreLoadExecutor-5662-thread-1) [    ] o.a.s.u.p.UpdateRequestProcessorChain inserting DistributedUpdateProcessorFactory into updateRequestProcessorChain "distrib-dup-test-chain-implicit"
   [junit4]   2> 2177550 INFO  (coreLoadExecutor-5662-thread-1) [    ] o.a.s.c.SolrCore no updateRequestProcessorChain defined as default, creating implicit default
   [junit4]   2> 2177550 WARN  (coreLoadExecutor-5662-thread-1) [    ] o.a.s.c.RequestHandlers INVALID paramSet a in requestHandler {type = requestHandler,name = /dump,class = DumpRequestHandler,args = {defaults={a=A,b=B}}}
   [junit4]   2> 2177551 INFO  (coreLoadExecutor-5662-thread-1) [    ] o.a.s.h.l.XMLLoader xsltCacheLifetimeSeconds=60
   [junit4]   2> 2177552 INFO  (coreLoadExecutor-5662-thread-1) [    ] o.a.s.h.l.XMLLoader xsltCacheLifetimeSeconds=60
   [junit4]   2> 2177553 INFO  (coreLoadExecutor-5662-thread-1) [    ] o.a.s.h.l.XMLLoader xsltCacheLifetimeSeconds=60
   [junit4]   2> 2177554 INFO  (coreLoadExecutor-5662-thread-1) [    ] o.a.s.h.l.XMLLoader xsltCacheLifetimeSeconds=60
   [junit4]   2> 2177558 INFO  (coreLoadExecutor-5662-thread-1) [    ] o.a.s.c.RequestHandlers Registered paths: /admin/mbeans,standard,/update/json/docs,/admin/luke,/export,/get,/admin/properties,/update/json,/admin/threads,/dump,/update/csv,/sql,/graph,/admin/segments,/admin/system,/replication,/config,/stream,/schema,/admin/plugins,/admin/logging,/admin/ping,/update,/admin/file
   [junit4]   2> 2177558 INFO  (coreLoadExecutor-5662-thread-1) [    ] o.a.s.c.SolrCore Using default statsCache cache: org.apache.solr.search.stats.LocalStatsCache
   [junit4]   2> 2177558 INFO  (coreLoadExecutor-5662-thread-1) [    ] o.a.s.u.UpdateHandler Using UpdateLog implementation: org.apache.solr.update.UpdateLog
   [junit4]   2> 2177558 INFO  (coreLoadExecutor-5662-thread-1) [    ] o.a.s.u.UpdateLog Initializing UpdateLog: dataDir= defaultSyncLevel=FLUSH numRecordsToKeep=100 maxNumLogsToKeep=10 numVersionBuckets=65536
   [junit4]   2> 2177559 INFO  (coreLoadExecutor-5662-thread-1) [    ] o.a.s.u.CommitTracker Hard AutoCommit: disabled
   [junit4]   2> 2177559 INFO  (coreLoadExecutor-5662-thread-1) [    ] o.a.s.u.CommitTracker Soft AutoCommit: disabled
   [junit4]   2> 2177560 INFO  (coreLoadExecutor-5662-thread-1) [    ] o.a.s.u.RandomMergePolicy RandomMergePolicy wrapping class org.apache.lucene.index.LogByteSizeMergePolicy: [LogByteSizeMergePolicy: minMergeSize=1677721, mergeFactor=32, maxMergeSize=2147483648, maxMergeSizeForForcedMerge=9223372036854775807, calibrateSizeByDeletes=true, maxMergeDocs=2147483647, maxCFSSegmentSizeMB=8.796093022207999E12, noCFSRatio=1.0]
   [junit4]   2> 2177560 INFO  (coreLoadExecutor-5662-thread-1) [    ] o.a.s.c.SolrDeletionPolicy SolrDeletionPolicy.onInit: commits: num=1
   [junit4]   2> 	commit{dir=MockDirectoryWrapper(RAMDirectory@105a503 lockFactory=org.apache.lucene.store.SingleInstanceLockFactory@a38445),segFN=segments_1,generation=1}
   [junit4]   2> 2177560 INFO  (coreLoadExecutor-5662-thread-1) [    ] o.a.s.c.SolrDeletionPolicy newest commit generation = 1
   [junit4]   2> 2177560 INFO  (coreLoadExecutor-5662-thread-1) [    ] o.a.s.s.SolrIndexSearcher Opening [Searcher@64b8e6[collection1] main]
   [junit4]   2> 2177560 INFO  (coreLoadExecutor-5662-thread-1) [    ] o.a.s.c.c.ZkStateReader Load collection config from: [/collections/collection1]
   [junit4]   2> 2177560 INFO  (coreLoadExecutor-5662-thread-1) [    ] o.a.s.c.c.ZkStateReader path=[/collections/collection1] [configName]=[conf1] specified config exists in ZooKeeper
   [junit4]   2> 2177560 INFO  (coreLoadExecutor-5662-thread-1) [    ] o.a.s.r.ManagedResourceStorage Setting up ZooKeeper-based storage for the RestManager with znodeBase: /configs/conf1
   [junit4]   2> 2177561 INFO  (coreLoadExecutor-5662-thread-1) [    ] o.a.s.r.ManagedResourceStorage Configured ZooKeeperStorageIO with znodeBase: /configs/conf1
   [junit4]   2> 2177561 INFO  (coreLoadExecutor-5662-thread-1) [    ] o.a.s.r.RestManager Initializing RestManager with initArgs: {}
   [junit4]   2> 2177561 INFO  (coreLoadExecutor-5662-thread-1) [    ] o.a.s.r.ManagedResourceStorage Reading _rest_managed.json using ZooKeeperStorageIO:path=/configs/conf1
   [junit4]   2> 2177561 INFO  (coreLoadExecutor-5662-thread-1) [    ] o.a.s.r.ManagedResourceStorage No data found for znode /configs/conf1/_rest_managed.json
   [junit4]   2> 2177561 INFO  (coreLoadExecutor-5662-thread-1) [    ] o.a.s.r.ManagedResourceStorage Loaded null at path _rest_managed.json using ZooKeeperStorageIO:path=/configs/conf1
   [junit4]   2> 2177561 INFO  (coreLoadExecutor-5662-thread-1) [    ] o.a.s.r.RestManager Initializing 0 registered ManagedResources
   [junit4]   2> 2177561 INFO  (coreLoadExecutor-5662-thread-1) [    ] o.a.s.h.ReplicationHandler Commits will be reserved for  10000
   [junit4]   2> 2177562 INFO  (searcherExecutor-5663-thread-1) [    ] o.a.s.c.SolrCore [collection1] Registered new searcher Searcher@64b8e6[collection1] main{ExitableDirectoryReader(UninvertingDirectoryReader())}
   [junit4]   2> 2177562 INFO  (coreLoadExecutor-5662-thread-1) [    ] o.a.s.u.UpdateLog Looking up max value of version field to seed version buckets
   [junit4]   2> 2177562 INFO  (coreLoadExecutor-5662-thread-1) [    ] o.a.s.u.VersionInfo Refreshing highest value of _version_ for 65536 version buckets from index
   [junit4]   2> 2177562 INFO  (coreLoadExecutor-5662-thread-1) [    ] o.a.s.u.VersionInfo No terms found for _version_, cannot seed version bucket highest value from index
   [junit4]   2> 2177562 INFO  (coreLoadExecutor-5662-thread-1) [    ] o.a.s.u.UpdateLog Could not find max version in index or recent updates, using new clock 1537392280259788800
   [junit4]   2> 2177564 INFO  (coreLoadExecutor-5662-thread-1) [    ] o.a.s.u.UpdateLog Took 1.0ms to seed version buckets with highest version 1537392280259788800
   [junit4]   2> 2177564 INFO  (coreLoadExecutor-5662-thread-1) [    ] o.a.s.c.ZkController watch zkdir /configs/conf1
   [junit4]   2> 2177564 INFO  (coreLoadExecutor-5662-thread-1) [    ] o.a.s.c.CoreContainer registering core: collection1
   [junit4]   2> 2177565 INFO  (coreZkRegister-5657-thread-1) [    ] o.a.s.c.ZkController Register replica - core:collection1 address:https://127.0.0.1:36231 collection:collection1 shard:shard2
   [junit4]   2> 2177565 INFO  (coreZkRegister-5657-thread-1) [    ] o.a.s.c.c.SolrZkClient makePath: /collections/collection1/leader_elect/shard2/election
   [junit4]   2> 2177566 INFO  (coreZkRegister-5657-thread-1) [    ] o.a.s.c.LeaderElector Joined leadership election with path: /collections/collection1/leader_elect/shard2/election/96087017251667977-core_node1-n_0000000000
   [junit4]   2> 2177566 INFO  (coreZkRegister-5657-thread-1) [    ] o.a.s.c.ShardLeaderElectionContext Running the leader process for shard=shard2 and weAreReplacement=false and leaderVoteWait=10000
   [junit4]   2> 2177567 INFO  (coreZkRegister-5657-thread-1) [    ] o.a.s.c.ShardLeaderElectionContext Enough replicas found to continue.
   [junit4]   2> 2177567 INFO  (coreZkRegister-5657-thread-1) [    ] o.a.s.c.ShardLeaderElectionContext I may be the new leader - try and sync
   [junit4]   2> 2177567 INFO  (coreZkRegister-5657-thread-1) [    ] o.a.s.c.SyncStrategy Sync replicas to https://127.0.0.1:36231/collection1/
   [junit4]   2> 2177567 INFO  (coreZkRegister-5657-thread-1) [    ] o.a.s.c.SyncStrategy Sync Success - now sync replicas to me
   [junit4]   2> 2177567 INFO  (OverseerStateUpdate-96087017251667973-127.0.0.1:46064_-n_0000000000) [    ] o.a.s.c.Overseer processMessage: queueSize: 1, message = {
   [junit4]   2>   "operation":"leader",
   [junit4]   2>   "shard":"shard2",
   [junit4]   2>   "collection":"collection1"} current state version: 5
   [junit4]   2> 2177567 INFO  (coreZkRegister-5657-thread-1) [    ] o.a.s.c.SyncStrategy https://127.0.0.1:36231/collection1/ has no replicas
   [junit4]   2> 2177567 INFO  (coreZkRegister-5657-thread-1) [    ] o.a.s.c.c.SolrZkClient makePath: /collections/collection1/leaders/shard2
   [junit4]   2> 2177568 INFO  (coreZkRegister-5657-thread-1) [    ] o.a.s.c.ShardLeaderElectionContextBase Creating leader registration node /collections/collection1/leaders/shard2/leader after winning as /collections/collection1/leader_elect/shard2/election/96087017251667977-core_node1-n_0000000000
   [junit4]   2> 2177568 INFO  (coreZkRegister-5657-thread-1) [    ] o.a.s.c.ShardLeaderElectionContext I am the new leader: https://127.0.0.1:36231/collection1/ shard2
   [junit4]   2> 2177569 INFO  (OverseerStateUpdate-96087017251667973-127.0.0.1:46064_-n_0000000000) [    ] o.a.s.c.Overseer processMessage: queueSize: 1, message = {
   [junit4]   2>   "operation":"leader",
   [junit4]   2>   "shard":"shard2",
   [junit4]   2>   "collection":"collection1",
   [junit4]   2>   "base_url":"https://127.0.0.1:36231",
   [junit4]   2>   "core":"collection1",
   [junit4]   2>   "state":"active"} current state version: 5
   [junit4]   2> 2177670 INFO  (zkCallback-2604-thread-2) [    ] o.a.s.c.c.ZkStateReader A cluster state change: [WatchedEvent state:SyncConnected type:NodeDataChanged path:/clusterstate.json], has occurred - updating... (live nodes size: [2])
   [junit4]   2> 2177670 INFO  (zkCallback-2608-thread-1) [    ] o.a.s.c.c.ZkStateReader A cluster state change: [WatchedEvent state:SyncConnected type:NodeDataChanged path:/clusterstate.json], has occurred - updating... (live nodes size: [2])
   [junit4]   2> 2177670 INFO  (zkCallback-2613-thread-1) [    ] o.a.s.c.c.ZkStateReader A cluster state change: [WatchedEvent state:SyncConnected type:NodeDataChanged path:/clusterstate.json], has occurred - updating... (live nodes size: [2])
   [junit4]   2> 2177719 INFO  (coreZkRegister-5657-thread-1) [    ] o.a.s.c.ZkController We are https://127.0.0.1:36231/collection1/ and leader is https://127.0.0.1:36231/collection1/
   [junit4]   2> 2177719 INFO  (coreZkRegister-5657-thread-1) [    ] o.a.s.c.ZkController No LogReplay needed for core=collection1 baseURL=https://127.0.0.1:36231
   [junit4]   2> 2177719 INFO  (coreZkRegister-5657-thread-1) [    ] o.a.s.c.ZkController I am the leader, no recovery necessary
   [junit4]   2> 2177719 INFO  (coreZkRegister-5657-thread-1) [    ] o.a.s.c.ZkController publishing state=active
   [junit4]   2> 2177719 INFO  (coreZkRegister-5657-thread-1) [    ] o.a.s.c.ZkController numShards not found on descriptor - reading it from system property
   [junit4]   2> 2177720 INFO  (OverseerStateUpdate-96087017251667973-127.0.0.1:46064_-n_0000000000) [    ] o.a.s.c.Overseer processMessage: queueSize: 1, message = {
   [junit4]   2>   "core":"collection1",
   [junit4]   2>   "core_node_name":"core_node1",
   [junit4]   2>   "roles":null,
   [junit4]   2>   "base_url":"https://127.0.0.1:36231",
   [junit4]   2>   "node_name":"127.0.0.1:36231_",
   [junit4]   2>   "numShards":"2",
   [junit4]   2>   "state":"active",
   [junit4]   2>   "shard":"shard2",
   [junit4]   2>   "collection":"collection1",
   [junit4]   2>   "operation":"state"} current state version: 6
   [junit4]   2> 2177720 INFO  (OverseerStateUpdate-96087017251667973-127.0.0.1:46064_-n_0000000000) [    ] o.a.s.c.o.ReplicaMutator Update state numShards=2 message={
   [junit4]   2>   "core":"collection1",
   [junit4]   2>   "core_node_name":"core_node1",
   [junit4]   2>   "roles":null,
   [junit4]   2>   "base_url":"https://127.0.0.1:36231",
   [junit4]   2>   "node_name":"127.0.0.1:36231_",
   [junit4]   2>   "numShards":"2",
   [junit4]   2>   "state":"active",
   [junit4]   2>   "shard":"shard2",
   [junit4]   2>   "collection":"collection1",
   [junit4]   2>   "operation":"state"}
   [junit4]   2> 2177821 INFO  (zkCallback-2604-thread-2) [    ] o.a.s.c.c.ZkStateReader A cluster state change: [WatchedEvent state:SyncConnected type:NodeDataChanged path:/clusterstate.json], has occurred - updating... (live nodes size: [2])
   [junit4]   2

[...truncated too long message...]

7.0.0.1:41331 41331
   [junit4]   2> 2197122 WARN  (Thread-3923) [    ] o.a.s.c.ZkTestServer Watch limit violations: 
   [junit4]   2> Maximum concurrent create/delete watches above limit:
   [junit4]   2> 
   [junit4]   2> 	40	/solr/configs/conf1
   [junit4]   2> 	6	/solr/aliases.json
   [junit4]   2> 	5	/solr/security.json
   [junit4]   2> 	4	/solr/collections/collection1/state.json
   [junit4]   2> 
   [junit4]   2> Maximum concurrent data watches above limit:
   [junit4]   2> 
   [junit4]   2> 	6	/solr/clusterstate.json
   [junit4]   2> 	6	/solr/clusterprops.json
   [junit4]   2> 
   [junit4]   2> Maximum concurrent children watches above limit:
   [junit4]   2> 
   [junit4]   2> 	24	/solr/overseer/queue
   [junit4]   2> 	24	/solr/overseer/collection-queue-work
   [junit4]   2> 	6	/solr/live_nodes
   [junit4]   2> 	6	/solr/collections
   [junit4]   2> 	3	/solr/overseer/queue-work
   [junit4]   2> 
   [junit4]   2> NOTE: reproduce with: ant test  -Dtestcase=TestReqParamsAPI -Dtests.method=test -Dtests.seed=79BE3FF9B8578C12 -Dtests.multiplier=3 -Dtests.slow=true -Dtests.locale=sah-RU -Dtests.timezone=ACT -Dtests.asserts=true -Dtests.file.encoding=US-ASCII
   [junit4] FAILURE 23.6s J1 | TestReqParamsAPI.test <<<
   [junit4]    > Throwable #1: java.lang.AssertionError: Could not get expected value  'f' for path 'params/fixed' full output: {
   [junit4]    >   "responseHeader":{
   [junit4]    >     "status":0,
   [junit4]    >     "QTime":0},
   [junit4]    >   "params":{
   [junit4]    >     "add":"second",
   [junit4]    >     "a":"A val",
   [junit4]    >     "fixed":"changeit",
   [junit4]    >     "b":"B val",
   [junit4]    >     "wt":"json"},
   [junit4]    >   "context":{
   [junit4]    >     "webapp":"",
   [junit4]    >     "path":"/dump1",
   [junit4]    >     "httpMethod":"GET"}},  from server:  https://127.0.0.1:36231/collection1
   [junit4]    > 	at __randomizedtesting.SeedInfo.seed([79BE3FF9B8578C12:F1EA002316ABE1EA]:0)
   [junit4]    > 	at org.apache.solr.core.TestSolrConfigHandler.testForResponseElement(TestSolrConfigHandler.java:481)
   [junit4]    > 	at org.apache.solr.handler.TestReqParamsAPI.testReqParams(TestReqParamsAPI.java:241)
   [junit4]    > 	at org.apache.solr.handler.TestReqParamsAPI.test(TestReqParamsAPI.java:61)
   [junit4]    > 	at jdk.internal.reflect.NativeMethodAccessorImpl.invoke0(java.base@9-ea/Native Method)
   [junit4]    > 	at jdk.internal.reflect.NativeMethodAccessorImpl.invoke(java.base@9-ea/NativeMethodAccessorImpl.java:62)
   [junit4]    > 	at jdk.internal.reflect.DelegatingMethodAccessorImpl.invoke(java.base@9-ea/DelegatingMethodAccessorImpl.java:43)
   [junit4]    > 	at org.apache.solr.BaseDistributedSearchTestCase$ShardsRepeatRule$ShardsFixedStatement.callStatement(BaseDistributedSearchTestCase.java:992)
   [junit4]    > 	at org.apache.solr.BaseDistributedSearchTestCase$ShardsRepeatRule$ShardsStatement.evaluate(BaseDistributedSearchTestCase.java:967)
   [junit4]    > 	at java.lang.Thread.run(java.base@9-ea/Thread.java:843)
   [junit4]   2> 2197126 INFO  (SUITE-TestReqParamsAPI-seed#[79BE3FF9B8578C12]-worker) [    ] o.a.s.SolrTestCaseJ4 ###deleteCore
   [junit4]   2> NOTE: leaving temporary files on disk at: /home/jenkins/workspace/Lucene-Solr-6.x-Linux/solr/build/solr-core/test/J1/temp/solr.handler.TestReqParamsAPI_79BE3FF9B8578C12-001
   [junit4]   2> Jun 17, 2016 1:52:31 PM com.carrotsearch.randomizedtesting.ThreadLeakControl checkThreadLeaks
   [junit4]   2> WARNING: Will linger awaiting termination of 1 leaked thread(s).
   [junit4]   2> NOTE: test params are: codec=Asserting(Lucene62), sim=RandomSimilarity(queryNorm=false,coord=no): {}, locale=sah-RU, timezone=ACT
   [junit4]   2> NOTE: Linux 4.4.0-24-generic i386/Oracle Corporation 9-ea (32-bit)/cpus=12,threads=1,free=184296376,total=355201024
   [junit4]   2> NOTE: All tests run in this JVM: [TestHashPartitioner, BJQParserTest, SuggestComponentTest, TestCursorMarkWithoutUniqueKey, ResponseHeaderTest, HLLUtilTest, TermsComponentTest, TestFastLRUCache, ConfigSetsAPITest, TestDocTermOrds, TestNumericTerms32, UniqFieldsUpdateProcessorFactoryTest, OutOfBoxZkACLAndCredentialsProvidersTest, HttpPartitionTest, ZkSolrClientTest, DistribCursorPagingTest, MultiTermTest, AtomicUpdatesTest, TestCollectionAPI, HdfsBasicDistributedZkTest, TestCoreContainer, TestFiltering, TestBM25SimilarityFactory, OverseerRolesTest, WordBreakSolrSpellCheckerTest, TestSolrDeletionPolicy2, TestSolrQueryParserResource, CollectionsAPIAsyncDistributedZkTest, TestSystemIdResolver, DOMUtilTest, TestInfoStreamLogging, DistributedTermsComponentTest, TestMinMaxOnMultiValuedField, TestEmbeddedSolrServerConstructors, ExitableDirectoryReaderTest, TestBlendedInfixSuggestions, BigEndianAscendingWordDeserializerTest, TestScoreJoinQPScore, AddBlockUpdateTest, TestFieldCacheSanityChecker, TestLFUCache, RuleEngineTest, TestDistributedGrouping, TestSSLRandomization, TestSolrDynamicMBean, BasicAuthIntegrationTest, TestComplexPhraseQParserPlugin, TestSubQueryTransformerCrossCore, SpellingQueryConverterTest, LoggingHandlerTest, RestartWhileUpdatingTest, CSVRequestHandlerTest, TestCodecSupport, HdfsWriteToMultipleCollectionsTest, LeaderInitiatedRecoveryOnShardRestartTest, TestFieldCacheVsDocValues, ChangedSchemaMergeTest, NumericFieldsTest, HighlighterTest, IndexBasedSpellCheckerTest, ZkCLITest, BasicFunctionalityTest, DistributedQueryComponentCustomSortTest, TestWordDelimiterFilterFactory, DistributedIntervalFacetingTest, ZkControllerTest, TestStressVersions, TestDocumentBuilder, SaslZkACLProviderTest, SpellCheckCollatorTest, TriLevelCompositeIdRoutingTest, SolrIndexConfigTest, TestSolrCloudWithKerberosAlt, TestRecoveryHdfs, TestConfigSetsAPIZkFailure, ChaosMonkeyNothingIsSafeTest, TestSchemaNameResource, TestReloadAndDeleteDocs, TestTolerantUpdateProcessorCloud, TestRawResponseWriter, MoreLikeThisHandlerTest, TestNoOpRegenerator, BlockJoinFacetSimpleTest, TestQuerySenderListener, SpatialFilterTest, TestRTimerTree, SpellPossibilityIteratorTest, TestSolrConfigHandlerCloud, TestQueryUtils, TestCustomDocTransformer, HdfsThreadLeakTest, DocValuesTest, TestAddFieldRealTimeGet, AnalyticsMergeStrategyTest, SortByFunctionTest, ChaosMonkeySafeLeaderTest, BasicDistributedZk2Test, UnloadDistributedZkTest, SyncSliceTest, OpenCloseCoreStressTest, OverseerTest, LeaderElectionTest, TestRandomDVFaceting, AutoCommitTest, TestFaceting, TestStressReorder, TestJoin, SpellCheckComponentTest, QueryElevationComponentTest, ConvertedLegacyTest, TestSort, TestBadConfig, SoftAutoCommitTest, TestFoldingMultitermQuery, TestTrie, TestCSVLoader, PolyFieldTest, SolrCoreCheckLockOnStartupTest, FieldMutatingUpdateProcessorTest, DirectUpdateHandlerOptimizeTest, StatelessScriptUpdateProcessorFactoryTest, SolrInfoMBeanTest, DebugComponentTest, LukeRequestHandlerTest, TestQueryTypes, DocumentBuilderTest, TestIndexingPerformance, TestSolrQueryParser, FastVectorHighlighterTest, RegexBoostProcessorTest, IndexSchemaTest, UpdateRequestProcessorFactoryTest, MBeansHandlerTest, TestPartialUpdateDeduplication, TestComponentsName, TestBinaryResponseWriter, HighlighterConfigTest, SOLR749Test, UpdateParamsTest, TestQuerySenderNoQuery, ResponseLogComponentTest, BadComponentTest, TestBinaryField, TestSearchPerf, MinimalSchemaTest, OutputWriterTest, TestFuzzyAnalyzedSuggestions, TestSolrCoreProperties, TestPostingsSolrHighlighter, DirectSolrConnectionTest, NotRequiredUniqueKeyTest, TestPhraseSuggestions, TestXIncludeConfig, EchoParamsTest, TestDFRSimilarityFactory, TestPerFieldSimilarity, TestLMJelinekMercerSimilarityFactory, TestJmxMonitoredMap, TimeZoneUtilsTest, OpenExchangeRatesOrgProviderTest, URLClassifyProcessorTest, DateMathParserTest, PreAnalyzedFieldTest, ClusterStateTest, TestLRUCache, TestUtils, FileUtilsTest, CircularListTest, DistributedMLTComponentTest, SolrTestCaseJ4Test, TestSimpleTrackingShardHandler, ActionThrottleTest, AliasIntegrationTest, BaseCdcrDistributedZkTest, CdcrReplicationHandlerTest, CdcrVersionReplicationTest, CloudExitableDirectoryReaderTest, CollectionReloadTest, ConcurrentDeleteAndCreateCollectionTest, CustomCollectionTest, DistributedQueueTest, DistributedVersionInfoTest, OverriddenZkACLAndCredentialsProvidersTest, OverseerTaskQueueTest, SharedFSAutoReplicaFailoverTest, SharedFSAutoReplicaFailoverUtilsTest, SimpleCollectionCreateDeleteTest, SolrXmlInZkTest, TestCloudDeleteByQuery, TestConfigSetsAPI, TestLeaderElectionZkExpiry, TestLockTree, TestMiniSolrCloudClusterBase, TestRebalanceLeaders, TestRequestStatusCollectionAPI, HdfsCollectionsAPIDistributedZkTest, HdfsRecoveryZkTest, TestClusterStateMutator, ZkStateReaderTest, TestReplicationHandlerBackup, TestReqParamsAPI]
   [junit4] Completed [507/615 (1!)] on J1 in 24.38s, 1 test, 1 failure <<< FAILURES!

[...truncated 334 lines...]
BUILD FAILED
/home/jenkins/workspace/Lucene-Solr-6.x-Linux/build.xml:740: The following error occurred while executing this line:
/home/jenkins/workspace/Lucene-Solr-6.x-Linux/build.xml:684: The following error occurred while executing this line:
/home/jenkins/workspace/Lucene-Solr-6.x-Linux/build.xml:59: The following error occurred while executing this line:
/home/jenkins/workspace/Lucene-Solr-6.x-Linux/solr/build.xml:233: The following error occurred while executing this line:
/home/jenkins/workspace/Lucene-Solr-6.x-Linux/solr/common-build.xml:531: The following error occurred while executing this line:
/home/jenkins/workspace/Lucene-Solr-6.x-Linux/lucene/common-build.xml:1427: The following error occurred while executing this line:
/home/jenkins/workspace/Lucene-Solr-6.x-Linux/lucene/common-build.xml:984: There were test failures: 615 suites (10 ignored), 2591 tests, 1 failure, 118 ignored (72 assumptions) [seed: 79BE3FF9B8578C12]

Total time: 64 minutes 46 seconds
Build step 'Invoke Ant' marked build as failure
Archiving artifacts
[WARNINGS] Skipping publisher since build result is FAILURE
Recording test results
Email was triggered for: Failure - Any
Sending email for trigger: Failure - Any