You are viewing a plain text version of this content. The canonical link for it is here.
Posted to builds@mesos.apache.org by Apache Jenkins Server <je...@builds.apache.org> on 2017/01/18 12:30:31 UTC
Build failed in Jenkins: Mesos-Buildbot » cmake,gcc,--verbose,GLOG_v=1 MESOS_VERBOSE=1,centos:7,(docker||Hadoop)&&(!ubuntu-us1)&&(!ubuntu-6)&&(!ubuntu-eu2) #3125
See <https://builds.apache.org/job/Mesos-Buildbot/BUILDTOOL=cmake,COMPILER=gcc,CONFIGURATION=--verbose,ENVIRONMENT=GLOG_v=1%20MESOS_VERBOSE=1,OS=centos%3A7,label_exp=(docker%7C%7CHadoop)&&(!ubuntu-us1)&&(!ubuntu-6)&&(!ubuntu-eu2)/3125/changes>
Changes:
[yujie.jay] Add hostname support to the network/cni isolator.
------------------------------------------
[...truncated 159152 lines...]
[ RUN ] Endpoint/SlaveEndpointTest.AuthorizedRequest/1
I0118 12:29:41.903929 25416 containerizer.cpp:220] Using isolation: posix/cpu,posix/mem,filesystem/posix,network/cni
W0118 12:29:41.904291 25416 backend.cpp:76] Failed to create 'aufs' backend: AufsBackend requires root privileges, but is running as user mesos
W0118 12:29:41.904372 25416 backend.cpp:76] Failed to create 'bind' backend: BindBackend requires root privileges
I0118 12:29:41.905356 25432 slave.cpp:209] Mesos agent started on (672)@172.17.0.4:41355
I0118 12:29:41.905540 25432 slave.cpp:210] Flags at startup: --acls="" --appc_simple_discovery_uri_prefix="http://" --appc_store_dir="/tmp/mesos/store/appc" --authenticate_http_readonly="true" --authenticate_http_readwrite="true" --authenticatee="crammd5" --authentication_backoff_factor="1secs" --authorizer="local" --cgroups_cpu_enable_pids_and_tids_count="false" --cgroups_enable_cfs="false" --cgroups_hierarchy="/sys/fs/cgroup" --cgroups_limit_swap="false" --cgroups_root="mesos" --container_disk_watch_interval="15secs" --containerizers="mesos" --credential="/tmp/Endpoint_SlaveEndpointTest_AuthorizedRequest_1_fXs63u/credential" --default_role="*" --disk_watch_interval="1mins" --docker="docker" --docker_kill_orphans="true" --docker_registry="https://registry-1.docker.io" --docker_remove_delay="6hrs" --docker_socket="/var/run/docker.sock" --docker_stop_timeout="0ns" --docker_store_dir="/tmp/mesos/store/docker" --docker_volume_checkpoint_dir="/var/run/mesos/isolators/docker/volume" --enforce_container_disk_quota="false" --executor_registration_timeout="1mins" --executor_shutdown_grace_period="5secs" --fetcher_cache_dir="/tmp/Endpoint_SlaveEndpointTest_AuthorizedRequest_1_fXs63u/fetch" --fetcher_cache_size="2GB" --frameworks_home="" --gc_delay="1weeks" --gc_disk_headroom="0.1" --hadoop_home="" --help="false" --hostname_lookup="true" --http_authenticators="basic" --http_command_executor="false" --http_credentials="/tmp/Endpoint_SlaveEndpointTest_AuthorizedRequest_1_fXs63u/http_credentials" --http_heartbeat_interval="30secs" --image_provisioner_backend="copy" --initialize_driver_logging="true" --isolation="posix/cpu,posix/mem" --launcher="posix" --launcher_dir="/mesos/build/src" --logbufsecs="0" --logging_level="INFO" --max_completed_executors_per_framework="150" --oversubscribed_resources_interval="15secs" --perf_duration="10secs" --perf_interval="1mins" --qos_correction_interval_min="0ns" --quiet="false" --recover="reconnect" --recovery_timeout="15mins" --registration_backoff_factor="10ms" --resources="cpus:2;gpus:0;mem:1024;disk:1024;ports:[31000-32000]" --revocable_cpu_low_priority="true" --runtime_dir="/tmp/Endpoint_SlaveEndpointTest_AuthorizedRequest_1_fXs63u" --sandbox_directory="/mnt/mesos/sandbox" --strict="true" --switch_user="true" --systemd_enable_support="true" --systemd_runtime_directory="/run/systemd/system" --version="false" --work_dir="/tmp/Endpoint_SlaveEndpointTest_AuthorizedRequest_1_IX1PDF"
I0118 12:29:41.905776 25432 credentials.hpp:86] Loading credential for authentication from '/tmp/Endpoint_SlaveEndpointTest_AuthorizedRequest_1_fXs63u/credential'
I0118 12:29:41.905899 25432 slave.cpp:352] Agent using credential for: test-principal
I0118 12:29:41.905910 25432 credentials.hpp:37] Loading credentials for authentication from '/tmp/Endpoint_SlaveEndpointTest_AuthorizedRequest_1_fXs63u/http_credentials'
I0118 12:29:41.905997 25432 http.cpp:922] Using default 'basic' HTTP authenticator for realm 'mesos-agent-readonly'
I0118 12:29:41.906033 25432 http.cpp:922] Using default 'basic' HTTP authenticator for realm 'mesos-agent-readwrite'
I0118 12:29:41.906342 25432 slave.cpp:539] Agent resources: cpus(*):2; mem(*):1024; disk(*):1024; ports(*):[31000-32000]
I0118 12:29:41.906374 25432 slave.cpp:547] Agent attributes: [ ]
I0118 12:29:41.906379 25432 slave.cpp:552] Agent hostname: 64e4bcd2d878
I0118 12:29:41.906703 25432 state.cpp:60] Recovering state from '/tmp/Endpoint_SlaveEndpointTest_AuthorizedRequest_1_IX1PDF/meta'
I0118 12:29:41.906843 25425 status_update_manager.cpp:203] Recovering status update manager
I0118 12:29:41.906996 25418 containerizer.cpp:599] Recovering containerizer
I0118 12:29:41.907506 25426 provisioner.cpp:251] Provisioner recovery complete
I0118 12:29:41.907651 25431 slave.cpp:5417] Finished recovery
I0118 12:29:41.907979 25431 slave.cpp:5591] Querying resource estimator for oversubscribable resources
I0118 12:29:41.908089 25419 slave.cpp:5605] Received oversubscribable resources {} from the resource estimator
I0118 12:29:41.908713 25428 process.cpp:3676] Handling HTTP event for process 'slave(672)' with path: '/slave(672)/monitor/statistics.json'
I0118 12:29:41.909070 25422 http.cpp:874] Authorizing principal 'test-principal' to GET the '/monitor/statistics.json' endpoint
I0118 12:29:41.910096 25421 slave.cpp:796] Agent terminating
[ OK ] Endpoint/SlaveEndpointTest.AuthorizedRequest/1 (10 ms)
[ RUN ] Endpoint/SlaveEndpointTest.AuthorizedRequest/2
I0118 12:29:41.914594 25416 containerizer.cpp:220] Using isolation: posix/cpu,posix/mem,filesystem/posix,network/cni
W0118 12:29:41.914950 25416 backend.cpp:76] Failed to create 'aufs' backend: AufsBackend requires root privileges, but is running as user mesos
W0118 12:29:41.915030 25416 backend.cpp:76] Failed to create 'bind' backend: BindBackend requires root privileges
I0118 12:29:41.916064 25417 slave.cpp:209] Mesos agent started on (673)@172.17.0.4:41355
I0118 12:29:41.916079 25417 slave.cpp:210] Flags at startup: --acls="" --appc_simple_discovery_uri_prefix="http://" --appc_store_dir="/tmp/mesos/store/appc" --authenticate_http_readonly="true" --authenticate_http_readwrite="true" --authenticatee="crammd5" --authentication_backoff_factor="1secs" --authorizer="local" --cgroups_cpu_enable_pids_and_tids_count="false" --cgroups_enable_cfs="false" --cgroups_hierarchy="/sys/fs/cgroup" --cgroups_limit_swap="false" --cgroups_root="mesos" --container_disk_watch_interval="15secs" --containerizers="mesos" --credential="/tmp/Endpoint_SlaveEndpointTest_AuthorizedRequest_2_HK14QO/credential" --default_role="*" --disk_watch_interval="1mins" --docker="docker" --docker_kill_orphans="true" --docker_registry="https://registry-1.docker.io" --docker_remove_delay="6hrs" --docker_socket="/var/run/docker.sock" --docker_stop_timeout="0ns" --docker_store_dir="/tmp/mesos/store/docker" --docker_volume_checkpoint_dir="/var/run/mesos/isolators/docker/volume" --enforce_container_disk_quota="false" --executor_registration_timeout="1mins" --executor_shutdown_grace_period="5secs" --fetcher_cache_dir="/tmp/Endpoint_SlaveEndpointTest_AuthorizedRequest_2_HK14QO/fetch" --fetcher_cache_size="2GB" --frameworks_home="" --gc_delay="1weeks" --gc_disk_headroom="0.1" --hadoop_home="" --help="false" --hostname_lookup="true" --http_authenticators="basic" --http_command_executor="false" --http_credentials="/tmp/Endpoint_SlaveEndpointTest_AuthorizedRequest_2_HK14QO/http_credentials" --http_heartbeat_interval="30secs" --image_provisioner_backend="copy" --initialize_driver_logging="true" --isolation="posix/cpu,posix/mem" --launcher="posix" --launcher_dir="/mesos/build/src" --logbufsecs="0" --logging_level="INFO" --max_completed_executors_per_framework="150" --oversubscribed_resources_interval="15secs" --perf_duration="10secs" --perf_interval="1mins" --qos_correction_interval_min="0ns" --quiet="false" --recover="reconnect" --recovery_timeout="15mins" --registration_backoff_factor="10ms" --resources="cpus:2;gpus:0;mem:1024;disk:1024;ports:[31000-32000]" --revocable_cpu_low_priority="true" --runtime_dir="/tmp/Endpoint_SlaveEndpointTest_AuthorizedRequest_2_HK14QO" --sandbox_directory="/mnt/mesos/sandbox" --strict="true" --switch_user="true" --systemd_enable_support="true" --systemd_runtime_directory="/run/systemd/system" --version="false" --work_dir="/tmp/Endpoint_SlaveEndpointTest_AuthorizedRequest_2_pxm4oZ"
I0118 12:29:41.916378 25417 credentials.hpp:86] Loading credential for authentication from '/tmp/Endpoint_SlaveEndpointTest_AuthorizedRequest_2_HK14QO/credential'
I0118 12:29:41.916492 25417 slave.cpp:352] Agent using credential for: test-principal
I0118 12:29:41.916508 25417 credentials.hpp:37] Loading credentials for authentication from '/tmp/Endpoint_SlaveEndpointTest_AuthorizedRequest_2_HK14QO/http_credentials'
I0118 12:29:41.916618 25417 http.cpp:922] Using default 'basic' HTTP authenticator for realm 'mesos-agent-readonly'
I0118 12:29:41.916698 25417 http.cpp:922] Using default 'basic' HTTP authenticator for realm 'mesos-agent-readwrite'
I0118 12:29:41.916976 25417 slave.cpp:539] Agent resources: cpus(*):2; mem(*):1024; disk(*):1024; ports(*):[31000-32000]
I0118 12:29:41.917006 25417 slave.cpp:547] Agent attributes: [ ]
I0118 12:29:41.917012 25417 slave.cpp:552] Agent hostname: 64e4bcd2d878
I0118 12:29:41.917342 25423 state.cpp:60] Recovering state from '/tmp/Endpoint_SlaveEndpointTest_AuthorizedRequest_2_pxm4oZ/meta'
I0118 12:29:41.917582 25431 status_update_manager.cpp:203] Recovering status update manager
I0118 12:29:41.917682 25417 containerizer.cpp:599] Recovering containerizer
I0118 12:29:41.918184 25425 provisioner.cpp:251] Provisioner recovery complete
I0118 12:29:41.918380 25427 slave.cpp:5417] Finished recovery
I0118 12:29:41.918771 25427 slave.cpp:5591] Querying resource estimator for oversubscribable resources
I0118 12:29:41.918992 25425 slave.cpp:5605] Received oversubscribable resources {} from the resource estimator
I0118 12:29:41.919539 25429 process.cpp:3676] Handling HTTP event for process 'slave(673)' with path: '/slave(673)/containers'
I0118 12:29:41.919883 25426 http.cpp:874] Authorizing principal 'test-principal' to GET the '/containers' endpoint
I0118 12:29:41.921025 25428 slave.cpp:796] Agent terminating
[ OK ] Endpoint/SlaveEndpointTest.AuthorizedRequest/2 (31 ms)
[ RUN ] Endpoint/SlaveEndpointTest.UnauthorizedRequest/0
I0118 12:29:41.945458 25416 containerizer.cpp:220] Using isolation: posix/cpu,posix/mem,filesystem/posix,network/cni
W0118 12:29:41.945719 25416 backend.cpp:76] Failed to create 'aufs' backend: AufsBackend requires root privileges, but is running as user mesos
W0118 12:29:41.945801 25416 backend.cpp:76] Failed to create 'bind' backend: BindBackend requires root privileges
I0118 12:29:41.946679 25425 slave.cpp:209] Mesos agent started on (674)@172.17.0.4:41355
I0118 12:29:41.946712 25425 slave.cpp:210] Flags at startup: --acls="" --appc_simple_discovery_uri_prefix="http://" --appc_store_dir="/tmp/mesos/store/appc" --authenticate_http_readonly="true" --authenticate_http_readwrite="true" --authenticatee="crammd5" --authentication_backoff_factor="1secs" --authorizer="local" --cgroups_cpu_enable_pids_and_tids_count="false" --cgroups_enable_cfs="false" --cgroups_hierarchy="/sys/fs/cgroup" --cgroups_limit_swap="false" --cgroups_root="mesos" --container_disk_watch_interval="15secs" --containerizers="mesos" --credential="/tmp/Endpoint_SlaveEndpointTest_UnauthorizedRequest_0_Qc61U8/credential" --default_role="*" --disk_watch_interval="1mins" --docker="docker" --docker_kill_orphans="true" --docker_registry="https://registry-1.docker.io" --docker_remove_delay="6hrs" --docker_socket="/var/run/docker.sock" --docker_stop_timeout="0ns" --docker_store_dir="/tmp/mesos/store/docker" --docker_volume_checkpoint_dir="/var/run/mesos/isolators/docker/volume" --enforce_container_disk_quota="false" --executor_registration_timeout="1mins" --executor_shutdown_grace_period="5secs" --fetcher_cache_dir="/tmp/Endpoint_SlaveEndpointTest_UnauthorizedRequest_0_Qc61U8/fetch" --fetcher_cache_size="2GB" --frameworks_home="" --gc_delay="1weeks" --gc_disk_headroom="0.1" --hadoop_home="" --help="false" --hostname_lookup="true" --http_authenticators="basic" --http_command_executor="false" --http_credentials="/tmp/Endpoint_SlaveEndpointTest_UnauthorizedRequest_0_Qc61U8/http_credentials" --http_heartbeat_interval="30secs" --image_provisioner_backend="copy" --initialize_driver_logging="true" --isolation="posix/cpu,posix/mem" --launcher="posix" --launcher_dir="/mesos/build/src" --logbufsecs="0" --logging_level="INFO" --max_completed_executors_per_framework="150" --oversubscribed_resources_interval="15secs" --perf_duration="10secs" --perf_interval="1mins" --qos_correction_interval_min="0ns" --quiet="false" --recover="reconnect" --recovery_timeout="15mins" --registration_backoff_factor="10ms" --resources="cpus:2;gpus:0;mem:1024;disk:1024;ports:[31000-32000]" --revocable_cpu_low_priority="true" --runtime_dir="/tmp/Endpoint_SlaveEndpointTest_UnauthorizedRequest_0_Qc61U8" --sandbox_directory="/mnt/mesos/sandbox" --strict="true" --switch_user="true" --systemd_enable_support="true" --systemd_runtime_directory="/run/systemd/system" --version="false" --work_dir="/tmp/Endpoint_SlaveEndpointTest_UnauthorizedRequest_0_1bFXnj"
I0118 12:29:41.947165 25425 credentials.hpp:86] Loading credential for authentication from '/tmp/Endpoint_SlaveEndpointTest_UnauthorizedRequest_0_Qc61U8/credential'
I0118 12:29:41.947253 25425 slave.cpp:352] Agent using credential for: test-principal
I0118 12:29:41.947270 25425 credentials.hpp:37] Loading credentials for authentication from '/tmp/Endpoint_SlaveEndpointTest_UnauthorizedRequest_0_Qc61U8/http_credentials'
I0118 12:29:41.947362 25425 http.cpp:922] Using default 'basic' HTTP authenticator for realm 'mesos-agent-readonly'
I0118 12:29:41.947397 25425 http.cpp:922] Using default 'basic' HTTP authenticator for realm 'mesos-agent-readwrite'
I0118 12:29:41.947654 25425 slave.cpp:539] Agent resources: cpus(*):2; mem(*):1024; disk(*):1024; ports(*):[31000-32000]
I0118 12:29:41.947685 25425 slave.cpp:547] Agent attributes: [ ]
I0118 12:29:41.947690 25425 slave.cpp:552] Agent hostname: 64e4bcd2d878
I0118 12:29:41.947974 25422 state.cpp:60] Recovering state from '/tmp/Endpoint_SlaveEndpointTest_UnauthorizedRequest_0_1bFXnj/meta'
I0118 12:29:41.948144 25428 status_update_manager.cpp:203] Recovering status update manager
I0118 12:29:41.948252 25421 containerizer.cpp:599] Recovering containerizer
I0118 12:29:41.948770 25425 provisioner.cpp:251] Provisioner recovery complete
I0118 12:29:41.948958 25425 slave.cpp:5417] Finished recovery
I0118 12:29:41.949338 25425 slave.cpp:5591] Querying resource estimator for oversubscribable resources
I0118 12:29:41.954866 25419 slave.cpp:5605] Received oversubscribable resources {} from the resource estimator
I0118 12:29:41.955530 25422 process.cpp:3676] Handling HTTP event for process 'slave(674)' with path: '/slave(674)/monitor/statistics'
I0118 12:29:41.955936 25429 http.cpp:874] Authorizing principal 'test-principal' to GET the '/monitor/statistics' endpoint
I0118 12:29:41.956797 25430 slave.cpp:796] Agent terminating
[ OK ] Endpoint/SlaveEndpointTest.UnauthorizedRequest/0 (15 ms)
[ RUN ] Endpoint/SlaveEndpointTest.UnauthorizedRequest/1
I0118 12:29:41.961019 25416 containerizer.cpp:220] Using isolation: posix/cpu,posix/mem,filesystem/posix,network/cni
W0118 12:29:41.961285 25416 backend.cpp:76] Failed to create 'aufs' backend: AufsBackend requires root privileges, but is running as user mesos
W0118 12:29:41.961366 25416 backend.cpp:76] Failed to create 'bind' backend: BindBackend requires root privileges
I0118 12:29:41.962270 25431 slave.cpp:209] Mesos agent started on (675)@172.17.0.4:41355
I0118 12:29:41.962285 25431 slave.cpp:210] Flags at startup: --acls="" --appc_simple_discovery_uri_prefix="http://" --appc_store_dir="/tmp/mesos/store/appc" --authenticate_http_readonly="true" --authenticate_http_readwrite="true" --authenticatee="crammd5" --authentication_backoff_factor="1secs" --authorizer="local" --cgroups_cpu_enable_pids_and_tids_count="false" --cgroups_enable_cfs="false" --cgroups_hierarchy="/sys/fs/cgroup" --cgroups_limit_swap="false" --cgroups_root="mesos" --container_disk_watch_interval="15secs" --containerizers="mesos" --credential="/tmp/Endpoint_SlaveEndpointTest_UnauthorizedRequest_1_JRzubt/credential" --default_role="*" --disk_watch_interval="1mins" --docker="docker" --docker_kill_orphans="true" --docker_registry="https://registry-1.docker.io" --docker_remove_delay="6hrs" --docker_socket="/var/run/docker.sock" --docker_stop_timeout="0ns" --docker_store_dir="/tmp/mesos/store/docker" --docker_volume_checkpoint_dir="/var/run/mesos/isolators/docker/volume" --enforce_container_disk_quota="false" --executor_registration_timeout="1mins" --executor_shutdown_grace_period="5secs" --fetcher_cache_dir="/tmp/Endpoint_SlaveEndpointTest_UnauthorizedRequest_1_JRzubt/fetch" --fetcher_cache_size="2GB" --frameworks_home="" --gc_delay="1weeks" --gc_disk_headroom="0.1" --hadoop_home="" --help="false" --hostname_lookup="true" --http_authenticators="basic" --http_command_executor="false" --http_credentials="/tmp/Endpoint_SlaveEndpointTest_UnauthorizedRequest_1_JRzubt/http_credentials" --http_heartbeat_interval="30secs" --image_provisioner_backend="copy" --initialize_driver_logging="true" --isolation="posix/cpu,posix/mem" --launcher="posix" --launcher_dir="/mesos/build/src" --logbufsecs="0" --logging_level="INFO" --max_completed_executors_per_framework="150" --oversubscribed_resources_interval="15secs" --perf_duration="10secs" --perf_interval="1mins" --qos_correction_interval_min="0ns" --quiet="false" --recover="reconnect" --recovery_timeout="15mins" --registration_backoff_factor="10ms" --resources="cpus:2;gpus:0;mem:1024;disk:1024;ports:[31000-32000]" --revocable_cpu_low_priority="true" --runtime_dir="/tmp/Endpoint_SlaveEndpointTest_UnauthorizedRequest_1_JRzubt" --sandbox_directory="/mnt/mesos/sandbox" --strict="true" --switch_user="true" --systemd_enable_support="true" --systemd_runtime_directory="/run/systemd/system" --version="false" --work_dir="/tmp/Endpoint_SlaveEndpointTest_UnauthorizedRequest_1_k24TBD"
I0118 12:29:41.962590 25431 credentials.hpp:86] Loading credential for authentication from '/tmp/Endpoint_SlaveEndpointTest_UnauthorizedRequest_1_JRzubt/credential'
I0118 12:29:41.962677 25431 slave.cpp:352] Agent using credential for: test-principal
I0118 12:29:41.962693 25431 credentials.hpp:37] Loading credentials for authentication from '/tmp/Endpoint_SlaveEndpointTest_UnauthorizedRequest_1_JRzubt/http_credentials'
I0118 12:29:41.962827 25431 http.cpp:922] Using default 'basic' HTTP authenticator for realm 'mesos-agent-readonly'
I0118 12:29:41.962888 25431 http.cpp:922] Using default 'basic' HTTP authenticator for realm 'mesos-agent-readwrite'
I0118 12:29:41.963260 25431 slave.cpp:539] Agent resources: cpus(*):2; mem(*):1024; disk(*):1024; ports(*):[31000-32000]
I0118 12:29:41.963292 25431 slave.cpp:547] Agent attributes: [ ]
I0118 12:29:41.963297 25431 slave.cpp:552] Agent hostname: 64e4bcd2d878
I0118 12:29:41.963647 25420 state.cpp:60] Recovering state from '/tmp/Endpoint_SlaveEndpointTest_UnauthorizedRequest_1_k24TBD/meta'
I0118 12:29:41.963841 25432 status_update_manager.cpp:203] Recovering status update manager
I0118 12:29:41.964021 25425 containerizer.cpp:599] Recovering containerizer
I0118 12:29:41.964488 25423 provisioner.cpp:251] Provisioner recovery complete
I0118 12:29:41.964633 25425 slave.cpp:5417] Finished recovery
I0118 12:29:41.964926 25425 slave.cpp:5591] Querying resource estimator for oversubscribable resources
I0118 12:29:41.965126 25432 slave.cpp:5605] Received oversubscribable resources {} from the resource estimator
I0118 12:29:41.965679 25429 process.cpp:3676] Handling HTTP event for process 'slave(675)' with path: '/slave(675)/monitor/statistics.json'
I0118 12:29:41.966073 25424 http.cpp:874] Authorizing principal 'test-principal' to GET the '/monitor/statistics.json' endpoint
I0118 12:29:41.966790 25416 slave.cpp:796] Agent terminating
[ OK ] Endpoint/SlaveEndpointTest.UnauthorizedRequest/1 (24 ms)
[ RUN ] Endpoint/SlaveEndpointTest.UnauthorizedRequest/2
I0118 12:29:41.985528 25416 containerizer.cpp:220] Using isolation: posix/cpu,posix/mem,filesystem/posix,network/cni
W0118 12:29:41.985807 25416 backend.cpp:76] Failed to create 'aufs' backend: AufsBackend requires root privileges, but is running as user mesos
W0118 12:29:41.985884 25416 backend.cpp:76] Failed to create 'bind' backend: BindBackend requires root privileges
I0118 12:29:41.986812 25418 slave.cpp:209] Mesos agent started on (676)@172.17.0.4:41355
I0118 12:29:41.986829 25418 slave.cpp:210] Flags at startup: --acls="" --appc_simple_discovery_uri_prefix="http://" --appc_store_dir="/tmp/mesos/store/appc" --authenticate_http_readonly="true" --authenticate_http_readwrite="true" --authenticatee="crammd5" --authentication_backoff_factor="1secs" --authorizer="local" --cgroups_cpu_enable_pids_and_tids_count="false" --cgroups_enable_cfs="false" --cgroups_hierarchy="/sys/fs/cgroup" --cgroups_limit_swap="false" --cgroups_root="mesos" --container_disk_watch_interval="15secs" --containerizers="mesos" --credential="/tmp/Endpoint_SlaveEndpointTest_UnauthorizedRequest_2_PL4sGN/credential" --default_role="*" --disk_watch_interval="1mins" --docker="docker" --docker_kill_orphans="true" --docker_registry="https://registry-1.docker.io" --docker_remove_delay="6hrs" --docker_socket="/var/run/docker.sock" --docker_stop_timeout="0ns" --docker_store_dir="/tmp/mesos/store/docker" --docker_volume_checkpoint_dir="/var/run/mesos/isolators/docker/volume" --enforce_container_disk_quota="false" --executor_registration_timeout="1mins" --executor_shutdown_grace_period="5secs" --fetcher_cache_dir="/tmp/Endpoint_SlaveEndpointTest_UnauthorizedRequest_2_PL4sGN/fetch" --fetcher_cache_size="2GB" --frameworks_home="" --gc_delay="1weeks" --gc_disk_headroom="0.1" --hadoop_home="" --help="false" --hostname_lookup="true" --http_authenticators="basic" --http_command_executor="false" --http_credentials="/tmp/Endpoint_SlaveEndpointTest_UnauthorizedRequest_2_PL4sGN/http_credentials" --http_heartbeat_interval="30secs" --image_provisioner_backend="copy" --initialize_driver_logging="true" --isolation="posix/cpu,posix/mem" --launcher="posix" --launcher_dir="/mesos/build/src" --logbufsecs="0" --logging_level="INFO" --max_completed_executors_per_framework="150" --oversubscribed_resources_interval="15secs" --perf_duration="10secs" --perf_interval="1mins" --qos_correction_interval_min="0ns" --quiet="false" --recover="reconnect" --recovery_timeout="15mins" --registration_backoff_factor="10ms" --resources="cpus:2;gpus:0;mem:1024;disk:1024;ports:[31000-32000]" --revocable_cpu_low_priority="true" --runtime_dir="/tmp/Endpoint_SlaveEndpointTest_UnauthorizedRequest_2_PL4sGN" --sandbox_directory="/mnt/mesos/sandbox" --strict="true" --switch_user="true" --systemd_enable_support="true" --systemd_runtime_directory="/run/systemd/system" --version="false" --work_dir="/tmp/Endpoint_SlaveEndpointTest_UnauthorizedRequest_2_r88S2X"
I0118 12:29:41.987133 25418 credentials.hpp:86] Loading credential for authentication from '/tmp/Endpoint_SlaveEndpointTest_UnauthorizedRequest_2_PL4sGN/credential'
I0118 12:29:41.987248 25418 slave.cpp:352] Agent using credential for: test-principal
I0118 12:29:41.987263 25418 credentials.hpp:37] Loading credentials for authentication from '/tmp/Endpoint_SlaveEndpointTest_UnauthorizedRequest_2_PL4sGN/http_credentials'
I0118 12:29:41.987366 25418 http.cpp:922] Using default 'basic' HTTP authenticator for realm 'mesos-agent-readonly'
I0118 12:29:41.987409 25418 http.cpp:922] Using default 'basic' HTTP authenticator for realm 'mesos-agent-readwrite'
I0118 12:29:41.987720 25418 slave.cpp:539] Agent resources: cpus(*):2; mem(*):1024; disk(*):1024; ports(*):[31000-32000]
I0118 12:29:41.987751 25418 slave.cpp:547] Agent attributes: [ ]
I0118 12:29:41.987756 25418 slave.cpp:552] Agent hostname: 64e4bcd2d878
I0118 12:29:41.988044 25421 state.cpp:60] Recovering state from '/tmp/Endpoint_SlaveEndpointTest_UnauthorizedRequest_2_r88S2X/meta'
I0118 12:29:41.988185 25418 status_update_manager.cpp:203] Recovering status update manager
I0118 12:29:41.988296 25421 containerizer.cpp:599] Recovering containerizer
I0118 12:29:41.988749 25428 provisioner.cpp:251] Provisioner recovery complete
I0118 12:29:41.988888 25417 slave.cpp:5417] Finished recovery
I0118 12:29:41.989238 25417 slave.cpp:5591] Querying resource estimator for oversubscribable resources
I0118 12:29:41.989367 25420 slave.cpp:5605] Received oversubscribable resources {} from the resource estimator
I0118 12:29:41.989917 25423 process.cpp:3676] Handling HTTP event for process 'slave(676)' with path: '/slave(676)/containers'
I0118 12:29:41.990289 25417 http.cpp:874] Authorizing principal 'test-principal' to GET the '/containers' endpoint
I0118 12:29:41.991154 25423 slave.cpp:796] Agent terminating
[ OK ] Endpoint/SlaveEndpointTest.UnauthorizedRequest/2 (9 ms)
[ RUN ] Endpoint/SlaveEndpointTest.NoAuthorizer/0
I0118 12:29:41.994922 25416 containerizer.cpp:220] Using isolation: posix/cpu,posix/mem,filesystem/posix,network/cni
W0118 12:29:41.995194 25416 backend.cpp:76] Failed to create 'aufs' backend: AufsBackend requires root privileges, but is running as user mesos
W0118 12:29:41.995281 25416 backend.cpp:76] Failed to create 'bind' backend: BindBackend requires root privileges
I0118 12:29:41.995744 25416 cluster.cpp:446] Creating default 'local' authorizer
I0118 12:29:41.996156 25429 slave.cpp:209] Mesos agent started on (677)@172.17.0.4:41355
I0118 12:29:41.996176 25429 slave.cpp:210] Flags at startup: --acls="" --appc_simple_discovery_uri_prefix="http://" --appc_store_dir="/tmp/mesos/store/appc" --authenticate_http_readonly="true" --authenticate_http_readwrite="true" --authenticatee="crammd5" --authentication_backoff_factor="1secs" --authorizer="local" --cgroups_cpu_enable_pids_and_tids_count="false" --cgroups_enable_cfs="false" --cgroups_hierarchy="/sys/fs/cgroup" --cgroups_limit_swap="false" --cgroups_root="mesos" --container_disk_watch_interval="15secs" --containerizers="mesos" --credential="/tmp/Endpoint_SlaveEndpointTest_NoAuthorizer_0_OzFVj8/credential" --default_role="*" --disk_watch_interval="1mins" --docker="docker" --docker_kill_orphans="true" --docker_registry="https://registry-1.docker.io" --docker_remove_delay="6hrs" --docker_socket="/var/run/docker.sock" --docker_stop_timeout="0ns" --docker_store_dir="/tmp/mesos/store/docker" --docker_volume_checkpoint_dir="/var/run/mesos/isolators/docker/volume" --enforce_container_disk_quota="false" --executor_registration_timeout="1mins" --executor_shutdown_grace_period="5secs" --fetcher_cache_dir="/tmp/Endpoint_SlaveEndpointTest_NoAuthorizer_0_OzFVj8/fetch" --fetcher_cache_size="2GB" --frameworks_home="" --gc_delay="1weeks" --gc_disk_headroom="0.1" --hadoop_home="" --help="false" --hostname_lookup="true" --http_authenticators="basic" --http_command_executor="false" --http_credentials="/tmp/Endpoint_SlaveEndpointTest_NoAuthorizer_0_OzFVj8/http_credentials" --http_heartbeat_interval="30secs" --image_provisioner_backend="copy" --initialize_driver_logging="true" --isolation="posix/cpu,posix/mem" --launcher="posix" --launcher_dir="/mesos/build/src" --logbufsecs="0" --logging_level="INFO" --max_completed_executors_per_framework="150" --oversubscribed_resources_interval="15secs" --perf_duration="10secs" --perf_interval="1mins" --qos_correction_interval_min="0ns" --quiet="false" --recover="reconnect" --recovery_timeout="15mins" --registration_backoff_factor="10ms" --resources="cpus:2;gpus:0;mem:1024;disk:1024;ports:[31000-32000]" --revocable_cpu_low_priority="true" --runtime_dir="/tmp/Endpoint_SlaveEndpointTest_NoAuthorizer_0_OzFVj8" --sandbox_directory="/mnt/mesos/sandbox" --strict="true" --switch_user="true" --systemd_enable_support="true" --systemd_runtime_directory="/run/systemd/system" --version="false" --work_dir="/tmp/Endpoint_SlaveEndpointTest_NoAuthorizer_0_eD1PEi"
I0118 12:29:41.996568 25429 credentials.hpp:86] Loading credential for authentication from '/tmp/Endpoint_SlaveEndpointTest_NoAuthorizer_0_OzFVj8/credential'
I0118 12:29:41.996680 25429 slave.cpp:352] Agent using credential for: test-principal
I0118 12:29:41.996697 25429 credentials.hpp:37] Loading credentials for authentication from '/tmp/Endpoint_SlaveEndpointTest_NoAuthorizer_0_OzFVj8/http_credentials'
I0118 12:29:41.996811 25429 http.cpp:922] Using default 'basic' HTTP authenticator for realm 'mesos-agent-readonly'
I0118 12:29:41.996862 25429 http.cpp:922] Using default 'basic' HTTP authenticator for realm 'mesos-agent-readwrite'
I0118 12:29:41.997258 25429 slave.cpp:539] Agent resources: cpus(*):2; mem(*):1024; disk(*):1024; ports(*):[31000-32000]
I0118 12:29:41.997304 25429 slave.cpp:547] Agent attributes: [ ]
I0118 12:29:41.997315 25429 slave.cpp:552] Agent hostname: 64e4bcd2d878
I0118 12:29:41.997705 25428 state.cpp:60] Recovering state from '/tmp/Endpoint_SlaveEndpointTest_NoAuthorizer_0_eD1PEi/meta'
I0118 12:29:41.997859 25431 status_update_manager.cpp:203] Recovering status update manager
I0118 12:29:41.997959 25431 containerizer.cpp:599] Recovering containerizer
I0118 12:29:41.998462 25418 provisioner.cpp:251] Provisioner recovery complete
I0118 12:29:41.998690 25420 slave.cpp:5417] Finished recovery
I0118 12:29:41.999147 25420 slave.cpp:5591] Querying resource estimator for oversubscribable resources
I0118 12:29:41.999224 25423 slave.cpp:5605] Received oversubscribable resources {} from the resource estimator
I0118 12:29:41.999763 25428 process.cpp:3676] Handling HTTP event for process 'slave(677)' with path: '/slave(677)/monitor/statistics'
I0118 12:29:42.000107 25428 http.cpp:874] Authorizing principal 'test-principal' to GET the '/monitor/statistics' endpoint
I0118 12:29:42.001893 25416 slave.cpp:796] Agent terminating
[ OK ] Endpoint/SlaveEndpointTest.NoAuthorizer/0 (14 ms)
[ RUN ] Endpoint/SlaveEndpointTest.NoAuthorizer/1
I0118 12:29:42.011535 25416 containerizer.cpp:220] Using isolation: posix/cpu,posix/mem,filesystem/posix,network/cni
W0118 12:29:42.012058 25416 backend.cpp:76] Failed to create 'aufs' backend: AufsBackend requires root privileges, but is running as user mesos
W0118 12:29:42.012282 25416 backend.cpp:76] Failed to create 'bind' backend: BindBackend requires root privileges
I0118 12:29:42.012979 25416 cluster.cpp:446] Creating default 'local' authorizer
I0118 12:29:42.014408 25430 slave.cpp:209] Mesos agent started on (678)@172.17.0.4:41355
I0118 12:29:42.014762 25430 slave.cpp:210] Flags at startup: --acls="" --appc_simple_discovery_uri_prefix="http://" --appc_store_dir="/tmp/mesos/store/appc" --authenticate_http_readonly="true" --authenticate_http_readwrite="true" --authenticatee="crammd5" --authentication_backoff_factor="1secs" --authorizer="local" --cgroups_cpu_enable_pids_and_tids_count="false" --cgroups_enable_cfs="false" --cgroups_hierarchy="/sys/fs/cgroup" --cgroups_limit_swap="false" --cgroups_root="mesos" --container_disk_watch_interval="15secs" --containerizers="mesos" --credential="/tmp/Endpoint_SlaveEndpointTest_NoAuthorizer_1_ax2C6s/credential" --default_role="*" --disk_watch_interval="1mins" --docker="docker" --docker_kill_orphans="true" --docker_registry="https://registry-1.docker.io" --docker_remove_delay="6hrs" --docker_socket="/var/run/docker.sock" --docker_stop_timeout="0ns" --docker_store_dir="/tmp/mesos/store/docker" --docker_volume_checkpoint_dir="/var/run/mesos/isolators/docker/volume" --enforce_container_disk_quota="false" --executor_registration_timeout="1mins" --executor_shutdown_grace_period="5secs" --fetcher_cache_dir="/tmp/Endpoint_SlaveEndpointTest_NoAuthorizer_1_ax2C6s/fetch" --fetcher_cache_size="2GB" --frameworks_home="" --gc_delay="1weeks" --gc_disk_headroom="0.1" --hadoop_home="" --help="false" --hostname_lookup="true" --http_authenticators="basic" --http_command_executor="false" --http_credentials="/tmp/Endpoint_SlaveEndpointTest_NoAuthorizer_1_ax2C6s/http_credentials" --http_heartbeat_interval="30secs" --image_provisioner_backend="copy" --initialize_driver_logging="true" --isolation="posix/cpu,posix/mem" --launcher="posix" --launcher_dir="/mesos/build/src" --logbufsecs="0" --logging_level="INFO" --max_completed_executors_per_framework="150" --oversubscribed_resources_interval="15secs" --perf_duration="10secs" --perf_interval="1mins" --qos_correction_interval_min="0ns" --quiet="false" --recover="reconnect" --recovery_timeout="15mins" --registration_backoff_factor="10ms" --resources="cpus:2;gpus:0;mem:1024;disk:1024;ports:[31000-32000]" --revocable_cpu_low_priority="true" --runtime_dir="/tmp/Endpoint_SlaveEndpointTest_NoAuthorizer_1_ax2C6s" --sandbox_directory="/mnt/mesos/sandbox" --strict="true" --switch_user="true" --systemd_enable_support="true" --systemd_runtime_directory="/run/systemd/system" --version="false" --work_dir="/tmp/Endpoint_SlaveEndpointTest_NoAuthorizer_1_lpbYoD"
I0118 12:29:42.015014 25430 credentials.hpp:86] Loading credential for authentication from '/tmp/Endpoint_SlaveEndpointTest_NoAuthorizer_1_ax2C6s/credential'
I0118 12:29:42.015127 25430 slave.cpp:352] Agent using credential for: test-principal
I0118 12:29:42.015221 25430 credentials.hpp:37] Loading credentials for authentication from '/tmp/Endpoint_SlaveEndpointTest_NoAuthorizer_1_ax2C6s/http_credentials'
I0118 12:29:42.015453 25430 http.cpp:922] Using default 'basic' HTTP authenticator for realm 'mesos-agent-readonly'
I0118 12:29:42.015609 25430 http.cpp:922] Using default 'basic' HTTP authenticator for realm 'mesos-agent-readwrite'
I0118 12:29:42.016105 25430 slave.cpp:539] Agent resources: cpus(*):2; mem(*):1024; disk(*):1024; ports(*):[31000-32000]
I0118 12:29:42.016283 25430 slave.cpp:547] Agent attributes: [ ]
I0118 12:29:42.016420 25430 slave.cpp:552] Agent hostname: 64e4bcd2d878
I0118 12:29:42.016993 25432 state.cpp:60] Recovering state from '/tmp/Endpoint_SlaveEndpointTest_NoAuthorizer_1_lpbYoD/meta'
I0118 12:29:42.017124 25432 status_update_manager.cpp:203] Recovering status update manager
I0118 12:29:42.017187 25432 containerizer.cpp:599] Recovering containerizer
I0118 12:29:42.017746 25432 provisioner.cpp:251] Provisioner recovery complete
I0118 12:29:42.017881 25432 slave.cpp:5417] Finished recovery
I0118 12:29:42.018273 25432 slave.cpp:5591] Querying resource estimator for oversubscribable resources
I0118 12:29:42.018419 25432 slave.cpp:5605] Received oversubscribable resources {} from the resource estimator
I0118 12:29:42.019174 25432 process.cpp:3676] Handling HTTP event for process 'slave(678)' with path: '/slave(678)/monitor/statistics.json'
I0118 12:29:42.019520 25432 http.cpp:874] Authorizing principal 'test-principal' to GET the '/monitor/statistics.json' endpoint
I0118 12:29:42.020916 25428 slave.cpp:796] Agent terminating
[ OK ] Endpoint/SlaveEndpointTest.NoAuthorizer/1 (24 ms)
[ RUN ] Endpoint/SlaveEndpointTest.NoAuthorizer/2
I0118 12:29:42.034360 25416 containerizer.cpp:220] Using isolation: posix/cpu,posix/mem,filesystem/posix,network/cni
W0118 12:29:42.034641 25416 backend.cpp:76] Failed to create 'aufs' backend: AufsBackend requires root privileges, but is running as user mesos
W0118 12:29:42.034731 25416 backend.cpp:76] Failed to create 'bind' backend: BindBackend requires root privileges
I0118 12:29:42.035213 25416 cluster.cpp:446] Creating default 'local' authorizer
I0118 12:29:42.036123 25417 slave.cpp:209] Mesos agent started on (679)@172.17.0.4:41355
I0118 12:29:42.036155 25417 slave.cpp:210] Flags at startup: --acls="" --appc_simple_discovery_uri_prefix="http://" --appc_store_dir="/tmp/mesos/store/appc" --authenticate_http_readonly="true" --authenticate_http_readwrite="true" --authenticatee="crammd5" --authentication_backoff_factor="1secs" --authorizer="local" --cgroups_cpu_enable_pids_and_tids_count="false" --cgroups_enable_cfs="false" --cgroups_hierarchy="/sys/fs/cgroup" --cgroups_limit_swap="false" --cgroups_root="mesos" --container_disk_watch_interval="15secs" --containerizers="mesos" --credential="/tmp/Endpoint_SlaveEndpointTest_NoAuthorizer_2_lsGZ7N/credential" --default_role="*" --disk_watch_interval="1mins" --docker="docker" --docker_kill_orphans="true" --docker_registry="https://registry-1.docker.io" --docker_remove_delay="6hrs" --docker_socket="/var/run/docker.sock" --docker_stop_timeout="0ns" --docker_store_dir="/tmp/mesos/store/docker" --docker_volume_checkpoint_dir="/var/run/mesos/isolators/docker/volume" --enforce_container_disk_quota="false" --executor_registration_timeout="1mins" --executor_shutdown_grace_period="5secs" --fetcher_cache_dir="/tmp/Endpoint_SlaveEndpointTest_NoAuthorizer_2_lsGZ7N/fetch" --fetcher_cache_size="2GB" --frameworks_home="" --gc_delay="1weeks" --gc_disk_headroom="0.1" --hadoop_home="" --help="false" --hostname_lookup="true" --http_authenticators="basic" --http_command_executor="false" --http_credentials="/tmp/Endpoint_SlaveEndpointTest_NoAuthorizer_2_lsGZ7N/http_credentials" --http_heartbeat_interval="30secs" --image_provisioner_backend="copy" --initialize_driver_logging="true" --isolation="posix/cpu,posix/mem" --launcher="posix" --launcher_dir="/mesos/build/src" --logbufsecs="0" --logging_level="INFO" --max_completed_executors_per_framework="150" --oversubscribed_resources_interval="15secs" --perf_duration="10secs" --perf_interval="1mins" --qos_correction_interval_min="0ns" --quiet="false" --recover="reconnect" --recovery_timeout="15mins" --registration_backoff_factor="10ms" --resources="cpus:2;gpus:0;mem:1024;disk:1024;ports:[31000-32000]" --revocable_cpu_low_priority="true" --runtime_dir="/tmp/Endpoint_SlaveEndpointTest_NoAuthorizer_2_lsGZ7N" --sandbox_directory="/mnt/mesos/sandbox" --strict="true" --switch_user="true" --systemd_enable_support="true" --systemd_runtime_directory="/run/systemd/system" --version="false" --work_dir="/tmp/Endpoint_SlaveEndpointTest_NoAuthorizer_2_DIavmY"
I0118 12:29:42.036506 25417 credentials.hpp:86] Loading credential for authentication from '/tmp/Endpoint_SlaveEndpointTest_NoAuthorizer_2_lsGZ7N/credential'
I0118 12:29:42.036646 25417 slave.cpp:352] Agent using credential for: test-principal
I0118 12:29:42.036664 25417 credentials.hpp:37] Loading credentials for authentication from '/tmp/Endpoint_SlaveEndpointTest_NoAuthorizer_2_lsGZ7N/http_credentials'
I0118 12:29:42.036774 25417 http.cpp:922] Using default 'basic' HTTP authenticator for realm 'mesos-agent-readonly'
I0118 12:29:42.036844 25417 http.cpp:922] Using default 'basic' HTTP authenticator for realm 'mesos-agent-readwrite'
I0118 12:29:42.037227 25417 slave.cpp:539] Agent resources: cpus(*):2; mem(*):1024; disk(*):1024; ports(*):[31000-32000]
I0118 12:29:42.037261 25417 slave.cpp:547] Agent attributes: [ ]
I0118 12:29:42.037266 25417 slave.cpp:552] Agent hostname: 64e4bcd2d878
I0118 12:29:42.037689 25422 state.cpp:60] Recovering state from '/tmp/Endpoint_SlaveEndpointTest_NoAuthorizer_2_DIavmY/meta'
I0118 12:29:42.037830 25422 status_update_manager.cpp:203] Recovering status update manager
I0118 12:29:42.038014 25430 containerizer.cpp:599] Recovering containerizer
I0118 12:29:42.038558 25431 provisioner.cpp:251] Provisioner recovery complete
I0118 12:29:42.038725 25431 slave.cpp:5417] Finished recovery
I0118 12:29:42.039115 25431 slave.cpp:5591] Querying resource estimator for oversubscribable resources
I0118 12:29:42.039274 25429 slave.cpp:5605] Received oversubscribable resources {} from the resource estimator
I0118 12:29:42.040307 25431 process.cpp:3676] Handling HTTP event for process 'slave(679)' with path: '/slave(679)/containers'
I0118 12:29:42.040577 25431 http.cpp:874] Authorizing principal 'test-principal' to GET the '/containers' endpoint
I0118 12:29:42.042008 25426 slave.cpp:796] Agent terminating
[ OK ] Endpoint/SlaveEndpointTest.NoAuthorizer/2 (12 ms)
[----------] 9 tests from Endpoint/SlaveEndpointTest (155 ms total)
[----------] Global test environment tear-down
[==========] 1397 tests from 156 test cases ran. (175699 ms total)
[ PASSED ] 1396 tests.
[ FAILED ] 1 test, listed below:
[ FAILED ] SlaveRecoveryTest/0.RecoverTerminatedExecutor, where TypeParam = mesos::internal::slave::MesosContainerizer
1 FAILED TEST
YOU HAVE 14 DISABLED TESTS
make[3]: Leaving directory `/mesos/build'
make[3]: *** [CMakeFiles/check] Error 1
make[2]: Leaving directory `/mesos/build'
make[2]: *** [CMakeFiles/check.dir/all] Error 2
make[1]: *** [CMakeFiles/check.dir/rule] Error 2
make[1]: Leaving directory `/mesos/build'
make: *** [check] Error 2
+ docker rmi mesos-1484739669-20393
Untagged: mesos-1484739669-20393:latest
Deleted: sha256:c3e97569dfa37e2b66d635d9fd89bed49fe6ce5a2ea22905748323da1e2d50c7
Deleted: sha256:3f67833c07a3ec6b708edc48649b7a88e0bd2c5dc4dccba3968c8c0fefa939e5
Deleted: sha256:0f4af1eb880ec360572bd5485181ce603de607929b092f3dbf29fb1b73959dae
Deleted: sha256:63c7e0dfe93cdd364755e58ce0914aedc7eff4b0379d46c12472fd6da6d16593
Deleted: sha256:8535872ffb5d751a986ded28b29d2d844268e3c5875cfde24b51f269fc41cb31
Deleted: sha256:247c452ec2f0cfa67930165124adf0b37fe411877686673645a6510188d93bb6
Deleted: sha256:60f77118863dc593e29994451098317810a8e9de427b439c3c6028b17cbbb189
Deleted: sha256:4ca300ddba55b6905e0dabf704b111ecf60c0492500bb858246d9e95a97a8312
Deleted: sha256:b9bcc43dde3232f33d0cc022a753e05e58f0f83fe2fd9d480783c5d6b1453e60
Deleted: sha256:14ee9dd2e8ba150a7f5515bd4a58dbaf7345647d28b3eb901142ab4f28b77d8b
Deleted: sha256:2049bd83cef80eb55b25cb216f2e83bf67c803b70dc369c7b88315824b60ee12
Deleted: sha256:be1b9d3b9d3f80a8c74b451e1c988d064f601da6c65a0e285b9d1b6d0a15201e
Deleted: sha256:5acce300f647171b9e6dad768d33b08a0b8103d31e47648928ea16f1a2978d3c
Deleted: sha256:c51293fbc30e350162c4e65e3c7b0c3b73e31f8b1dbf849f5b5c86c8a7c9c42d
Deleted: sha256:8d1fe2f6e2c6b30b1c84dffda58a0e5ce67ec8bbc9420328c95a9c71191b17e4
Deleted: sha256:bbc6f00e61bd64a305fa630ade915549b1baca16e56fcddac738895e9ad68d87
Deleted: sha256:6955c7a0773952db4d1bd7f2124372084018439a071b7d30f1141aafb58fe7d2
Deleted: sha256:e43d4ecae6c829afdda327eacc519c20e4cc83936392c72f51db342ae44af698
Deleted: sha256:ca984803cb00b67f51e89644504d0b76ad34a1a7b2504b3c8908124ff7e92517
Deleted: sha256:c221da116ab4e0eed055ca1fdf694e1dde3bf8ea60b934a25cae0baf942374b5
Deleted: sha256:c428435ed098dde0ac348e1f6193c50eafdd27d31cd470e1e8ce561f277ddb44
Deleted: sha256:fe04b4d14f5825a2d76a20473e3f22100d970b1bb3ddd2f04a257e37d84abc87
Deleted: sha256:410fffaea8f45eeddc46dbeb9c24dc053a726938c86924add837ab8a35c52149
Deleted: sha256:7b92ca91cba3485ec7331f9e83bc6ece6288a99fb613e50a7b065f3b32f7410d
Deleted: sha256:946a40005bad25a2b19b983b19f1ed046ed2b4079db4eb48bee68166f94ec0df
Build step 'Execute shell' marked build as failure
Jenkins build is back to normal : Mesos-Buildbot » cmake,gcc,--verbose,GLOG_v=1 MESOS_VERBOSE=1,centos:7,(docker||Hadoop)&&(!ubuntu-us1)&&(!ubuntu-6)&&(!ubuntu-eu2) #3126
Posted by Apache Jenkins Server <je...@builds.apache.org>.
See <https://builds.apache.org/job/Mesos-Buildbot/BUILDTOOL=cmake,COMPILER=gcc,CONFIGURATION=--verbose,ENVIRONMENT=GLOG_v=1%20MESOS_VERBOSE=1,OS=centos%3A7,label_exp=(docker%7C%7CHadoop)&&(!ubuntu-us1)&&(!ubuntu-6)&&(!ubuntu-eu2)/3126/changes>