You are viewing a plain text version of this content. The canonical link for it is here.
Posted to builds@cassandra.apache.org by Apache Jenkins Server <je...@builds.apache.org> on 2025/04/02 15:32:36 UTC

Build complete: Cassandra-5.0 #426 [UNSTABLE] d954c19b21bcf53da3f15fae40a0751c6dcc73df

-------------------------------------------------------------------------------
  Build Cassandra-5.0 #426 Still Unstable
  URL: https://ci-cassandra.apache.org/job/Cassandra-5.0/426/
  -------------------------------------------------------------------------------
  Changes:
  No changes

  -------------------------------------------------------------------------------
  Failed Tests:
  5 tests failed.
FAILED:  dtest-latest.bootstrap_test.TestBootstrap.Tests / dtest-latest jdk11 19/64 / test_simultaneous_bootstrap
FAILED:  org.apache.cassandra.db.commitlog.BatchCommitLogTest.Tests / test-compression jdk11 7/16 / testBatchCLShutDownImmediately[0]-compression_jdk11_x86_64
FAILED:  org.apache.cassandra.db.commitlog.BatchCommitLogTest.Tests / test-oa jdk17 7/16 / testBatchCLShutDownImmediately[0]-oa_jdk17_x86_64
FAILED:  org.apache.cassandra.io.util.ThreadLocalReadAheadBufferTest.Tests / test-cdc jdk11 2/8 / testReadsLikeChannelProxy-cdc_jdk11_x86_64
FAILED:  dtest.bootstrap_test.TestBootstrap.Tests / dtest jdk11 14/64 / test_killed_wiped_node_cannot_join

  -------------------------------------------------------------------------------
  For complete test report and logs see https://nightlies.apache.org/cassandra/Cassandra-5.0/426/