You are viewing a plain text version of this content. The canonical link for it is here.
Posted to dev@kafka.apache.org by Apache Jenkins Server <je...@builds.apache.org> on 2016/03/31 06:38:17 UTC
Build failed in Jenkins: kafka-trunk-jdk7 #1161
See <https://builds.apache.org/job/kafka-trunk-jdk7/1161/changes>
Changes:
[cshapi] KAFKA-3475; Introduce our own `MiniKdc`
[cshapi] KAFKA-3381: Add system test for SimpleConsumerShell
------------------------------------------
[...truncated 682 lines...]
kafka.server.LogOffsetTest > testEmptyLogsGetOffsets PASSED
kafka.server.LogOffsetTest > testGetOffsetsBeforeLatestTime PASSED
kafka.server.LogOffsetTest > testGetOffsetsBeforeNow PASSED
kafka.server.ClientQuotaManagerTest > testQuotaViolation PASSED
kafka.server.ClientQuotaManagerTest > testExpireQuotaSensors PASSED
kafka.server.ClientQuotaManagerTest > testExpireThrottleTimeSensor PASSED
kafka.server.ClientQuotaManagerTest > testQuotaParsing PASSED
kafka.server.KafkaConfigTest > testAdvertiseConfigured PASSED
kafka.server.KafkaConfigTest > testLogRetentionTimeHoursProvided PASSED
kafka.server.KafkaConfigTest > testLogRollTimeBothMsAndHoursProvided PASSED
kafka.server.KafkaConfigTest > testLogRetentionValid PASSED
kafka.server.KafkaConfigTest > testSpecificProperties PASSED
kafka.server.KafkaConfigTest > testDefaultCompressionType PASSED
kafka.server.KafkaConfigTest > testDuplicateListeners PASSED
kafka.server.KafkaConfigTest > testLogRetentionUnlimited PASSED
kafka.server.KafkaConfigTest > testLogRetentionTimeMsProvided PASSED
kafka.server.KafkaConfigTest > testLogRollTimeNoConfigProvided PASSED
kafka.server.KafkaConfigTest > testInvalidInterBrokerSecurityProtocol PASSED
kafka.server.KafkaConfigTest > testAdvertiseDefaults PASSED
kafka.server.KafkaConfigTest > testBadListenerProtocol PASSED
kafka.server.KafkaConfigTest > testListenerDefaults PASSED
kafka.server.KafkaConfigTest > testLogRetentionTimeBothMinutesAndHoursProvided PASSED
kafka.server.KafkaConfigTest > testUncleanElectionDisabled PASSED
kafka.server.KafkaConfigTest > testLogRetentionTimeNoConfigProvided PASSED
kafka.server.KafkaConfigTest > testCaseInsensitiveListenerProtocol PASSED
kafka.server.KafkaConfigTest > testFromPropsInvalid PASSED
kafka.server.KafkaConfigTest > testInvalidCompressionType PASSED
kafka.server.KafkaConfigTest > testAdvertiseHostNameDefault PASSED
kafka.server.KafkaConfigTest > testLogRetentionTimeMinutesProvided PASSED
kafka.server.KafkaConfigTest > testValidCompressionType PASSED
kafka.server.KafkaConfigTest > testUncleanElectionInvalid PASSED
kafka.server.KafkaConfigTest > testLogRetentionTimeBothMinutesAndMsProvided PASSED
kafka.server.KafkaConfigTest > testLogRollTimeMsProvided PASSED
kafka.server.KafkaConfigTest > testUncleanLeaderElectionDefault PASSED
kafka.server.KafkaConfigTest > testInvalidAdvertisedListenersProtocol PASSED
kafka.server.KafkaConfigTest > testUncleanElectionEnabled PASSED
kafka.server.KafkaConfigTest > testAdvertisePortDefault PASSED
kafka.server.KafkaConfigTest > testVersionConfiguration PASSED
kafka.server.KafkaConfigTest > testEqualAdvertisedListenersProtocol PASSED
kafka.server.LogRecoveryTest > testHWCheckpointNoFailuresMultipleLogSegments PASSED
kafka.server.LogRecoveryTest > testHWCheckpointWithFailuresMultipleLogSegments PASSED
kafka.server.LogRecoveryTest > testHWCheckpointNoFailuresSingleLogSegment PASSED
kafka.server.LogRecoveryTest > testHWCheckpointWithFailuresSingleLogSegment PASSED
kafka.server.SaslPlaintextReplicaFetchTest > testReplicaFetcherThread PASSED
kafka.server.ServerStartupTest > testBrokerCreatesZKChroot PASSED
kafka.server.ServerStartupTest > testConflictBrokerRegistration PASSED
kafka.server.ServerStartupTest > testBrokerSelfAware PASSED
kafka.server.IsrExpirationTest > testIsrExpirationForSlowFollowers PASSED
kafka.server.IsrExpirationTest > testIsrExpirationForStuckFollowers PASSED
kafka.server.IsrExpirationTest > testIsrExpirationIfNoFetchRequestMade PASSED
kafka.server.AdvertiseBrokerTest > testBrokerAdvertiseToZK PASSED
kafka.server.MetadataCacheTest > getTopicMetadataWithNonSupportedSecurityProtocol PASSED
kafka.server.MetadataCacheTest > getTopicMetadataIsrNotAvailable PASSED
kafka.server.MetadataCacheTest > getTopicMetadata PASSED
kafka.server.MetadataCacheTest > getTopicMetadataReplicaNotAvailable PASSED
kafka.server.MetadataCacheTest > getTopicMetadataPartitionLeaderNotAvailable PASSED
kafka.server.MetadataCacheTest > getAliveBrokersShouldNotBeMutatedByUpdateCache PASSED
kafka.server.MetadataCacheTest > getTopicMetadataNonExistingTopics PASSED
kafka.server.SaslSslReplicaFetchTest > testReplicaFetcherThread PASSED
kafka.tools.ConsoleProducerTest > testParseKeyProp PASSED
kafka.tools.ConsoleProducerTest > testValidConfigsOldProducer PASSED
kafka.tools.ConsoleProducerTest > testInvalidConfigs PASSED
kafka.tools.ConsoleProducerTest > testValidConfigsNewProducer PASSED
kafka.tools.ConsoleConsumerTest > shouldLimitReadsToMaxMessageLimit PASSED
kafka.tools.ConsoleConsumerTest > shouldParseValidNewConsumerValidConfig PASSED
kafka.tools.ConsoleConsumerTest > shouldParseConfigsFromFile PASSED
kafka.tools.ConsoleConsumerTest > shouldParseValidOldConsumerValidConfig PASSED
kafka.api.RequestResponseSerializationTest > testSerializationAndDeserialization PASSED
kafka.api.RequestResponseSerializationTest > testFetchResponseVersion PASSED
kafka.api.RequestResponseSerializationTest > testProduceResponseVersion PASSED
kafka.api.RackAwareAutoTopicCreationTest > testAutoCreateTopic PASSED
kafka.api.AdminClientTest > testDescribeGroup PASSED
kafka.api.AdminClientTest > testDescribeConsumerGroup PASSED
kafka.api.AdminClientTest > testListGroups PASSED
kafka.api.AdminClientTest > testDescribeConsumerGroupForNonExistentGroup PASSED
kafka.api.SslEndToEndAuthorizationTest > testNoConsumeAcl PASSED
kafka.api.SslEndToEndAuthorizationTest > testProduceConsume PASSED
kafka.api.SslEndToEndAuthorizationTest > testNoProduceAcl PASSED
kafka.api.SslEndToEndAuthorizationTest > testNoGroupAcl PASSED
kafka.api.SaslSslConsumerTest > testPauseStateNotPreservedByRebalance PASSED
kafka.api.SaslSslConsumerTest > testUnsubscribeTopic PASSED
kafka.api.SaslSslConsumerTest > testListTopics PASSED
kafka.api.SaslSslConsumerTest > testAutoCommitOnRebalance PASSED
ERROR: Could not install GRADLE_2_4_RC_2_HOME
java.lang.NullPointerException
at hudson.plugins.toolenv.ToolEnvBuildWrapper$1.buildEnvVars(ToolEnvBuildWrapper.java:46)
at hudson.model.AbstractBuild.getEnvironment(AbstractBuild.java:947)
at hudson.plugins.git.GitSCM.getParamExpandedRepos(GitSCM.java:390)
at hudson.plugins.git.GitSCM.compareRemoteRevisionWithImpl(GitSCM.java:577)
at hudson.plugins.git.GitSCM.compareRemoteRevisionWith(GitSCM.java:527)
at hudson.scm.SCM.compareRemoteRevisionWith(SCM.java:381)
at hudson.scm.SCM.poll(SCM.java:398)
at hudson.model.AbstractProject._poll(AbstractProject.java:1453)
at hudson.model.AbstractProject.poll(AbstractProject.java:1356)
at hudson.triggers.SCMTrigger$Runner.runPolling(SCMTrigger.java:526)
at hudson.triggers.SCMTrigger$Runner.run(SCMTrigger.java:555)
at hudson.util.SequentialExecutionQueue$QueueEntry.run(SequentialExecutionQueue.java:119)
at java.util.concurrent.Executors$RunnableAdapter.call(Executors.java:471)
at java.util.concurrent.FutureTask.run(FutureTask.java:262)
at java.util.concurrent.ThreadPoolExecutor.runWorker(ThreadPoolExecutor.java:1145)
at java.util.concurrent.ThreadPoolExecutor$Worker.run(ThreadPoolExecutor.java:615)
at java.lang.Thread.run(Thread.java:745)
ERROR: Could not install JDK_1_7U51_HOME
java.lang.NullPointerException
at hudson.plugins.toolenv.ToolEnvBuildWrapper$1.buildEnvVars(ToolEnvBuildWrapper.java:46)
at hudson.model.AbstractBuild.getEnvironment(AbstractBuild.java:947)
at hudson.plugins.git.GitSCM.getParamExpandedRepos(GitSCM.java:390)
at hudson.plugins.git.GitSCM.compareRemoteRevisionWithImpl(GitSCM.java:577)
at hudson.plugins.git.GitSCM.compareRemoteRevisionWith(GitSCM.java:527)
at hudson.scm.SCM.compareRemoteRevisionWith(SCM.java:381)
at hudson.scm.SCM.poll(SCM.java:398)
at hudson.model.AbstractProject._poll(AbstractProject.java:1453)
at hudson.model.AbstractProject.poll(AbstractProject.java:1356)
at hudson.triggers.SCMTrigger$Runner.runPolling(SCMTrigger.java:526)
at hudson.triggers.SCMTrigger$Runner.run(SCMTrigger.java:555)
at hudson.util.SequentialExecutionQueue$QueueEntry.run(SequentialExecutionQueue.java:119)
at java.util.concurrent.Executors$RunnableAdapter.call(Executors.java:471)
at java.util.concurrent.FutureTask.run(FutureTask.java:262)
at java.util.concurrent.ThreadPoolExecutor.runWorker(ThreadPoolExecutor.java:1145)
at java.util.concurrent.ThreadPoolExecutor$Worker.run(ThreadPoolExecutor.java:615)
at java.lang.Thread.run(Thread.java:745)
ERROR: Could not install GRADLE_2_4_RC_2_HOME
java.lang.NullPointerException
at hudson.plugins.toolenv.ToolEnvBuildWrapper$1.buildEnvVars(ToolEnvBuildWrapper.java:46)
at hudson.model.AbstractBuild.getEnvironment(AbstractBuild.java:947)
at hudson.plugins.git.GitSCM.getParamExpandedRepos(GitSCM.java:390)
at hudson.plugins.git.GitSCM.compareRemoteRevisionWithImpl(GitSCM.java:577)
at hudson.plugins.git.GitSCM.compareRemoteRevisionWith(GitSCM.java:527)
at hudson.scm.SCM.compareRemoteRevisionWith(SCM.java:381)
at hudson.scm.SCM.poll(SCM.java:398)
at hudson.model.AbstractProject._poll(AbstractProject.java:1453)
at hudson.model.AbstractProject.poll(AbstractProject.java:1356)
at hudson.triggers.SCMTrigger$Runner.runPolling(SCMTrigger.java:526)
at hudson.triggers.SCMTrigger$Runner.run(SCMTrigger.java:555)
at hudson.util.SequentialExecutionQueue$QueueEntry.run(SequentialExecutionQueue.java:119)
at java.util.concurrent.Executors$RunnableAdapter.call(Executors.java:471)
at java.util.concurrent.FutureTask.run(FutureTask.java:262)
at java.util.concurrent.ThreadPoolExecutor.runWorker(ThreadPoolExecutor.java:1145)
at java.util.concurrent.ThreadPoolExecutor$Worker.run(ThreadPoolExecutor.java:615)
at java.lang.Thread.run(Thread.java:745)
ERROR: Could not install JDK_1_7U51_HOME
java.lang.NullPointerException
at hudson.plugins.toolenv.ToolEnvBuildWrapper$1.buildEnvVars(ToolEnvBuildWrapper.java:46)
at hudson.model.AbstractBuild.getEnvironment(AbstractBuild.java:947)
at hudson.plugins.git.GitSCM.getParamExpandedRepos(GitSCM.java:390)
at hudson.plugins.git.GitSCM.compareRemoteRevisionWithImpl(GitSCM.java:577)
at hudson.plugins.git.GitSCM.compareRemoteRevisionWith(GitSCM.java:527)
at hudson.scm.SCM.compareRemoteRevisionWith(SCM.java:381)
at hudson.scm.SCM.poll(SCM.java:398)
at hudson.model.AbstractProject._poll(AbstractProject.java:1453)
at hudson.model.AbstractProject.poll(AbstractProject.java:1356)
at hudson.triggers.SCMTrigger$Runner.runPolling(SCMTrigger.java:526)
at hudson.triggers.SCMTrigger$Runner.run(SCMTrigger.java:555)
at hudson.util.SequentialExecutionQueue$QueueEntry.run(SequentialExecutionQueue.java:119)
at java.util.concurrent.Executors$RunnableAdapter.call(Executors.java:471)
at java.util.concurrent.FutureTask.run(FutureTask.java:262)
at java.util.concurrent.ThreadPoolExecutor.runWorker(ThreadPoolExecutor.java:1145)
at java.util.concurrent.ThreadPoolExecutor$Worker.run(ThreadPoolExecutor.java:615)
at java.lang.Thread.run(Thread.java:745)
Build timed out (after 120 minutes). Marking the build as failed.
Build was aborted
Recording test results
Setting GRADLE_2_4_RC_2_HOME=/home/jenkins/jenkins-slave/tools/hudson.plugins.gradle.GradleInstallation/Gradle_2.4-rc-2
Setting JDK_1_7U51_HOME=/home/jenkins/jenkins-slave/tools/hudson.model.JDK/jdk-1.7u51
ERROR: Step ?Publish JUnit test result report? failed: No test report files were found. Configuration error?
Setting GRADLE_2_4_RC_2_HOME=/home/jenkins/jenkins-slave/tools/hudson.plugins.gradle.GradleInstallation/Gradle_2.4-rc-2
Setting JDK_1_7U51_HOME=/home/jenkins/jenkins-slave/tools/hudson.model.JDK/jdk-1.7u51
Jenkins build is back to normal : kafka-trunk-jdk7 #1165
Posted by Apache Jenkins Server <je...@builds.apache.org>.
See <https://builds.apache.org/job/kafka-trunk-jdk7/1165/changes>
Build failed in Jenkins: kafka-trunk-jdk7 #1164
Posted by Apache Jenkins Server <je...@builds.apache.org>.
See <https://builds.apache.org/job/kafka-trunk-jdk7/1164/changes>
Changes:
[cshapi] MINOR: add null check for aggregate and reduce operators
------------------------------------------
[...truncated 3752 lines...]
org.apache.kafka.common.config.ConfigDefTest > testInvalidDefaultString PASSED
org.apache.kafka.common.config.ConfigDefTest > testSslPasswords PASSED
org.apache.kafka.common.config.ConfigDefTest > testInvalidDefault PASSED
org.apache.kafka.common.config.ConfigDefTest > testMissingRequired PASSED
org.apache.kafka.common.config.ConfigDefTest > testNullDefaultWithValidator PASSED
org.apache.kafka.common.config.ConfigDefTest > testDefinedTwice PASSED
org.apache.kafka.common.config.ConfigDefTest > testBadInputs PASSED
org.apache.kafka.common.config.ConfigDefTest > testValidateMissingConfigKey PASSED
org.apache.kafka.common.protocol.ErrorsTest > testForExceptionDefault PASSED
org.apache.kafka.common.protocol.ErrorsTest > testUniqueExceptions PASSED
org.apache.kafka.common.protocol.ErrorsTest > testForExceptionInheritance PASSED
org.apache.kafka.common.protocol.ErrorsTest > testNoneException PASSED
org.apache.kafka.common.protocol.ErrorsTest > testUniqueErrorCodes PASSED
org.apache.kafka.common.protocol.ErrorsTest > testExceptionsAreNotGeneric PASSED
org.apache.kafka.common.protocol.ApiKeysTest > testForIdWithInvalidIdLow PASSED
org.apache.kafka.common.protocol.ApiKeysTest > testForIdWithInvalidIdHigh PASSED
org.apache.kafka.common.protocol.ProtoUtilsTest > schemaVersionOutOfRange PASSED
org.apache.kafka.common.protocol.types.ProtocolSerializationTest > testNulls PASSED
org.apache.kafka.common.protocol.types.ProtocolSerializationTest > testReadStringSizeTooLarge PASSED
org.apache.kafka.common.protocol.types.ProtocolSerializationTest > testNullableDefault PASSED
org.apache.kafka.common.protocol.types.ProtocolSerializationTest > testReadNegativeStringSize PASSED
org.apache.kafka.common.protocol.types.ProtocolSerializationTest > testReadArraySizeTooLarge PASSED
org.apache.kafka.common.protocol.types.ProtocolSerializationTest > testDefault PASSED
org.apache.kafka.common.protocol.types.ProtocolSerializationTest > testReadNegativeBytesSize PASSED
org.apache.kafka.common.protocol.types.ProtocolSerializationTest > testReadBytesSizeTooLarge PASSED
org.apache.kafka.common.protocol.types.ProtocolSerializationTest > testSimple PASSED
org.apache.kafka.common.protocol.types.ProtocolSerializationTest > testReadNegativeArraySize PASSED
org.apache.kafka.common.requests.RequestResponseTest > testSerialization PASSED
org.apache.kafka.common.requests.RequestResponseTest > fetchResponseVersionTest PASSED
org.apache.kafka.common.requests.RequestResponseTest > produceResponseVersionTest PASSED
org.apache.kafka.common.requests.RequestResponseTest > testControlledShutdownResponse PASSED
org.apache.kafka.common.requests.RequestResponseTest > testRequestHeaderWithNullClientId PASSED
org.apache.kafka.common.security.auth.KafkaPrincipalTest > testPrincipalNameCanContainSeparator PASSED
org.apache.kafka.common.security.auth.KafkaPrincipalTest > testEqualsAndHashCode PASSED
org.apache.kafka.common.security.kerberos.KerberosNameTest > testParse PASSED
org.apache.kafka.common.security.ssl.SslFactoryTest > testClientMode PASSED
org.apache.kafka.common.security.ssl.SslFactoryTest > testSslFactoryConfiguration PASSED
org.apache.kafka.common.metrics.MetricsTest > testSimpleStats PASSED
org.apache.kafka.common.metrics.MetricsTest > testOldDataHasNoEffect PASSED
org.apache.kafka.common.metrics.MetricsTest > testQuotasEquality PASSED
org.apache.kafka.common.metrics.MetricsTest > testRemoveInactiveMetrics PASSED
org.apache.kafka.common.metrics.MetricsTest > testMetricName PASSED
org.apache.kafka.common.metrics.MetricsTest > testRateWindowing PASSED
org.apache.kafka.common.metrics.MetricsTest > testTimeWindowing PASSED
org.apache.kafka.common.metrics.MetricsTest > testEventWindowing PASSED
org.apache.kafka.common.metrics.MetricsTest > testRemoveMetric PASSED
org.apache.kafka.common.metrics.MetricsTest > testBadSensorHierarchy PASSED
org.apache.kafka.common.metrics.MetricsTest > testRemoveSensor PASSED
org.apache.kafka.common.metrics.MetricsTest > testPercentiles PASSED
org.apache.kafka.common.metrics.MetricsTest > testDuplicateMetricName PASSED
org.apache.kafka.common.metrics.MetricsTest > testQuotas PASSED
org.apache.kafka.common.metrics.MetricsTest > testHierarchicalSensors PASSED
org.apache.kafka.common.metrics.JmxReporterTest > testJmxRegistration PASSED
org.apache.kafka.common.metrics.stats.HistogramTest > testHistogram PASSED
org.apache.kafka.common.metrics.stats.HistogramTest > testConstantBinScheme PASSED
org.apache.kafka.common.metrics.stats.HistogramTest > testLinearBinScheme PASSED
org.apache.kafka.common.utils.CrcTest > testUpdateInt PASSED
org.apache.kafka.common.utils.CrcTest > testUpdate PASSED
org.apache.kafka.common.utils.UtilsTest > testAbs PASSED
org.apache.kafka.common.utils.UtilsTest > testMin PASSED
org.apache.kafka.common.utils.UtilsTest > testJoin PASSED
org.apache.kafka.common.utils.UtilsTest > testReadBytes PASSED
org.apache.kafka.common.utils.UtilsTest > testGetHost PASSED
org.apache.kafka.common.utils.UtilsTest > testGetPort PASSED
org.apache.kafka.common.utils.UtilsTest > testFormatAddress PASSED
org.apache.kafka.common.utils.AbstractIteratorTest > testEmptyIterator PASSED
org.apache.kafka.common.utils.AbstractIteratorTest > testIterator PASSED
org.apache.kafka.common.ClusterTest > testBootstrap PASSED
org.apache.kafka.common.cache.LRUCacheTest > testEviction PASSED
org.apache.kafka.common.cache.LRUCacheTest > testPutGet PASSED
org.apache.kafka.common.cache.LRUCacheTest > testRemove PASSED
org.apache.kafka.common.network.SslTransportLayerTest > testClientAuthenticationRequestedValidProvided PASSED
org.apache.kafka.common.network.SslTransportLayerTest > testUnsupportedCiphers PASSED
org.apache.kafka.common.network.SslTransportLayerTest > testUnsupportedTLSVersion PASSED
org.apache.kafka.common.network.SslTransportLayerTest > testClientAuthenticationRequiredNotProvided PASSED
org.apache.kafka.common.network.SslTransportLayerTest > testClientAuthenticationRequestedNotProvided PASSED
org.apache.kafka.common.network.SslTransportLayerTest > testInvalidKeystorePassword PASSED
org.apache.kafka.common.network.SslTransportLayerTest > testClientAuthenticationDisabledNotProvided PASSED
org.apache.kafka.common.network.SslTransportLayerTest > testInvalidEndpointIdentification PASSED
org.apache.kafka.common.network.SslTransportLayerTest > testEndpointIdentificationDisabled PASSED
org.apache.kafka.common.network.SslTransportLayerTest > testClientAuthenticationRequiredUntrustedProvided PASSED
org.apache.kafka.common.network.SslTransportLayerTest > testClientAuthenticationDisabledUntrustedProvided PASSED
org.apache.kafka.common.network.SslTransportLayerTest > testNetReadBufferResize PASSED
org.apache.kafka.common.network.SslTransportLayerTest > testNetWriteBufferResize PASSED
org.apache.kafka.common.network.SslTransportLayerTest > testInvalidTruststorePassword PASSED
org.apache.kafka.common.network.SslTransportLayerTest > testApplicationBufferResize PASSED
org.apache.kafka.common.network.SslTransportLayerTest > testClientAuthenticationRequiredValidProvided PASSED
org.apache.kafka.common.network.SslTransportLayerTest > testInvalidKeyPassword PASSED
org.apache.kafka.common.network.SslTransportLayerTest > testValidEndpointIdentification PASSED
org.apache.kafka.common.network.SelectorTest > testSendLargeRequest PASSED
org.apache.kafka.common.network.SelectorTest > testLargeMessageSequence PASSED
org.apache.kafka.common.network.SelectorTest > testMute PASSED
org.apache.kafka.common.network.SelectorTest > testCantSendWithInProgress PASSED
org.apache.kafka.common.network.SelectorTest > testExistingConnectionId PASSED
org.apache.kafka.common.network.SelectorTest > testCantSendWithoutConnecting PASSED
org.apache.kafka.common.network.SelectorTest > testCloseOldestConnection PASSED
org.apache.kafka.common.network.SelectorTest > testServerDisconnect PASSED
org.apache.kafka.common.network.SelectorTest > testNoRouteToHost PASSED
org.apache.kafka.common.network.SelectorTest > testNormalOperation PASSED
org.apache.kafka.common.network.SelectorTest > testConnectionRefused PASSED
org.apache.kafka.common.network.SelectorTest > testEmptyRequest PASSED
org.apache.kafka.common.network.SslSelectorTest > testDisabledRenegotiation PASSED
ERROR: Could not install GRADLE_2_4_RC_2_HOME
java.lang.NullPointerException
at hudson.plugins.toolenv.ToolEnvBuildWrapper$1.buildEnvVars(ToolEnvBuildWrapper.java:46)
at hudson.model.AbstractBuild.getEnvironment(AbstractBuild.java:947)
at hudson.plugins.git.GitSCM.getParamExpandedRepos(GitSCM.java:390)
at hudson.plugins.git.GitSCM.compareRemoteRevisionWithImpl(GitSCM.java:577)
at hudson.plugins.git.GitSCM.compareRemoteRevisionWith(GitSCM.java:527)
at hudson.scm.SCM.compareRemoteRevisionWith(SCM.java:381)
at hudson.scm.SCM.poll(SCM.java:398)
at hudson.model.AbstractProject._poll(AbstractProject.java:1453)
at hudson.model.AbstractProject.poll(AbstractProject.java:1356)
at hudson.triggers.SCMTrigger$Runner.runPolling(SCMTrigger.java:526)
at hudson.triggers.SCMTrigger$Runner.run(SCMTrigger.java:555)
at hudson.util.SequentialExecutionQueue$QueueEntry.run(SequentialExecutionQueue.java:119)
at java.util.concurrent.Executors$RunnableAdapter.call(Executors.java:471)
at java.util.concurrent.FutureTask.run(FutureTask.java:262)
at java.util.concurrent.ThreadPoolExecutor.runWorker(ThreadPoolExecutor.java:1145)
at java.util.concurrent.ThreadPoolExecutor$Worker.run(ThreadPoolExecutor.java:615)
at java.lang.Thread.run(Thread.java:745)
ERROR: Could not install JDK_1_7U51_HOME
java.lang.NullPointerException
at hudson.plugins.toolenv.ToolEnvBuildWrapper$1.buildEnvVars(ToolEnvBuildWrapper.java:46)
at hudson.model.AbstractBuild.getEnvironment(AbstractBuild.java:947)
at hudson.plugins.git.GitSCM.getParamExpandedRepos(GitSCM.java:390)
at hudson.plugins.git.GitSCM.compareRemoteRevisionWithImpl(GitSCM.java:577)
at hudson.plugins.git.GitSCM.compareRemoteRevisionWith(GitSCM.java:527)
at hudson.scm.SCM.compareRemoteRevisionWith(SCM.java:381)
at hudson.scm.SCM.poll(SCM.java:398)
at hudson.model.AbstractProject._poll(AbstractProject.java:1453)
at hudson.model.AbstractProject.poll(AbstractProject.java:1356)
at hudson.triggers.SCMTrigger$Runner.runPolling(SCMTrigger.java:526)
at hudson.triggers.SCMTrigger$Runner.run(SCMTrigger.java:555)
at hudson.util.SequentialExecutionQueue$QueueEntry.run(SequentialExecutionQueue.java:119)
at java.util.concurrent.Executors$RunnableAdapter.call(Executors.java:471)
at java.util.concurrent.FutureTask.run(FutureTask.java:262)
at java.util.concurrent.ThreadPoolExecutor.runWorker(ThreadPoolExecutor.java:1145)
at java.util.concurrent.ThreadPoolExecutor$Worker.run(ThreadPoolExecutor.java:615)
at java.lang.Thread.run(Thread.java:745)
Build timed out (after 120 minutes). Marking the build as failed.
Build was aborted
Recording test results
Setting GRADLE_2_4_RC_2_HOME=/home/jenkins/jenkins-slave/tools/hudson.plugins.gradle.GradleInstallation/Gradle_2.4-rc-2
Setting JDK_1_7U51_HOME=/home/jenkins/jenkins-slave/tools/hudson.model.JDK/jdk-1.7u51
Setting GRADLE_2_4_RC_2_HOME=/home/jenkins/jenkins-slave/tools/hudson.plugins.gradle.GradleInstallation/Gradle_2.4-rc-2
Setting JDK_1_7U51_HOME=/home/jenkins/jenkins-slave/tools/hudson.model.JDK/jdk-1.7u51
Build failed in Jenkins: kafka-trunk-jdk7 #1163
Posted by Apache Jenkins Server <je...@builds.apache.org>.
See <https://builds.apache.org/job/kafka-trunk-jdk7/1163/changes>
Changes:
[me] KAFKA-2910: Close Zookeeper clients in unit tests
------------------------------------------
[...truncated 1564 lines...]
kafka.consumer.ZookeeperConsumerConnectorTest > testConsumerDecoder PASSED
kafka.consumer.ZookeeperConsumerConnectorTest > testConsumerRebalanceListener PASSED
kafka.consumer.ZookeeperConsumerConnectorTest > testCompression PASSED
kafka.controller.ControllerFailoverTest > testMetadataUpdate PASSED
kafka.producer.ProducerTest > testSendToNewTopic PASSED
kafka.producer.ProducerTest > testAsyncSendCanCorrectlyFailWithTimeout PASSED
kafka.producer.ProducerTest > testSendNullMessage PASSED
kafka.producer.ProducerTest > testUpdateBrokerPartitionInfo PASSED
kafka.producer.ProducerTest > testSendWithDeadBroker PASSED
kafka.producer.AsyncProducerTest > testFailedSendRetryLogic PASSED
kafka.producer.AsyncProducerTest > testQueueTimeExpired PASSED
kafka.producer.AsyncProducerTest > testPartitionAndCollateEvents PASSED
kafka.producer.AsyncProducerTest > testBatchSize PASSED
kafka.producer.AsyncProducerTest > testSerializeEvents PASSED
kafka.producer.AsyncProducerTest > testProducerQueueSize PASSED
kafka.producer.AsyncProducerTest > testRandomPartitioner PASSED
kafka.producer.AsyncProducerTest > testInvalidConfiguration PASSED
kafka.producer.AsyncProducerTest > testInvalidPartition PASSED
kafka.producer.AsyncProducerTest > testNoBroker PASSED
kafka.producer.AsyncProducerTest > testProduceAfterClosed PASSED
kafka.producer.AsyncProducerTest > testJavaProducer PASSED
kafka.producer.AsyncProducerTest > testIncompatibleEncoder PASSED
kafka.producer.SyncProducerTest > testReachableServer PASSED
kafka.producer.SyncProducerTest > testMessageSizeTooLarge PASSED
kafka.producer.SyncProducerTest > testNotEnoughReplicas PASSED
kafka.producer.SyncProducerTest > testMessageSizeTooLargeWithAckZero PASSED
kafka.producer.SyncProducerTest > testProducerCanTimeout PASSED
kafka.producer.SyncProducerTest > testProduceRequestWithNoResponse PASSED
kafka.producer.SyncProducerTest > testEmptyProduceRequest PASSED
kafka.producer.SyncProducerTest > testProduceCorrectlyReceivesResponse PASSED
kafka.tools.ConsoleProducerTest > testParseKeyProp PASSED
kafka.tools.ConsoleProducerTest > testValidConfigsOldProducer PASSED
kafka.tools.ConsoleProducerTest > testInvalidConfigs PASSED
kafka.tools.ConsoleProducerTest > testValidConfigsNewProducer PASSED
kafka.tools.ConsoleConsumerTest > shouldLimitReadsToMaxMessageLimit PASSED
kafka.tools.ConsoleConsumerTest > shouldParseValidNewConsumerValidConfig PASSED
kafka.tools.ConsoleConsumerTest > shouldParseConfigsFromFile PASSED
kafka.tools.ConsoleConsumerTest > shouldParseValidOldConsumerValidConfig PASSED
kafka.security.auth.PermissionTypeTest > testFromString PASSED
kafka.security.auth.ResourceTypeTest > testFromString PASSED
kafka.security.auth.OperationTest > testFromString PASSED
kafka.security.auth.AclTest > testAclJsonConversion PASSED
kafka.security.auth.ZkAuthorizationTest > testIsZkSecurityEnabled PASSED
kafka.security.auth.ZkAuthorizationTest > testZkUtils PASSED
kafka.security.auth.ZkAuthorizationTest > testZkAntiMigration PASSED
kafka.security.auth.ZkAuthorizationTest > testZkMigration PASSED
kafka.security.auth.ZkAuthorizationTest > testChroot PASSED
kafka.security.auth.ZkAuthorizationTest > testDelete PASSED
kafka.security.auth.ZkAuthorizationTest > testDeleteRecursive PASSED
kafka.security.auth.SimpleAclAuthorizerTest > testAllowAllAccess PASSED
kafka.security.auth.SimpleAclAuthorizerTest > testLocalConcurrentModificationOfResourceAcls PASSED
kafka.security.auth.SimpleAclAuthorizerTest > testNoAclFound PASSED
kafka.security.auth.SimpleAclAuthorizerTest > testDistributedConcurrentModificationOfResourceAcls PASSED
kafka.security.auth.SimpleAclAuthorizerTest > testAclManagementAPIs PASSED
kafka.security.auth.SimpleAclAuthorizerTest > testWildCardAcls PASSED
kafka.security.auth.SimpleAclAuthorizerTest > testTopicAcl PASSED
kafka.security.auth.SimpleAclAuthorizerTest > testSuperUserHasAccess PASSED
kafka.security.auth.SimpleAclAuthorizerTest > testDenyTakesPrecedence PASSED
kafka.security.auth.SimpleAclAuthorizerTest > testNoAclFoundOverride PASSED
kafka.security.auth.SimpleAclAuthorizerTest > testHighConcurrencyModificationOfResourceAcls PASSED
kafka.security.auth.SimpleAclAuthorizerTest > testLoadCache PASSED
kafka.integration.SaslPlaintextTopicMetadataTest > testIsrAfterBrokerShutDownAndJoinsBack PASSED
kafka.integration.SaslPlaintextTopicMetadataTest > testAutoCreateTopicWithCollision PASSED
kafka.integration.SaslPlaintextTopicMetadataTest > testAliveBrokerListWithNoTopics PASSED
kafka.integration.SaslPlaintextTopicMetadataTest > testAutoCreateTopic PASSED
kafka.integration.SaslPlaintextTopicMetadataTest > testGetAllTopicMetadata PASSED
kafka.integration.SaslPlaintextTopicMetadataTest > testAliveBrokersListWithNoTopicsAfterNewBrokerStartup PASSED
kafka.integration.SaslPlaintextTopicMetadataTest > testBasicTopicMetadata PASSED
kafka.integration.SaslPlaintextTopicMetadataTest > testAliveBrokersListWithNoTopicsAfterABrokerShutdown PASSED
kafka.integration.PrimitiveApiTest > testMultiProduce PASSED
kafka.integration.PrimitiveApiTest > testDefaultEncoderProducerAndFetch PASSED
kafka.integration.PrimitiveApiTest > testFetchRequestCanProperlySerialize PASSED
kafka.integration.PrimitiveApiTest > testPipelinedProduceRequests PASSED
kafka.integration.PrimitiveApiTest > testProduceAndMultiFetch PASSED
kafka.integration.PrimitiveApiTest > testDefaultEncoderProducerAndFetchWithCompression PASSED
kafka.integration.PrimitiveApiTest > testConsumerEmptyTopic PASSED
kafka.integration.PrimitiveApiTest > testEmptyFetchRequest PASSED
kafka.integration.PlaintextTopicMetadataTest > testIsrAfterBrokerShutDownAndJoinsBack PASSED
kafka.integration.PlaintextTopicMetadataTest > testAutoCreateTopicWithCollision PASSED
kafka.integration.PlaintextTopicMetadataTest > testAliveBrokerListWithNoTopics PASSED
kafka.integration.PlaintextTopicMetadataTest > testAutoCreateTopic PASSED
kafka.integration.PlaintextTopicMetadataTest > testGetAllTopicMetadata PASSED
kafka.integration.PlaintextTopicMetadataTest > testAliveBrokersListWithNoTopicsAfterNewBrokerStartup PASSED
kafka.integration.PlaintextTopicMetadataTest > testBasicTopicMetadata PASSED
kafka.integration.PlaintextTopicMetadataTest > testAliveBrokersListWithNoTopicsAfterABrokerShutdown PASSED
kafka.integration.AutoOffsetResetTest > testResetToLatestWhenOffsetTooLow PASSED
kafka.integration.AutoOffsetResetTest > testResetToEarliestWhenOffsetTooLow PASSED
kafka.integration.AutoOffsetResetTest > testResetToEarliestWhenOffsetTooHigh PASSED
kafka.integration.AutoOffsetResetTest > testResetToLatestWhenOffsetTooHigh PASSED
kafka.integration.RollingBounceTest > testRollingBounce PASSED
kafka.integration.SslTopicMetadataTest > testIsrAfterBrokerShutDownAndJoinsBack PASSED
kafka.integration.SslTopicMetadataTest > testAutoCreateTopicWithCollision PASSED
kafka.integration.SslTopicMetadataTest > testAliveBrokerListWithNoTopics PASSED
kafka.integration.SslTopicMetadataTest > testAutoCreateTopic PASSED
kafka.integration.SslTopicMetadataTest > testGetAllTopicMetadata PASSED
kafka.integration.SslTopicMetadataTest > testAliveBrokersListWithNoTopicsAfterNewBrokerStartup PASSED
kafka.integration.SslTopicMetadataTest > testBasicTopicMetadata PASSED
kafka.integration.SslTopicMetadataTest > testAliveBrokersListWithNoTopicsAfterABrokerShutdown PASSED
kafka.integration.SaslSslTopicMetadataTest > testIsrAfterBrokerShutDownAndJoinsBack PASSED
kafka.integration.SaslSslTopicMetadataTest > testAutoCreateTopicWithCollision PASSED
kafka.integration.SaslSslTopicMetadataTest > testAliveBrokerListWithNoTopics PASSED
kafka.integration.SaslSslTopicMetadataTest > testAutoCreateTopic PASSED
kafka.integration.SaslSslTopicMetadataTest > testGetAllTopicMetadata PASSED
kafka.integration.SaslSslTopicMetadataTest > testAliveBrokersListWithNoTopicsAfterNewBrokerStartup PASSED
kafka.integration.SaslSslTopicMetadataTest > testBasicTopicMetadata PASSED
kafka.integration.SaslSslTopicMetadataTest > testAliveBrokersListWithNoTopicsAfterABrokerShutdown PASSED
kafka.integration.FetcherTest > testFetcher PASSED
kafka.integration.UncleanLeaderElectionTest > testUncleanLeaderElectionEnabled PASSED
kafka.integration.UncleanLeaderElectionTest > testCleanLeaderElectionDisabledByTopicOverride PASSED
kafka.integration.UncleanLeaderElectionTest > testUncleanLeaderElectionDisabled PASSED
kafka.integration.UncleanLeaderElectionTest > testUncleanLeaderElectionInvalidTopicOverride PASSED
kafka.integration.UncleanLeaderElectionTest > testUncleanLeaderElectionEnabledByTopicOverride PASSED
kafka.integration.MinIsrConfigTest > testDefaultKafkaConfig PASSED
722 tests completed, 1 failed
:kafka-trunk-jdk7:core:test FAILED
:test_core_2_10 FAILED
FAILURE: Build failed with an exception.
* What went wrong:
Execution failed for task ':core:test'.
> There were failing tests. See the report at: file://<https://builds.apache.org/job/kafka-trunk-jdk7/ws/core/build/reports/tests/index.html>
* Try:
Run with --stacktrace option to get the stack trace. Run with --info or --debug option to get more log output.
BUILD FAILED
Total time: 36 mins 50.621 secs
Build step 'Execute shell' marked build as failure
Recording test results
Setting GRADLE_2_4_RC_2_HOME=/home/jenkins/jenkins-slave/tools/hudson.plugins.gradle.GradleInstallation/Gradle_2.4-rc-2
Setting JDK_1_7U51_HOME=/home/jenkins/jenkins-slave/tools/hudson.model.JDK/jdk-1.7u51
Setting GRADLE_2_4_RC_2_HOME=/home/jenkins/jenkins-slave/tools/hudson.plugins.gradle.GradleInstallation/Gradle_2.4-rc-2
Setting JDK_1_7U51_HOME=/home/jenkins/jenkins-slave/tools/hudson.model.JDK/jdk-1.7u51
Build failed in Jenkins: kafka-trunk-jdk7 #1162
Posted by Apache Jenkins Server <je...@builds.apache.org>.
See <https://builds.apache.org/job/kafka-trunk-jdk7/1162/changes>
Changes:
[cshapi] KAFKA-3451: Add basic HTML coverage report generation to gradle
------------------------------------------
[...truncated 1600 lines...]
kafka.log.LogTest > testTruncateTo PASSED
kafka.log.LogTest > testCleanShutdownFile PASSED
kafka.log.OffsetIndexTest > lookupExtremeCases PASSED
kafka.log.OffsetIndexTest > appendTooMany PASSED
kafka.log.OffsetIndexTest > randomLookupTest PASSED
kafka.log.OffsetIndexTest > testReopen PASSED
kafka.log.OffsetIndexTest > appendOutOfOrder PASSED
kafka.log.OffsetIndexTest > truncate PASSED
kafka.log.LogSegmentTest > testRecoveryWithCorruptMessage PASSED
kafka.log.LogSegmentTest > testRecoveryFixesCorruptIndex PASSED
kafka.log.LogSegmentTest > testReadFromGap PASSED
kafka.log.LogSegmentTest > testTruncate PASSED
kafka.log.LogSegmentTest > testReadBeforeFirstOffset PASSED
kafka.log.LogSegmentTest > testCreateWithInitFileSizeAppendMessage PASSED
kafka.log.LogSegmentTest > testChangeFileSuffixes PASSED
kafka.log.LogSegmentTest > testMaxOffset PASSED
kafka.log.LogSegmentTest > testNextOffsetCalculation PASSED
kafka.log.LogSegmentTest > testReadOnEmptySegment PASSED
kafka.log.LogSegmentTest > testReadAfterLast PASSED
kafka.log.LogSegmentTest > testCreateWithInitFileSizeClearShutdown PASSED
kafka.log.LogSegmentTest > testTruncateFull PASSED
kafka.log.CleanerTest > testBuildOffsetMap PASSED
kafka.log.CleanerTest > testSegmentGrouping PASSED
kafka.log.CleanerTest > testCleanSegmentsWithAbort PASSED
kafka.log.CleanerTest > testSegmentGroupingWithSparseOffsets PASSED
kafka.log.CleanerTest > testRecoveryAfterCrash PASSED
kafka.log.CleanerTest > testLogToClean PASSED
kafka.log.CleanerTest > testCleaningWithDeletes PASSED
kafka.log.CleanerTest > testCleanSegments PASSED
kafka.log.CleanerTest > testCleaningWithUnkeyedMessages PASSED
kafka.log.OffsetMapTest > testClear PASSED
kafka.log.OffsetMapTest > testBasicValidation PASSED
kafka.coordinator.GroupCoordinatorResponseTest > testHeartbeatWrongCoordinator PASSED
kafka.coordinator.GroupCoordinatorResponseTest > testDescribeGroupStable PASSED
kafka.coordinator.GroupCoordinatorResponseTest > testHeartbeatIllegalGeneration PASSED
kafka.coordinator.GroupCoordinatorResponseTest > testDescribeGroupWrongCoordinator PASSED
kafka.coordinator.GroupCoordinatorResponseTest > testDescribeGroupRebalancing PASSED
kafka.coordinator.GroupCoordinatorResponseTest > testLeaderFailureInSyncGroup PASSED
kafka.coordinator.GroupCoordinatorResponseTest > testGenerationIdIncrementsOnRebalance PASSED
kafka.coordinator.GroupCoordinatorResponseTest > testSyncGroupFromIllegalGeneration PASSED
kafka.coordinator.GroupCoordinatorResponseTest > testInvalidGroupId PASSED
kafka.coordinator.GroupCoordinatorResponseTest > testHeartbeatUnknownGroup PASSED
kafka.coordinator.GroupCoordinatorResponseTest > testListGroupsIncludesStableGroups PASSED
kafka.coordinator.GroupCoordinatorResponseTest > testHeartbeatDuringRebalanceCausesRebalanceInProgress PASSED
kafka.coordinator.GroupCoordinatorResponseTest > testJoinGroupInconsistentGroupProtocol PASSED
kafka.coordinator.GroupCoordinatorResponseTest > testJoinGroupSessionTimeoutTooLarge PASSED
kafka.coordinator.GroupCoordinatorResponseTest > testJoinGroupSessionTimeoutTooSmall PASSED
kafka.coordinator.GroupCoordinatorResponseTest > testSyncGroupEmptyAssignment PASSED
kafka.coordinator.GroupCoordinatorResponseTest > testCommitOffsetWithDefaultGeneration PASSED
kafka.coordinator.GroupCoordinatorResponseTest > testJoinGroupFromUnchangedLeaderShouldRebalance PASSED
kafka.coordinator.GroupCoordinatorResponseTest > testHeartbeatRebalanceInProgress PASSED
kafka.coordinator.GroupCoordinatorResponseTest > testLeaveGroupUnknownGroup PASSED
kafka.coordinator.GroupCoordinatorResponseTest > testListGroupsIncludesRebalancingGroups PASSED
kafka.coordinator.GroupCoordinatorResponseTest > testSyncGroupFollowerAfterLeader PASSED
kafka.coordinator.GroupCoordinatorResponseTest > testCommitOffsetInAwaitingSync PASSED
kafka.coordinator.GroupCoordinatorResponseTest > testJoinGroupWrongCoordinator PASSED
kafka.coordinator.GroupCoordinatorResponseTest > testJoinGroupUnknownConsumerExistingGroup PASSED
kafka.coordinator.GroupCoordinatorResponseTest > testSyncGroupFromUnknownGroup PASSED
kafka.coordinator.GroupCoordinatorResponseTest > testJoinGroupInconsistentProtocolType PASSED
kafka.coordinator.GroupCoordinatorResponseTest > testCommitOffsetFromUnknownGroup PASSED
kafka.coordinator.GroupCoordinatorResponseTest > testLeaveGroupWrongCoordinator PASSED
kafka.coordinator.GroupCoordinatorResponseTest > testLeaveGroupUnknownConsumerExistingGroup PASSED
kafka.coordinator.GroupCoordinatorResponseTest > testJoinGroupUnknownConsumerNewGroup PASSED
kafka.coordinator.GroupCoordinatorResponseTest > testJoinGroupFromUnchangedFollowerDoesNotRebalance PASSED
kafka.coordinator.GroupCoordinatorResponseTest > testValidJoinGroup PASSED
kafka.coordinator.GroupCoordinatorResponseTest > testSyncGroupLeaderAfterFollower PASSED
kafka.coordinator.GroupCoordinatorResponseTest > testSyncGroupFromUnknownMember PASSED
kafka.coordinator.GroupCoordinatorResponseTest > testValidLeaveGroup PASSED
kafka.coordinator.GroupCoordinatorResponseTest > testDescribeGroupInactiveGroup PASSED
kafka.coordinator.GroupCoordinatorResponseTest > testSyncGroupNotCoordinator PASSED
kafka.coordinator.GroupCoordinatorResponseTest > testHeartbeatUnknownConsumerExistingGroup PASSED
kafka.coordinator.GroupCoordinatorResponseTest > testValidHeartbeat PASSED
kafka.coordinator.MemberMetadataTest > testMatchesSupportedProtocols PASSED
kafka.coordinator.MemberMetadataTest > testMetadata PASSED
kafka.coordinator.MemberMetadataTest > testMetadataRaisesOnUnsupportedProtocol PASSED
kafka.coordinator.MemberMetadataTest > testVoteForPreferredProtocol PASSED
kafka.coordinator.MemberMetadataTest > testVoteRaisesOnNoSupportedProtocols PASSED
kafka.coordinator.GroupMetadataTest > testDeadToAwaitingSyncIllegalTransition PASSED
kafka.coordinator.GroupMetadataTest > testPreparingRebalanceToStableIllegalTransition PASSED
kafka.coordinator.GroupMetadataTest > testCannotRebalanceWhenDead PASSED
kafka.coordinator.GroupMetadataTest > testSelectProtocol PASSED
kafka.coordinator.GroupMetadataTest > testCannotRebalanceWhenPreparingRebalance PASSED
kafka.coordinator.GroupMetadataTest > testDeadToPreparingRebalanceIllegalTransition PASSED
kafka.coordinator.GroupMetadataTest > testCanRebalanceWhenAwaitingSync PASSED
kafka.coordinator.GroupMetadataTest > testAwaitingSyncToPreparingRebalanceTransition PASSED
kafka.coordinator.GroupMetadataTest > testStableToAwaitingSyncIllegalTransition PASSED
kafka.coordinator.GroupMetadataTest > testDeadToDeadIllegalTransition PASSED
kafka.coordinator.GroupMetadataTest > testSelectProtocolRaisesIfNoMembers PASSED
kafka.coordinator.GroupMetadataTest > testStableToPreparingRebalanceTransition PASSED
kafka.coordinator.GroupMetadataTest > testPreparingRebalanceToDeadTransition PASSED
kafka.coordinator.GroupMetadataTest > testStableToStableIllegalTransition PASSED
kafka.coordinator.GroupMetadataTest > testAwaitingSyncToStableTransition PASSED
kafka.coordinator.GroupMetadataTest > testDeadToStableIllegalTransition PASSED
kafka.coordinator.GroupMetadataTest > testAwaitingSyncToAwaitingSyncIllegalTransition PASSED
kafka.coordinator.GroupMetadataTest > testSupportsProtocols PASSED
kafka.coordinator.GroupMetadataTest > testCanRebalanceWhenStable PASSED
kafka.coordinator.GroupMetadataTest > testPreparingRebalanceToPreparingRebalanceIllegalTransition PASSED
kafka.coordinator.GroupMetadataTest > testSelectProtocolChoosesCompatibleProtocol PASSED
kafka.javaapi.message.ByteBufferMessageSetTest > testSizeInBytesWithCompression PASSED
kafka.javaapi.message.ByteBufferMessageSetTest > testIteratorIsConsistentWithCompression PASSED
kafka.javaapi.message.ByteBufferMessageSetTest > testIteratorIsConsistent PASSED
kafka.javaapi.message.ByteBufferMessageSetTest > testEqualsWithCompression PASSED
kafka.javaapi.message.ByteBufferMessageSetTest > testWrittenEqualsRead PASSED
kafka.javaapi.message.ByteBufferMessageSetTest > testEquals PASSED
kafka.javaapi.message.ByteBufferMessageSetTest > testSizeInBytes PASSED
kafka.javaapi.consumer.ZookeeperConsumerConnectorTest > testBasic PASSED
kafka.KafkaTest > testGetKafkaConfigFromArgsWrongSetValue PASSED
kafka.KafkaTest > testKafkaSslPasswords PASSED
kafka.KafkaTest > testGetKafkaConfigFromArgs PASSED
kafka.KafkaTest > testGetKafkaConfigFromArgsNonArgsAtTheEnd PASSED
kafka.KafkaTest > testGetKafkaConfigFromArgsNonArgsOnly PASSED
kafka.KafkaTest > testGetKafkaConfigFromArgsNonArgsAtTheBegging PASSED
kafka.controller.ControllerFailoverTest > testMetadataUpdate PASSED
722 tests completed, 2 failed
:kafka-trunk-jdk7:core:test FAILED
:test_core_2_10 FAILED
FAILURE: Build failed with an exception.
* What went wrong:
Execution failed for task ':core:test'.
> There were failing tests. See the report at: file://<https://builds.apache.org/job/kafka-trunk-jdk7/ws/core/build/reports/tests/index.html>
* Try:
Run with --stacktrace option to get the stack trace. Run with --info or --debug option to get more log output.
BUILD FAILED
Total time: 1 hrs 16 mins 43.663 secs
Build step 'Execute shell' marked build as failure
Recording test results
Setting GRADLE_2_4_RC_2_HOME=/home/jenkins/jenkins-slave/tools/hudson.plugins.gradle.GradleInstallation/Gradle_2.4-rc-2
Setting JDK_1_7U51_HOME=/home/jenkins/jenkins-slave/tools/hudson.model.JDK/jdk-1.7u51
Setting GRADLE_2_4_RC_2_HOME=/home/jenkins/jenkins-slave/tools/hudson.plugins.gradle.GradleInstallation/Gradle_2.4-rc-2
Setting JDK_1_7U51_HOME=/home/jenkins/jenkins-slave/tools/hudson.model.JDK/jdk-1.7u51