You are viewing a plain text version of this content. The canonical link for it is here.
Posted to builds@beam.apache.org by Apache Jenkins Server <je...@builds.apache.org> on 2020/08/16 18:59:35 UTC
Build failed in Jenkins: beam_PostCommit_Python2 #2799
See <https://ci-beam.apache.org/job/beam_PostCommit_Python2/2799/display/redirect>
Changes:
------------------------------------------
[...truncated 17.65 MB...]
self.input_topic.name)
File "<https://ci-beam.apache.org/job/beam_PostCommit_Python2/ws/src/build/gradleenv/-194514014/local/lib/python2.7/site-packages/google/cloud/pubsub_v1/_gapic.py",> line 40, in <lambda>
fx = lambda self, *a, **kw: wrapped_fx(self.api, *a, **kw) # noqa
File "<https://ci-beam.apache.org/job/beam_PostCommit_Python2/ws/src/build/gradleenv/-194514014/local/lib/python2.7/site-packages/google/cloud/pubsub_v1/gapic/subscriber_client.py",> line 439, in create_subscription
request, retry=retry, timeout=timeout, metadata=metadata
File "<https://ci-beam.apache.org/job/beam_PostCommit_Python2/ws/src/build/gradleenv/-194514014/local/lib/python2.7/site-packages/google/api_core/gapic_v1/method.py",> line 145, in __call__
return wrapped_func(*args, **kwargs)
File "<https://ci-beam.apache.org/job/beam_PostCommit_Python2/ws/src/build/gradleenv/-194514014/local/lib/python2.7/site-packages/google/api_core/retry.py",> line 286, in retry_wrapped_func
on_error=on_error,
File "<https://ci-beam.apache.org/job/beam_PostCommit_Python2/ws/src/build/gradleenv/-194514014/local/lib/python2.7/site-packages/google/api_core/retry.py",> line 184, in retry_target
return target()
File "<https://ci-beam.apache.org/job/beam_PostCommit_Python2/ws/src/build/gradleenv/-194514014/local/lib/python2.7/site-packages/google/api_core/timeout.py",> line 214, in func_with_timeout
return func(*args, **kwargs)
File "<https://ci-beam.apache.org/job/beam_PostCommit_Python2/ws/src/build/gradleenv/-194514014/local/lib/python2.7/site-packages/google/api_core/grpc_helpers.py",> line 59, in error_remapped_callable
six.raise_from(exceptions.from_grpc_error(exc), exc)
File "<https://ci-beam.apache.org/job/beam_PostCommit_Python2/ws/src/build/gradleenv/-194514014/local/lib/python2.7/site-packages/six.py",> line 738, in raise_from
raise value
ResourceExhausted: 429 Your project has exceeded a limit: (type="subscriptions-per-project", current=10000, maximum=10000).
-------------------- >> begin captured logging << --------------------
google.auth._default: DEBUG: Checking None for explicit credentials as part of auth process...
google.auth._default: DEBUG: Checking Cloud SDK credentials as part of auth process...
google.auth._default: DEBUG: Cloud SDK credentials not found on disk; not using them
google.auth._default: DEBUG: Checking for App Engine runtime as part of auth process...
google.auth._default: DEBUG: No App Engine library was found so cannot authentication via App Engine Identity Credentials.
google.auth.transport._http_client: DEBUG: Making request: GET http://169.254.169.254
google.auth.transport._http_client: DEBUG: Making request: GET http://metadata.google.internal/computeMetadata/v1/project/project-id
google.auth.transport.requests: DEBUG: Making request: GET http://metadata.google.internal/computeMetadata/v1/instance/service-accounts/default/?recursive=true
urllib3.connectionpool: DEBUG: Starting new HTTP connection (1): metadata.google.internal:80
urllib3.connectionpool: DEBUG: http://metadata.google.internal:80 "GET /computeMetadata/v1/instance/service-accounts/default/?recursive=true HTTP/1.1" 200 144
google.auth.transport.requests: DEBUG: Making request: GET http://metadata.google.internal/computeMetadata/v1/instance/service-accounts/844138762903-compute@developer.gserviceaccount.com/token
urllib3.connectionpool: DEBUG: http://metadata.google.internal:80 "GET /computeMetadata/v1/instance/service-accounts/844138762903-compute@developer.gserviceaccount.com/token HTTP/1.1" 200 221
google.auth._default: DEBUG: Checking None for explicit credentials as part of auth process...
google.auth._default: DEBUG: Checking Cloud SDK credentials as part of auth process...
google.auth._default: DEBUG: Cloud SDK credentials not found on disk; not using them
google.auth._default: DEBUG: Checking for App Engine runtime as part of auth process...
google.auth._default: DEBUG: No App Engine library was found so cannot authentication via App Engine Identity Credentials.
google.auth.transport._http_client: DEBUG: Making request: GET http://169.254.169.254
google.auth.transport._http_client: DEBUG: Making request: GET http://metadata.google.internal/computeMetadata/v1/project/project-id
google.auth.transport.requests: DEBUG: Making request: GET http://metadata.google.internal/computeMetadata/v1/instance/service-accounts/default/?recursive=true
urllib3.connectionpool: DEBUG: Starting new HTTP connection (1): metadata.google.internal:80
urllib3.connectionpool: DEBUG: http://metadata.google.internal:80 "GET /computeMetadata/v1/instance/service-accounts/default/?recursive=true HTTP/1.1" 200 144
google.auth.transport.requests: DEBUG: Making request: GET http://metadata.google.internal/computeMetadata/v1/instance/service-accounts/844138762903-compute@developer.gserviceaccount.com/token
urllib3.connectionpool: DEBUG: http://metadata.google.internal:80 "GET /computeMetadata/v1/instance/service-accounts/844138762903-compute@developer.gserviceaccount.com/token HTTP/1.1" 200 221
--------------------- >> end captured logging << ---------------------
======================================================================
ERROR: test_streaming_with_attributes (apache_beam.io.gcp.pubsub_integration_test.PubSubIntegrationTest)
----------------------------------------------------------------------
Traceback (most recent call last):
File "<https://ci-beam.apache.org/job/beam_PostCommit_Python2/ws/src/sdks/python/apache_beam/io/gcp/pubsub_integration_test.py",> line 151, in setUp
self.input_topic.name)
File "<https://ci-beam.apache.org/job/beam_PostCommit_Python2/ws/src/build/gradleenv/-194514014/local/lib/python2.7/site-packages/google/cloud/pubsub_v1/_gapic.py",> line 40, in <lambda>
fx = lambda self, *a, **kw: wrapped_fx(self.api, *a, **kw) # noqa
File "<https://ci-beam.apache.org/job/beam_PostCommit_Python2/ws/src/build/gradleenv/-194514014/local/lib/python2.7/site-packages/google/cloud/pubsub_v1/gapic/subscriber_client.py",> line 439, in create_subscription
request, retry=retry, timeout=timeout, metadata=metadata
File "<https://ci-beam.apache.org/job/beam_PostCommit_Python2/ws/src/build/gradleenv/-194514014/local/lib/python2.7/site-packages/google/api_core/gapic_v1/method.py",> line 145, in __call__
return wrapped_func(*args, **kwargs)
File "<https://ci-beam.apache.org/job/beam_PostCommit_Python2/ws/src/build/gradleenv/-194514014/local/lib/python2.7/site-packages/google/api_core/retry.py",> line 286, in retry_wrapped_func
on_error=on_error,
File "<https://ci-beam.apache.org/job/beam_PostCommit_Python2/ws/src/build/gradleenv/-194514014/local/lib/python2.7/site-packages/google/api_core/retry.py",> line 184, in retry_target
return target()
File "<https://ci-beam.apache.org/job/beam_PostCommit_Python2/ws/src/build/gradleenv/-194514014/local/lib/python2.7/site-packages/google/api_core/timeout.py",> line 214, in func_with_timeout
return func(*args, **kwargs)
File "<https://ci-beam.apache.org/job/beam_PostCommit_Python2/ws/src/build/gradleenv/-194514014/local/lib/python2.7/site-packages/google/api_core/grpc_helpers.py",> line 59, in error_remapped_callable
six.raise_from(exceptions.from_grpc_error(exc), exc)
File "<https://ci-beam.apache.org/job/beam_PostCommit_Python2/ws/src/build/gradleenv/-194514014/local/lib/python2.7/site-packages/six.py",> line 738, in raise_from
raise value
ResourceExhausted: 429 Your project has exceeded a limit: (type="subscriptions-per-project", current=10000, maximum=10000).
-------------------- >> begin captured logging << --------------------
google.auth._default: DEBUG: Checking None for explicit credentials as part of auth process...
google.auth._default: DEBUG: Checking Cloud SDK credentials as part of auth process...
google.auth._default: DEBUG: Cloud SDK credentials not found on disk; not using them
google.auth._default: DEBUG: Checking for App Engine runtime as part of auth process...
google.auth._default: DEBUG: No App Engine library was found so cannot authentication via App Engine Identity Credentials.
google.auth.transport._http_client: DEBUG: Making request: GET http://169.254.169.254
google.auth.transport._http_client: DEBUG: Making request: GET http://metadata.google.internal/computeMetadata/v1/project/project-id
google.auth.transport.requests: DEBUG: Making request: GET http://metadata.google.internal/computeMetadata/v1/instance/service-accounts/default/?recursive=true
urllib3.connectionpool: DEBUG: Starting new HTTP connection (1): metadata.google.internal:80
urllib3.connectionpool: DEBUG: http://metadata.google.internal:80 "GET /computeMetadata/v1/instance/service-accounts/default/?recursive=true HTTP/1.1" 200 144
google.auth.transport.requests: DEBUG: Making request: GET http://metadata.google.internal/computeMetadata/v1/instance/service-accounts/844138762903-compute@developer.gserviceaccount.com/token
urllib3.connectionpool: DEBUG: http://metadata.google.internal:80 "GET /computeMetadata/v1/instance/service-accounts/844138762903-compute@developer.gserviceaccount.com/token HTTP/1.1" 200 221
google.auth._default: DEBUG: Checking None for explicit credentials as part of auth process...
google.auth._default: DEBUG: Checking Cloud SDK credentials as part of auth process...
google.auth._default: DEBUG: Cloud SDK credentials not found on disk; not using them
google.auth._default: DEBUG: Checking for App Engine runtime as part of auth process...
google.auth._default: DEBUG: No App Engine library was found so cannot authentication via App Engine Identity Credentials.
google.auth.transport._http_client: DEBUG: Making request: GET http://169.254.169.254
google.auth.transport._http_client: DEBUG: Making request: GET http://metadata.google.internal/computeMetadata/v1/project/project-id
google.auth.transport.requests: DEBUG: Making request: GET http://metadata.google.internal/computeMetadata/v1/instance/service-accounts/default/?recursive=true
urllib3.connectionpool: DEBUG: Starting new HTTP connection (1): metadata.google.internal:80
urllib3.connectionpool: DEBUG: http://metadata.google.internal:80 "GET /computeMetadata/v1/instance/service-accounts/default/?recursive=true HTTP/1.1" 200 144
google.auth.transport.requests: DEBUG: Making request: GET http://metadata.google.internal/computeMetadata/v1/instance/service-accounts/844138762903-compute@developer.gserviceaccount.com/token
urllib3.connectionpool: DEBUG: http://metadata.google.internal:80 "GET /computeMetadata/v1/instance/service-accounts/844138762903-compute@developer.gserviceaccount.com/token HTTP/1.1" 200 221
--------------------- >> end captured logging << ---------------------
======================================================================
ERROR: Runs streaming Dataflow job and verifies that user metrics are reported
----------------------------------------------------------------------
Traceback (most recent call last):
File "<https://ci-beam.apache.org/job/beam_PostCommit_Python2/ws/src/sdks/python/apache_beam/runners/dataflow/dataflow_exercise_streaming_metrics_pipeline_test.py",> line 76, in setUp
self.input_topic.name)
File "<https://ci-beam.apache.org/job/beam_PostCommit_Python2/ws/src/build/gradleenv/-194514014/local/lib/python2.7/site-packages/google/cloud/pubsub_v1/_gapic.py",> line 40, in <lambda>
fx = lambda self, *a, **kw: wrapped_fx(self.api, *a, **kw) # noqa
File "<https://ci-beam.apache.org/job/beam_PostCommit_Python2/ws/src/build/gradleenv/-194514014/local/lib/python2.7/site-packages/google/cloud/pubsub_v1/gapic/subscriber_client.py",> line 439, in create_subscription
request, retry=retry, timeout=timeout, metadata=metadata
File "<https://ci-beam.apache.org/job/beam_PostCommit_Python2/ws/src/build/gradleenv/-194514014/local/lib/python2.7/site-packages/google/api_core/gapic_v1/method.py",> line 145, in __call__
return wrapped_func(*args, **kwargs)
File "<https://ci-beam.apache.org/job/beam_PostCommit_Python2/ws/src/build/gradleenv/-194514014/local/lib/python2.7/site-packages/google/api_core/retry.py",> line 286, in retry_wrapped_func
on_error=on_error,
File "<https://ci-beam.apache.org/job/beam_PostCommit_Python2/ws/src/build/gradleenv/-194514014/local/lib/python2.7/site-packages/google/api_core/retry.py",> line 184, in retry_target
return target()
File "<https://ci-beam.apache.org/job/beam_PostCommit_Python2/ws/src/build/gradleenv/-194514014/local/lib/python2.7/site-packages/google/api_core/timeout.py",> line 214, in func_with_timeout
return func(*args, **kwargs)
File "<https://ci-beam.apache.org/job/beam_PostCommit_Python2/ws/src/build/gradleenv/-194514014/local/lib/python2.7/site-packages/google/api_core/grpc_helpers.py",> line 59, in error_remapped_callable
six.raise_from(exceptions.from_grpc_error(exc), exc)
File "<https://ci-beam.apache.org/job/beam_PostCommit_Python2/ws/src/build/gradleenv/-194514014/local/lib/python2.7/site-packages/six.py",> line 738, in raise_from
raise value
ResourceExhausted: 429 Your project has exceeded a limit: (type="subscriptions-per-project", current=10000, maximum=10000).
-------------------- >> begin captured logging << --------------------
google.auth._default: DEBUG: Checking None for explicit credentials as part of auth process...
google.auth._default: DEBUG: Checking Cloud SDK credentials as part of auth process...
google.auth._default: DEBUG: Cloud SDK credentials not found on disk; not using them
google.auth._default: DEBUG: Checking for App Engine runtime as part of auth process...
google.auth._default: DEBUG: No App Engine library was found so cannot authentication via App Engine Identity Credentials.
google.auth.transport._http_client: DEBUG: Making request: GET http://169.254.169.254
google.auth.transport._http_client: DEBUG: Making request: GET http://metadata.google.internal/computeMetadata/v1/project/project-id
google.auth.transport.requests: DEBUG: Making request: GET http://metadata.google.internal/computeMetadata/v1/instance/service-accounts/default/?recursive=true
urllib3.connectionpool: DEBUG: Starting new HTTP connection (1): metadata.google.internal:80
urllib3.connectionpool: DEBUG: http://metadata.google.internal:80 "GET /computeMetadata/v1/instance/service-accounts/default/?recursive=true HTTP/1.1" 200 144
google.auth.transport.requests: DEBUG: Making request: GET http://metadata.google.internal/computeMetadata/v1/instance/service-accounts/844138762903-compute@developer.gserviceaccount.com/token
urllib3.connectionpool: DEBUG: http://metadata.google.internal:80 "GET /computeMetadata/v1/instance/service-accounts/844138762903-compute@developer.gserviceaccount.com/token HTTP/1.1" 200 221
google.auth._default: DEBUG: Checking None for explicit credentials as part of auth process...
google.auth._default: DEBUG: Checking Cloud SDK credentials as part of auth process...
google.auth._default: DEBUG: Cloud SDK credentials not found on disk; not using them
google.auth._default: DEBUG: Checking for App Engine runtime as part of auth process...
google.auth._default: DEBUG: No App Engine library was found so cannot authentication via App Engine Identity Credentials.
google.auth.transport._http_client: DEBUG: Making request: GET http://169.254.169.254
google.auth.transport._http_client: DEBUG: Making request: GET http://metadata.google.internal/computeMetadata/v1/project/project-id
google.auth.transport.requests: DEBUG: Making request: GET http://metadata.google.internal/computeMetadata/v1/instance/service-accounts/default/?recursive=true
urllib3.connectionpool: DEBUG: Starting new HTTP connection (1): metadata.google.internal:80
urllib3.connectionpool: DEBUG: http://metadata.google.internal:80 "GET /computeMetadata/v1/instance/service-accounts/default/?recursive=true HTTP/1.1" 200 144
google.auth.transport.requests: DEBUG: Making request: GET http://metadata.google.internal/computeMetadata/v1/instance/service-accounts/844138762903-compute@developer.gserviceaccount.com/token
urllib3.connectionpool: DEBUG: http://metadata.google.internal:80 "GET /computeMetadata/v1/instance/service-accounts/844138762903-compute@developer.gserviceaccount.com/token HTTP/1.1" 200 221
--------------------- >> end captured logging << ---------------------
----------------------------------------------------------------------
XML: nosetests-postCommitIT-df-py27.xml
----------------------------------------------------------------------
XML: <https://ci-beam.apache.org/job/beam_PostCommit_Python2/ws/src/sdks/python/nosetests.xml>
----------------------------------------------------------------------
Ran 66 tests in 3406.302s
FAILED (SKIP=6, errors=9)
Worker logs: https://console.cloud.google.com/dataflow/jobs/us-central1/2020-08-16_11_03_05-11697898104060591056?project=apache-beam-testing
Worker logs: https://console.cloud.google.com/dataflow/jobs/us-central1/2020-08-16_11_10_46-308280349107495043?project=apache-beam-testing
Worker logs: https://console.cloud.google.com/dataflow/jobs/us-central1/2020-08-16_11_17_20-4912212448349084211?project=apache-beam-testing
Worker logs: https://console.cloud.google.com/dataflow/jobs/us-central1/2020-08-16_11_24_27-17219317458894829346?project=apache-beam-testing
Worker logs: https://console.cloud.google.com/dataflow/jobs/us-central1/2020-08-16_11_31_41-6807177291639649008?project=apache-beam-testing
Worker logs: https://console.cloud.google.com/dataflow/jobs/us-central1/2020-08-16_11_39_23-16074503291658893200?project=apache-beam-testing
Worker logs: https://console.cloud.google.com/dataflow/jobs/us-central1/2020-08-16_11_46_37-14143892546495778188?project=apache-beam-testing
Worker logs: https://console.cloud.google.com/dataflow/jobs/us-central1/2020-08-16_11_03_07-2830525132657452277?project=apache-beam-testing
Worker logs: https://console.cloud.google.com/dataflow/jobs/us-central1/2020-08-16_11_10_58-304969378352214547?project=apache-beam-testing
Worker logs: https://console.cloud.google.com/dataflow/jobs/us-central1/2020-08-16_11_18_30-10477691637857927976?project=apache-beam-testing
Worker logs: https://console.cloud.google.com/dataflow/jobs/us-central1/2020-08-16_11_26_09-232484707402191046?project=apache-beam-testing
Worker logs: https://console.cloud.google.com/dataflow/jobs/us-central1/2020-08-16_11_33_49-15161382861302303238?project=apache-beam-testing
Worker logs: https://console.cloud.google.com/dataflow/jobs/us-central1/2020-08-16_11_40_45-17961972055178824663?project=apache-beam-testing
Worker logs: https://console.cloud.google.com/dataflow/jobs/us-central1/2020-08-16_11_48_26-10623311776896529766?project=apache-beam-testing
Worker logs: https://console.cloud.google.com/dataflow/jobs/us-central1/2020-08-16_11_03_06-16994624558859504431?project=apache-beam-testing
Worker logs: https://console.cloud.google.com/dataflow/jobs/us-central1/2020-08-16_11_10_31-6063294487175986256?project=apache-beam-testing
Worker logs: https://console.cloud.google.com/dataflow/jobs/us-central1/2020-08-16_11_17_01-7434651724514569764?project=apache-beam-testing
Worker logs: https://console.cloud.google.com/dataflow/jobs/us-central1/2020-08-16_11_24_46-11305443138742185895?project=apache-beam-testing
Worker logs: https://console.cloud.google.com/dataflow/jobs/us-central1/2020-08-16_11_32_15-2989591918105031683?project=apache-beam-testing
Worker logs: https://console.cloud.google.com/dataflow/jobs/us-central1/2020-08-16_11_39_05-4083777646772685857?project=apache-beam-testing
Worker logs: https://console.cloud.google.com/dataflow/jobs/us-central1/2020-08-16_11_46_20-14377648726248287223?project=apache-beam-testing
Worker logs: https://console.cloud.google.com/dataflow/jobs/us-central1/2020-08-16_11_03_05-22245176758857071?project=apache-beam-testing
Worker logs: https://console.cloud.google.com/dataflow/jobs/us-central1/2020-08-16_11_12_26-16444931049674432222?project=apache-beam-testing
Worker logs: https://console.cloud.google.com/dataflow/jobs/us-central1/2020-08-16_11_21_53-5077702494753649505?project=apache-beam-testing
Worker logs: https://console.cloud.google.com/dataflow/jobs/us-central1/2020-08-16_11_29_22-5901660787040989750?project=apache-beam-testing
Worker logs: https://console.cloud.google.com/dataflow/jobs/us-central1/2020-08-16_11_36_16-346687088706401939?project=apache-beam-testing
Worker logs: https://console.cloud.google.com/dataflow/jobs/us-central1/2020-08-16_11_43_00-15455491775166513830?project=apache-beam-testing
Worker logs: https://console.cloud.google.com/dataflow/jobs/us-central1/2020-08-16_11_03_07-17122089144809515280?project=apache-beam-testing
Worker logs: https://console.cloud.google.com/dataflow/jobs/us-central1/2020-08-16_11_25_10-11605086780041357542?project=apache-beam-testing
Worker logs: https://console.cloud.google.com/dataflow/jobs/us-central1/2020-08-16_11_32_32-9530663077088253481?project=apache-beam-testing
Worker logs: https://console.cloud.google.com/dataflow/jobs/us-central1/2020-08-16_11_39_38-6123269572243014283?project=apache-beam-testing
Worker logs: https://console.cloud.google.com/dataflow/jobs/us-central1/2020-08-16_11_03_05-1044595307388477722?project=apache-beam-testing
Worker logs: https://console.cloud.google.com/dataflow/jobs/us-central1/2020-08-16_11_10_51-12797919652918921405?project=apache-beam-testing
Worker logs: https://console.cloud.google.com/dataflow/jobs/us-central1/2020-08-16_11_17_34-1327971276094378517?project=apache-beam-testing
Worker logs: https://console.cloud.google.com/dataflow/jobs/us-central1/2020-08-16_11_24_24-18361285381776350697?project=apache-beam-testing
Worker logs: https://console.cloud.google.com/dataflow/jobs/us-central1/2020-08-16_11_31_12-3159953895392442644?project=apache-beam-testing
Worker logs: https://console.cloud.google.com/dataflow/jobs/us-central1/2020-08-16_11_38_44-7851398177761289389?project=apache-beam-testing
Worker logs: https://console.cloud.google.com/dataflow/jobs/us-central1/2020-08-16_11_45_44-8037739891377744620?project=apache-beam-testing
Worker logs: https://console.cloud.google.com/dataflow/jobs/us-central1/2020-08-16_11_52_33-15156478654456843872?project=apache-beam-testing
Worker logs: https://console.cloud.google.com/dataflow/jobs/us-central1/2020-08-16_11_03_04-14156333071320903263?project=apache-beam-testing
Worker logs: https://console.cloud.google.com/dataflow/jobs/us-central1/2020-08-16_11_22_01-4217308497554847005?project=apache-beam-testing
Worker logs: https://console.cloud.google.com/dataflow/jobs/us-central1/2020-08-16_11_28_55-15125006312409532692?project=apache-beam-testing
Worker logs: https://console.cloud.google.com/dataflow/jobs/us-central1/2020-08-16_11_35_57-12480360836667917001?project=apache-beam-testing
Worker logs: https://console.cloud.google.com/dataflow/jobs/us-central1/2020-08-16_11_43_06-17350626172625360749?project=apache-beam-testing
Worker logs: https://console.cloud.google.com/dataflow/jobs/us-central1/2020-08-16_11_03_05-5263231447129873896?project=apache-beam-testing
Worker logs: https://console.cloud.google.com/dataflow/jobs/us-central1/2020-08-16_11_11_26-4654501978142213741?project=apache-beam-testing
Worker logs: https://console.cloud.google.com/dataflow/jobs/us-central1/2020-08-16_11_13_46-14053573613140655425?project=apache-beam-testing
Worker logs: https://console.cloud.google.com/dataflow/jobs/us-central1/2020-08-16_11_21_33-14183888487064664406?project=apache-beam-testing
Worker logs: https://console.cloud.google.com/dataflow/jobs/us-central1/2020-08-16_11_28_53-11708455899922268249?project=apache-beam-testing
Worker logs: https://console.cloud.google.com/dataflow/jobs/us-central1/2020-08-16_11_36_14-14386858829045437476?project=apache-beam-testing
Worker logs: https://console.cloud.google.com/dataflow/jobs/us-central1/2020-08-16_11_43_52-595166926762871540?project=apache-beam-testing
> Task :sdks:python:test-suites:dataflow:py2:postCommitIT FAILED
FAILURE: Build completed with 2 failures.
1: Task failed with an exception.
-----------
* Where:
Build file '<https://ci-beam.apache.org/job/beam_PostCommit_Python2/ws/src/sdks/python/test-suites/direct/py2/build.gradle'> line: 50
* What went wrong:
Execution failed for task ':sdks:python:test-suites:direct:py2:directRunnerIT'.
> Process 'command 'sh'' finished with non-zero exit value 1
* Try:
Run with --stacktrace option to get the stack trace. Run with --info or --debug option to get more log output. Run with --scan to get full insights.
==============================================================================
2: Task failed with an exception.
-----------
* Where:
Script '<https://ci-beam.apache.org/job/beam_PostCommit_Python2/ws/src/sdks/python/test-suites/dataflow/common.gradle'> line: 116
* What went wrong:
Execution failed for task ':sdks:python:test-suites:dataflow:py2:postCommitIT'.
> Process 'command 'sh'' finished with non-zero exit value 1
* Try:
Run with --stacktrace option to get the stack trace. Run with --info or --debug option to get more log output. Run with --scan to get full insights.
==============================================================================
* Get more help at https://help.gradle.org
Deprecated Gradle features were used in this build, making it incompatible with Gradle 6.0.
Use '--warning-mode all' to show the individual deprecation warnings.
See https://docs.gradle.org/5.2.1/userguide/command_line_interface.html#sec:command_line_warnings
BUILD FAILED in 58m 57s
159 actionable tasks: 122 executed, 35 from cache, 2 up-to-date
Publishing build scan...
https://gradle.com/s/ueu3bewhivf7a
Build step 'Invoke Gradle script' changed build result to FAILURE
Build step 'Invoke Gradle script' marked build as failure
---------------------------------------------------------------------
To unsubscribe, e-mail: builds-unsubscribe@beam.apache.org
For additional commands, e-mail: builds-help@beam.apache.org
Jenkins build is back to normal : beam_PostCommit_Python2 #2805
Posted by Apache Jenkins Server <je...@builds.apache.org>.
See <https://ci-beam.apache.org/job/beam_PostCommit_Python2/2805/display/redirect?page=changes>
---------------------------------------------------------------------
To unsubscribe, e-mail: builds-unsubscribe@beam.apache.org
For additional commands, e-mail: builds-help@beam.apache.org
Build failed in Jenkins: beam_PostCommit_Python2 #2804
Posted by Apache Jenkins Server <je...@builds.apache.org>.
See <https://ci-beam.apache.org/job/beam_PostCommit_Python2/2804/display/redirect?page=changes>
Changes:
[yoshiki.obata] [BEAM-9980] add groovy functions for python versions
[yoshiki.obata] [BEAM-9980] update dataflow test-suites to switch python versions using
[yoshiki.obata] [BEAM-9980] version switchable dataflow tasks to be invoked
[yoshiki.obata] [BEAM-9980] :sdks:python:test-suites:dataflow included in
[Luke Cwik] [BEAM-10670] Make key coder deterministic by using upstream PCollection
[Udi Meiri] [BEAM-10697] Remove testPy2Cython from precommit
[noreply] [BEAM-9891] Generate query execution summary table after finishing jobs
------------------------------------------
[...truncated 21.95 MB...]
"component_encodings": [],
"pipeline_proto_coder_id": "ref_Coder_FastPrimitivesCoder_3"
}
],
"is_pair_like": true,
"pipeline_proto_coder_id": "ref_Coder_FastPrimitivesCoder_3"
},
{
"@type": "kind:global_window"
}
],
"is_wrapper": true
},
"output_name": "None",
"user_name": "WriteToSpanner/make batches/ParDo(_BatchFn).out"
}
],
"parallel_input": {
"@type": "OutputReference",
"output_name": "None",
"step_name": "s3"
},
"serialized_fn": "<string of 692 bytes>",
"user_name": "WriteToSpanner/make batches/ParDo(_BatchFn)"
}
},
{
"kind": "Flatten",
"name": "s5",
"properties": {
"display_data": [],
"inputs": [
{
"@type": "OutputReference",
"output_name": "None",
"step_name": "s4"
},
{
"@type": "OutputReference",
"output_name": "unbatchable",
"step_name": "s3"
}
],
"output_info": [
{
"encoding": {
"@type": "kind:windowed_value",
"component_encodings": [
{
"@type": "FastPrimitivesCoder$<string of 176 bytes>",
"component_encodings": [
{
"@type": "FastPrimitivesCoder$<string of 176 bytes>",
"component_encodings": [],
"pipeline_proto_coder_id": "ref_Coder_FastPrimitivesCoder_3"
},
{
"@type": "FastPrimitivesCoder$<string of 176 bytes>",
"component_encodings": [],
"pipeline_proto_coder_id": "ref_Coder_FastPrimitivesCoder_3"
}
],
"is_pair_like": true,
"pipeline_proto_coder_id": "ref_Coder_FastPrimitivesCoder_3"
},
{
"@type": "kind:global_window"
}
],
"is_wrapper": true
},
"output_name": "out",
"user_name": "WriteToSpanner/make batches/Merging batchable and unbatchable.out"
}
],
"user_name": "WriteToSpanner/make batches/Merging batchable and unbatchable"
}
},
{
"kind": "ParallelDo",
"name": "s6",
"properties": {
"display_data": [
{
"key": "fn",
"label": "Transform Function",
"namespace": "apache_beam.transforms.core.ParDo",
"shortValue": "_WriteToSpannerDoFn",
"type": "STRING",
"value": "apache_beam.io.gcp.experimental.spannerio._WriteToSpannerDoFn"
}
],
"non_parallel_inputs": {},
"output_info": [
{
"encoding": {
"@type": "kind:windowed_value",
"component_encodings": [
{
"@type": "FastPrimitivesCoder$<string of 176 bytes>",
"component_encodings": [
{
"@type": "FastPrimitivesCoder$<string of 176 bytes>",
"component_encodings": [],
"pipeline_proto_coder_id": "ref_Coder_FastPrimitivesCoder_3"
},
{
"@type": "FastPrimitivesCoder$<string of 176 bytes>",
"component_encodings": [],
"pipeline_proto_coder_id": "ref_Coder_FastPrimitivesCoder_3"
}
],
"is_pair_like": true,
"pipeline_proto_coder_id": "ref_Coder_FastPrimitivesCoder_3"
},
{
"@type": "kind:global_window"
}
],
"is_wrapper": true
},
"output_name": "None",
"user_name": "WriteToSpanner/Writing to spanner.out"
}
],
"parallel_input": {
"@type": "OutputReference",
"output_name": "out",
"step_name": "s5"
},
"serialized_fn": "<string of 1164 bytes>",
"user_name": "WriteToSpanner/Writing to spanner"
}
}
],
"type": "JOB_TYPE_BATCH"
}
apache_beam.runners.dataflow.internal.apiclient: INFO: Create job: <Job
createTime: u'2020-08-18T00:16:17.489041Z'
currentStateTime: u'1970-01-01T00:00:00Z'
id: u'2020-08-17_17_16_16-517618485663123803'
location: u'us-central1'
name: u'beamapp-jenkins-0818001605-156788'
projectId: u'apache-beam-testing'
stageStates: []
startTime: u'2020-08-18T00:16:17.489041Z'
steps: []
tempFiles: []
type: TypeValueValuesEnum(JOB_TYPE_BATCH, 1)>
apache_beam.runners.dataflow.internal.apiclient: INFO: Created job with id: [2020-08-17_17_16_16-517618485663123803]
apache_beam.runners.dataflow.internal.apiclient: INFO: Submitted job: 2020-08-17_17_16_16-517618485663123803
apache_beam.runners.dataflow.internal.apiclient: INFO: To access the Dataflow monitoring console, please navigate to https://console.cloud.google.com/dataflow/jobs/us-central1/2020-08-17_17_16_16-517618485663123803?project=apache-beam-testing
--------------------- >> end captured logging << ---------------------
----------------------------------------------------------------------
XML: nosetests-postCommitIT-df-py27.xml
----------------------------------------------------------------------
XML: <https://ci-beam.apache.org/job/beam_PostCommit_Python2/ws/src/sdks/python/nosetests.xml>
----------------------------------------------------------------------
Ran 66 tests in 3760.595s
FAILED (SKIP=7, failures=3)
Worker logs: https://console.cloud.google.com/dataflow/jobs/us-central1/2020-08-17_17_04_00-8025914096023966219?project=apache-beam-testing
Worker logs: https://console.cloud.google.com/dataflow/jobs/us-central1/2020-08-17_17_23_03-7490295044871207047?project=apache-beam-testing
Worker logs: https://console.cloud.google.com/dataflow/jobs/us-central1/2020-08-17_17_30_53-12502206810845383205?project=apache-beam-testing
Worker logs: https://console.cloud.google.com/dataflow/jobs/us-central1/2020-08-17_17_38_16-4298712266691962719?project=apache-beam-testing
Worker logs: https://console.cloud.google.com/dataflow/jobs/us-central1/2020-08-17_17_45_17-3833975489752948579?project=apache-beam-testing
Worker logs: https://console.cloud.google.com/dataflow/jobs/us-central1/2020-08-17_17_52_32-6528153410662381655?project=apache-beam-testing
Worker logs: https://console.cloud.google.com/dataflow/jobs/us-central1/2020-08-17_17_59_26-4939621127742920276?project=apache-beam-testing
Worker logs: https://console.cloud.google.com/dataflow/jobs/us-central1/2020-08-17_17_04_09-15391123558407900326?project=apache-beam-testing
Worker logs: https://console.cloud.google.com/dataflow/jobs/us-central1/2020-08-17_17_20_05-10590740945899380453?project=apache-beam-testing
Worker logs: https://console.cloud.google.com/dataflow/jobs/us-central1/2020-08-17_17_27_58-13456133999575672079?project=apache-beam-testing
Worker logs: https://console.cloud.google.com/dataflow/jobs/us-central1/2020-08-17_17_35_49-1483390013670490209?project=apache-beam-testing
Worker logs: https://console.cloud.google.com/dataflow/jobs/us-central1/2020-08-17_17_43_39-3872834238430396304?project=apache-beam-testing
Worker logs: https://console.cloud.google.com/dataflow/jobs/us-central1/2020-08-17_17_50_50-10379992499493457567?project=apache-beam-testing
Worker logs: https://console.cloud.google.com/dataflow/jobs/us-central1/2020-08-17_17_58_20-241112371347553736?project=apache-beam-testing
Worker logs: https://console.cloud.google.com/dataflow/jobs/us-central1/2020-08-17_17_04_03-9149704562279425478?project=apache-beam-testing
Worker logs: https://console.cloud.google.com/dataflow/jobs/us-central1/2020-08-17_17_21_52-834718579638828865?project=apache-beam-testing
Worker logs: https://console.cloud.google.com/dataflow/jobs/us-central1/2020-08-17_17_29_31-4701767059870370163?project=apache-beam-testing
Worker logs: https://console.cloud.google.com/dataflow/jobs/us-central1/2020-08-17_17_37_23-8039931715985332973?project=apache-beam-testing
Worker logs: https://console.cloud.google.com/dataflow/jobs/us-central1/2020-08-17_17_53_52-11475148427691649507?project=apache-beam-testing
Worker logs: https://console.cloud.google.com/dataflow/jobs/us-central1/2020-08-17_17_04_04-4018462287031342850?project=apache-beam-testing
Worker logs: https://console.cloud.google.com/dataflow/jobs/us-central1/2020-08-17_17_16_16-517618485663123803?project=apache-beam-testing
Worker logs: https://console.cloud.google.com/dataflow/jobs/us-central1/2020-08-17_17_16_50-14613985887349047042?project=apache-beam-testing
Worker logs: https://console.cloud.google.com/dataflow/jobs/us-central1/2020-08-17_17_24_03-17188472050640226064?project=apache-beam-testing
Worker logs: https://console.cloud.google.com/dataflow/jobs/us-central1/2020-08-17_17_31_05-8181046462361936454?project=apache-beam-testing
Worker logs: https://console.cloud.google.com/dataflow/jobs/us-central1/2020-08-17_17_39_19-8019191538579929640?project=apache-beam-testing
Worker logs: https://console.cloud.google.com/dataflow/jobs/us-central1/2020-08-17_17_47_13-11530367630530011143?project=apache-beam-testing
Worker logs: https://console.cloud.google.com/dataflow/jobs/us-central1/2020-08-17_17_54_08-17442912109619440008?project=apache-beam-testing
Worker logs: https://console.cloud.google.com/dataflow/jobs/us-central1/2020-08-17_17_04_02-174404171146676468?project=apache-beam-testing
Worker logs: https://console.cloud.google.com/dataflow/jobs/us-central1/2020-08-17_17_12_44-12323073676153168290?project=apache-beam-testing
Worker logs: https://console.cloud.google.com/dataflow/jobs/us-central1/2020-08-17_17_13_48-13652672520746368231?project=apache-beam-testing
Worker logs: https://console.cloud.google.com/dataflow/jobs/us-central1/2020-08-17_17_21_01-5513676487063362918?project=apache-beam-testing
Worker logs: https://console.cloud.google.com/dataflow/jobs/us-central1/2020-08-17_17_28_30-4375431209044568625?project=apache-beam-testing
Worker logs: https://console.cloud.google.com/dataflow/jobs/us-central1/2020-08-17_17_36_20-2757830496108295792?project=apache-beam-testing
Worker logs: https://console.cloud.google.com/dataflow/jobs/us-central1/2020-08-17_17_44_28-16091107674421781397?project=apache-beam-testing
Worker logs: https://console.cloud.google.com/dataflow/jobs/us-central1/2020-08-17_17_52_12-5187638734187345829?project=apache-beam-testing
Worker logs: https://console.cloud.google.com/dataflow/jobs/us-central1/2020-08-17_17_04_03-367567343952316410?project=apache-beam-testing
Worker logs: https://console.cloud.google.com/dataflow/jobs/us-central1/2020-08-17_17_12_43-6682171841099894343?project=apache-beam-testing
Worker logs: https://console.cloud.google.com/dataflow/jobs/us-central1/2020-08-17_17_13_41-9388263547523441627?project=apache-beam-testing
Worker logs: https://console.cloud.google.com/dataflow/jobs/us-central1/2020-08-17_17_20_38-15179497363024880155?project=apache-beam-testing
Worker logs: https://console.cloud.google.com/dataflow/jobs/us-central1/2020-08-17_17_28_10-5948369385988483169?project=apache-beam-testing
Worker logs: https://console.cloud.google.com/dataflow/jobs/us-central1/2020-08-17_17_36_02-13729984278835725382?project=apache-beam-testing
Worker logs: https://console.cloud.google.com/dataflow/jobs/us-central1/2020-08-17_17_43_14-10800116077645211417?project=apache-beam-testing
Worker logs: https://console.cloud.google.com/dataflow/jobs/us-central1/2020-08-17_17_50_18-13525649415725503161?project=apache-beam-testing
Worker logs: https://console.cloud.google.com/dataflow/jobs/us-central1/2020-08-17_17_57_19-5709525637371070703?project=apache-beam-testing
Worker logs: https://console.cloud.google.com/dataflow/jobs/us-central1/2020-08-17_17_04_02-9600803561512280911?project=apache-beam-testing
Worker logs: https://console.cloud.google.com/dataflow/jobs/us-central1/2020-08-17_17_12_19-346792733402788309?project=apache-beam-testing
Worker logs: https://console.cloud.google.com/dataflow/jobs/us-central1/2020-08-17_17_20_50-17354054655769407250?project=apache-beam-testing
Worker logs: https://console.cloud.google.com/dataflow/jobs/us-central1/2020-08-17_17_30_03-13222951800027920371?project=apache-beam-testing
Worker logs: https://console.cloud.google.com/dataflow/jobs/us-central1/2020-08-17_17_38_15-7466987549664317518?project=apache-beam-testing
Worker logs: https://console.cloud.google.com/dataflow/jobs/us-central1/2020-08-17_17_45_32-12324953267149103052?project=apache-beam-testing
Worker logs: https://console.cloud.google.com/dataflow/jobs/us-central1/2020-08-17_17_52_56-226260730167158814?project=apache-beam-testing
Worker logs: https://console.cloud.google.com/dataflow/jobs/us-central1/2020-08-17_17_04_03-13541351652734331590?project=apache-beam-testing
Worker logs: https://console.cloud.google.com/dataflow/jobs/us-central1/2020-08-17_17_14_06-7870104310705167821?project=apache-beam-testing
Worker logs: https://console.cloud.google.com/dataflow/jobs/us-central1/2020-08-17_17_24_16-13513064458084948930?project=apache-beam-testing
Worker logs: https://console.cloud.google.com/dataflow/jobs/us-central1/2020-08-17_17_31_44-17142880156598274871?project=apache-beam-testing
Worker logs: https://console.cloud.google.com/dataflow/jobs/us-central1/2020-08-17_17_39_11-18364347486052473453?project=apache-beam-testing
Worker logs: https://console.cloud.google.com/dataflow/jobs/us-central1/2020-08-17_17_45_22-14423175176210167594?project=apache-beam-testing
Worker logs: https://console.cloud.google.com/dataflow/jobs/us-central1/2020-08-17_17_52_14-17410756516636753837?project=apache-beam-testing
> Task :sdks:python:test-suites:dataflow:py2:postCommitIT FAILED
FAILURE: Build failed with an exception.
* Where:
Script '<https://ci-beam.apache.org/job/beam_PostCommit_Python2/ws/src/sdks/python/test-suites/dataflow/common.gradle'> line: 118
* What went wrong:
Execution failed for task ':sdks:python:test-suites:dataflow:py2:postCommitIT'.
> Process 'command 'sh'' finished with non-zero exit value 1
* Try:
Run with --stacktrace option to get the stack trace. Run with --info or --debug option to get more log output. Run with --scan to get full insights.
* Get more help at https://help.gradle.org
Deprecated Gradle features were used in this build, making it incompatible with Gradle 6.0.
Use '--warning-mode all' to show the individual deprecation warnings.
See https://docs.gradle.org/5.2.1/userguide/command_line_interface.html#sec:command_line_warnings
BUILD FAILED in 1h 5m 1s
159 actionable tasks: 127 executed, 30 from cache, 2 up-to-date
Publishing build scan...
https://gradle.com/s/ewp4orwxel3bc
Build step 'Invoke Gradle script' changed build result to FAILURE
Build step 'Invoke Gradle script' marked build as failure
---------------------------------------------------------------------
To unsubscribe, e-mail: builds-unsubscribe@beam.apache.org
For additional commands, e-mail: builds-help@beam.apache.org
Build failed in Jenkins: beam_PostCommit_Python2 #2803
Posted by Apache Jenkins Server <je...@builds.apache.org>.
See <https://ci-beam.apache.org/job/beam_PostCommit_Python2/2803/display/redirect?page=changes>
Changes:
[katarzyna.kucharczyk] [BEAM-10672] Added streaming option to combine test
[katarzyna.kucharczyk] [BEAM-10672] Added experimental dataflow param
[katarzyna.kucharczyk] [BEAM-10672] Spottless Apply
[katarzyna.kucharczyk] [BEAM-10672] Updated streaming commands
[katarzyna.kucharczyk] [BEAM-10672] Fixes after review in combine python load test
[katarzyna.kucharczyk] [BEAM-10672] Changed jobType variable into mode to declare if it is
------------------------------------------
[...truncated 17.70 MB...]
}
],
"parallel_input": {
"@type": "OutputReference",
"output_name": "None",
"step_name": "s39"
},
"user_name": "write/BigQueryBatchFileLoads/WaitForDestinationLoadJobs/_UnpickledSideInput(TriggerLoadJobsWithoutTempTables.out.0)",
"windowing_strategy": "%0A%88%11%22%40%0A%1Dref_Coder_GlobalWindowCoder_1%12%1F%0A%1D%0A%1Bbeam%3Acoder%3Aglobal_window%3Av1%2A%C3%10%0A%25ref_Environment_default_environment_1%12%99%10%12%12beam%3Aenv%3Adocker%3Av1%1A%3B%0A9gcr.io/cloud-dataflow/v1beta3/python%3Abeam-master-20200630%2A%14beam%3Acoder%3Avarint%3Av1%2A%13beam%3Acoder%3Abytes%3Av1%2A%13beam%3Acoder%3Atimer%3Av1%2A%1Bbeam%3Acoder%3Aglobal_window%3Av1%2A%1Dbeam%3Acoder%3Ainterval_window%3Av1%2A%16beam%3Acoder%3Aiterable%3Av1%2A%23beam%3Acoder%3Astate_backed_iterable%3Av1%2A%1Cbeam%3Acoder%3Awindowed_value%3Av1%2A%22beam%3Acoder%3Aparam_windowed_value%3Av1%2A%14beam%3Acoder%3Adouble%3Av1%2A%19beam%3Acoder%3Astring_utf8%3Av1%2A%1Bbeam%3Acoder%3Alength_prefix%3Av1%2A%12beam%3Acoder%3Abool%3Av1%2A%10beam%3Acoder%3Akv%3Av1%2A%11beam%3Acoder%3Arow%3Av1%2A%23beam%3Aprotocol%3Aprogress_reporting%3Av0%2A%1Ebeam%3Aprotocol%3Aworker_status%3Av1%2A%3Abeam%3Aversion%3Asdk_base%3Aapache/beam_python2.7_sdk%3A2.25.0.dev2q%0A%1Abeam%3Aartifact%3Atype%3Afile%3Av1%12%1D%0A%1Bpostcommit_requirements.txt%1A%20beam%3Aartifact%3Arole%3Astaging_to%3Av1%22%12%0A%10requirements.txt2%9B%01%0A%1Abeam%3Aartifact%3Atype%3Afile%3Av1%12%3D%0A%3B/tmp/dataflow-requirements-cache/parameterized-0.7.4.tar.gz%1A%20beam%3Aartifact%3Arole%3Astaging_to%3Av1%22%1C%0A%1Aparameterized-0.7.4.tar.gz2%89%01%0A%1Abeam%3Aartifact%3Atype%3Afile%3Av1%124%0A2/tmp/dataflow-requirements-cache/mock-2.0.0.tar.gz%1A%20beam%3Aartifact%3Arole%3Astaging_to%3Av1%22%13%0A%11mock-2.0.0.tar.gz2%89%01%0A%1Abeam%3Aartifact%3Atype%3Afile%3Av1%124%0A2/tmp/dataflow-requirements-cache/six-1.15.0.tar.gz%1A%20beam%3Aartifact%3Arole%3Astaging_to%3Av1%22%13%0A%11six-1.15.0.tar.gz2%91%01%0A%1Abeam%3Aartifact%3Atype%3Afile%3Av1%128%0A6/tmp/dataflow-requirements-cache/funcsigs-1.0.2.tar.gz%1A%20beam%3Aartifact%3Arole%3Astaging_to%3Av1%22%17%0A%15funcsigs-1.0.2.tar.gz2%87%01%0A%1Abeam%3Aartifact%3Atype%3Afile%3Av1%123%0A1/tmp/dataflow-requirements-cache/pbr-5.4.5.tar.gz%1A%20beam%3Aartifact%3Arole%3Astaging_to%3Av1%22%12%0A%10pbr-5.4.5.tar.gz2%97%01%0A%1Abeam%3Aartifact%3Atype%3Afile%3Av1%12%3B%0A9/tmp/dataflow-requirements-cache/PyHamcrest-1.10.1.tar.gz%1A%20beam%3Aartifact%3Arole%3Astaging_to%3Av1%22%1A%0A%18PyHamcrest-1.10.1.tar.gz2%C3%01%0A%1Abeam%3Aartifact%3Atype%3Afile%3Av1%12h%0Af<https://ci-beam.apache.org/job/beam_PostCommit_Python2/ws/src/sdks/python/build/apache-beam.tar.gz%1A%20beam%3Aartifact%3Arole%3Astaging_to%3Av1%22%19%0A%17dataflow_python_sdk.tar2%9B%02%0A%1Abeam%3Aartifact%3Atype%3Afile%3Av1%12%C3%01%0A%C0%01/home/jenkins/jenkins-slave/workspace/beam_PostCommit_Python2/src/runners/google-cloud-dataflow-java/worker/build/libs/beam-runners-google-cloud-dataflow-java-fn-api-worker-2.25.0-SNAPSHOT.jar%1A%20beam%3Aartifact%3Arole%3Astaging_to%3Av1%22%15%0A%13dataflow-worker.jarjx%0A%22%0A%20beam%3Awindow_fn%3Aglobal_windows%3Av1%10%01%1A%1Dref_Coder_GlobalWindowCoder_1%22%02%3A%00%28%010%018%01H%01Z%25ref_Environment_default_environment_1">
}
},
{
"kind": "ParallelDo",
"name": "s41",
"properties": {
"display_data": [
{
"key": "fn",
"label": "Transform Function",
"namespace": "apache_beam.transforms.core.ParDo",
"shortValue": "WaitForBQJobs",
"type": "STRING",
"value": "apache_beam.io.gcp.bigquery_file_loads.WaitForBQJobs"
}
],
"non_parallel_inputs": {
"python_side_input0-write/BigQueryBatchFileLoads/WaitForDestinationLoadJobs": {
"@type": "OutputReference",
"output_name": "out",
"step_name": "SideInput-s40"
}
},
"output_info": [
{
"encoding": {
"@type": "kind:windowed_value",
"component_encodings": [
{
"@type": "FastPrimitivesCoder$<string of 176 bytes>",
"component_encodings": [
{
"@type": "FastPrimitivesCoder$<string of 176 bytes>",
"component_encodings": [],
"pipeline_proto_coder_id": "ref_Coder_FastPrimitivesCoder_5"
},
{
"@type": "FastPrimitivesCoder$<string of 176 bytes>",
"component_encodings": [],
"pipeline_proto_coder_id": "ref_Coder_FastPrimitivesCoder_5"
}
],
"is_pair_like": true,
"pipeline_proto_coder_id": "ref_Coder_FastPrimitivesCoder_5"
},
{
"@type": "kind:global_window"
}
],
"is_wrapper": true
},
"output_name": "None",
"user_name": "write/BigQueryBatchFileLoads/WaitForDestinationLoadJobs.out"
}
],
"parallel_input": {
"@type": "OutputReference",
"output_name": "out",
"step_name": "s7"
},
"serialized_fn": "<string of 1276 bytes>",
"user_name": "write/BigQueryBatchFileLoads/WaitForDestinationLoadJobs/WaitForDestinationLoadJobs"
}
},
{
"kind": "Flatten",
"name": "s42",
"properties": {
"display_data": [],
"inputs": [
{
"@type": "OutputReference",
"output_name": "None",
"step_name": "s39"
},
{
"@type": "OutputReference",
"output_name": "None",
"step_name": "s25"
}
],
"output_info": [
{
"encoding": {
"@type": "kind:windowed_value",
"component_encodings": [
{
"@type": "FastPrimitivesCoder$<string of 176 bytes>",
"component_encodings": [
{
"@type": "FastPrimitivesCoder$<string of 176 bytes>",
"component_encodings": [],
"pipeline_proto_coder_id": "ref_Coder_FastPrimitivesCoder_5"
},
{
"@type": "FastPrimitivesCoder$<string of 176 bytes>",
"component_encodings": [],
"pipeline_proto_coder_id": "ref_Coder_FastPrimitivesCoder_5"
}
],
"is_pair_like": true,
"pipeline_proto_coder_id": "ref_Coder_FastPrimitivesCoder_5"
},
{
"@type": "kind:global_window"
}
],
"is_wrapper": true
},
"output_name": "out",
"user_name": "write/BigQueryBatchFileLoads/Flatten.out"
}
],
"user_name": "write/BigQueryBatchFileLoads/Flatten"
}
}
],
"type": "JOB_TYPE_BATCH"
}
apache_beam.runners.dataflow.internal.apiclient: INFO: Create job: <Job
createTime: u'2020-08-17T18:12:43.135582Z'
currentStateTime: u'1970-01-01T00:00:00Z'
id: u'2020-08-17_11_12_41-1848200220351934951'
location: u'us-central1'
name: u'beamapp-jenkins-0817181222-603540'
projectId: u'apache-beam-testing'
stageStates: []
startTime: u'2020-08-17T18:12:43.135582Z'
steps: []
tempFiles: []
type: TypeValueValuesEnum(JOB_TYPE_BATCH, 1)>
apache_beam.runners.dataflow.internal.apiclient: INFO: Created job with id: [2020-08-17_11_12_41-1848200220351934951]
apache_beam.runners.dataflow.internal.apiclient: INFO: Submitted job: 2020-08-17_11_12_41-1848200220351934951
apache_beam.runners.dataflow.internal.apiclient: INFO: To access the Dataflow monitoring console, please navigate to https://console.cloud.google.com/dataflow/jobs/us-central1/2020-08-17_11_12_41-1848200220351934951?project=apache-beam-testing
--------------------- >> end captured logging << ---------------------
----------------------------------------------------------------------
XML: nosetests-postCommitIT-df-py27.xml
----------------------------------------------------------------------
XML: <https://ci-beam.apache.org/job/beam_PostCommit_Python2/ws/src/sdks/python/nosetests.xml>
----------------------------------------------------------------------
Ran 66 tests in 3629.477s
FAILED (SKIP=6, errors=8, failures=2)
Worker logs: https://console.cloud.google.com/dataflow/jobs/us-central1/2020-08-17_11_02_55-18413993355233640953?project=apache-beam-testing
Worker logs: https://console.cloud.google.com/dataflow/jobs/us-central1/2020-08-17_11_11_05-11480642182658632086?project=apache-beam-testing
Worker logs: https://console.cloud.google.com/dataflow/jobs/us-central1/2020-08-17_11_18_43-9955899715622125026?project=apache-beam-testing
Worker logs: https://console.cloud.google.com/dataflow/jobs/us-central1/2020-08-17_11_25_54-5371454427160191809?project=apache-beam-testing
Worker logs: https://console.cloud.google.com/dataflow/jobs/us-central1/2020-08-17_11_33_37-7008768565332785525?project=apache-beam-testing
Worker logs: https://console.cloud.google.com/dataflow/jobs/us-central1/2020-08-17_11_41_32-15504124490767837296?project=apache-beam-testing
Worker logs: https://console.cloud.google.com/dataflow/jobs/us-central1/2020-08-17_11_49_29-14957359826757867903?project=apache-beam-testing
Worker logs: https://console.cloud.google.com/dataflow/jobs/us-central1/2020-08-17_11_02_58-1910212163913134689?project=apache-beam-testing
Worker logs: https://console.cloud.google.com/dataflow/jobs/us-central1/2020-08-17_11_11_03-3265943934514871654?project=apache-beam-testing
Worker logs: https://console.cloud.google.com/dataflow/jobs/us-central1/2020-08-17_11_18_28-2281613028900511968?project=apache-beam-testing
Worker logs: https://console.cloud.google.com/dataflow/jobs/us-central1/2020-08-17_11_26_02-5755239535281555042?project=apache-beam-testing
Worker logs: https://console.cloud.google.com/dataflow/jobs/us-central1/2020-08-17_11_33_40-13039659515995529873?project=apache-beam-testing
Worker logs: https://console.cloud.google.com/dataflow/jobs/us-central1/2020-08-17_11_41_09-15024224728532230035?project=apache-beam-testing
Worker logs: https://console.cloud.google.com/dataflow/jobs/us-central1/2020-08-17_11_02_58-14495214180867583419?project=apache-beam-testing
Worker logs: https://console.cloud.google.com/dataflow/jobs/us-central1/2020-08-17_11_23_25-10491404939295410704?project=apache-beam-testing
Worker logs: https://console.cloud.google.com/dataflow/jobs/us-central1/2020-08-17_11_30_57-2399169220501755079?project=apache-beam-testing
Worker logs: https://console.cloud.google.com/dataflow/jobs/us-central1/2020-08-17_11_38_16-9482104139571259685?project=apache-beam-testing
Worker logs: https://console.cloud.google.com/dataflow/jobs/us-central1/2020-08-17_11_45_07-15625267894289586169?project=apache-beam-testing
Worker logs: https://console.cloud.google.com/dataflow/jobs/us-central1/2020-08-17_11_02_58-1488930568655104715?project=apache-beam-testing
Worker logs: https://console.cloud.google.com/dataflow/jobs/us-central1/2020-08-17_11_21_30-10460715534206549676?project=apache-beam-testing
Worker logs: https://console.cloud.google.com/dataflow/jobs/us-central1/2020-08-17_11_29_17-15689837830144220537?project=apache-beam-testing
Worker logs: https://console.cloud.google.com/dataflow/jobs/us-central1/2020-08-17_11_37_21-1929524536881190883?project=apache-beam-testing
Worker logs: https://console.cloud.google.com/dataflow/jobs/us-central1/2020-08-17_11_45_20-12669001880203068516?project=apache-beam-testing
Worker logs: https://console.cloud.google.com/dataflow/jobs/us-central1/2020-08-17_11_02_57-2812667438584435147?project=apache-beam-testing
Worker logs: https://console.cloud.google.com/dataflow/jobs/us-central1/2020-08-17_11_10_55-13222237684632643080?project=apache-beam-testing
Worker logs: https://console.cloud.google.com/dataflow/jobs/us-central1/2020-08-17_11_18_17-13062584674707964698?project=apache-beam-testing
Worker logs: https://console.cloud.google.com/dataflow/jobs/us-central1/2020-08-17_11_26_02-2789173216992712464?project=apache-beam-testing
Worker logs: https://console.cloud.google.com/dataflow/jobs/us-central1/2020-08-17_11_33_33-15427153540876890804?project=apache-beam-testing
Worker logs: https://console.cloud.google.com/dataflow/jobs/us-central1/2020-08-17_11_40_29-14427190541453189793?project=apache-beam-testing
Worker logs: https://console.cloud.google.com/dataflow/jobs/us-central1/2020-08-17_11_48_29-18135706534988331221?project=apache-beam-testing
Worker logs: https://console.cloud.google.com/dataflow/jobs/us-central1/2020-08-17_11_02_57-5663007230551897614?project=apache-beam-testing
Worker logs: https://console.cloud.google.com/dataflow/jobs/us-central1/2020-08-17_11_13_48-5182138658536103275?project=apache-beam-testing
Worker logs: https://console.cloud.google.com/dataflow/jobs/us-central1/2020-08-17_11_23_29-2571745370707793359?project=apache-beam-testing
Worker logs: https://console.cloud.google.com/dataflow/jobs/us-central1/2020-08-17_11_31_38-8923398646808354837?project=apache-beam-testing
Worker logs: https://console.cloud.google.com/dataflow/jobs/us-central1/2020-08-17_11_39_28-6434413540153724466?project=apache-beam-testing
Worker logs: https://console.cloud.google.com/dataflow/jobs/us-central1/2020-08-17_11_47_08-13905997175155501320?project=apache-beam-testing
Worker logs: https://console.cloud.google.com/dataflow/jobs/us-central1/2020-08-17_11_55_53-10617260904374909493?project=apache-beam-testing
Worker logs: https://console.cloud.google.com/dataflow/jobs/us-central1/2020-08-17_11_02_58-14436282884597423770?project=apache-beam-testing
Worker logs: https://console.cloud.google.com/dataflow/jobs/us-central1/2020-08-17_11_12_41-1848200220351934951?project=apache-beam-testing
Worker logs: https://console.cloud.google.com/dataflow/jobs/us-central1/2020-08-17_11_13_53-11106378020473973006?project=apache-beam-testing
Worker logs: https://console.cloud.google.com/dataflow/jobs/us-central1/2020-08-17_11_22_12-8090760519964426652?project=apache-beam-testing
Worker logs: https://console.cloud.google.com/dataflow/jobs/us-central1/2020-08-17_11_30_00-777929510740083835?project=apache-beam-testing
Worker logs: https://console.cloud.google.com/dataflow/jobs/us-central1/2020-08-17_11_37_11-2762625885554883730?project=apache-beam-testing
Worker logs: https://console.cloud.google.com/dataflow/jobs/us-central1/2020-08-17_11_45_05-16533874223059734494?project=apache-beam-testing
Worker logs: https://console.cloud.google.com/dataflow/jobs/us-central1/2020-08-17_11_02_58-12232590610393621540?project=apache-beam-testing
Worker logs: https://console.cloud.google.com/dataflow/jobs/us-central1/2020-08-17_11_12_58-3840954014602571836?project=apache-beam-testing
Worker logs: https://console.cloud.google.com/dataflow/jobs/us-central1/2020-08-17_11_14_09-7076303207913751181?project=apache-beam-testing
Worker logs: https://console.cloud.google.com/dataflow/jobs/us-central1/2020-08-17_11_22_52-14117913985793231136?project=apache-beam-testing
Worker logs: https://console.cloud.google.com/dataflow/jobs/us-central1/2020-08-17_11_30_33-11724921001397011516?project=apache-beam-testing
Worker logs: https://console.cloud.google.com/dataflow/jobs/us-central1/2020-08-17_11_38_17-8111971509933947944?project=apache-beam-testing
Worker logs: https://console.cloud.google.com/dataflow/jobs/us-central1/2020-08-17_11_46_11-13333289834591517576?project=apache-beam-testing
> Task :sdks:python:test-suites:dataflow:py2:postCommitIT FAILED
FAILURE: Build completed with 2 failures.
1: Task failed with an exception.
-----------
* Where:
Build file '<https://ci-beam.apache.org/job/beam_PostCommit_Python2/ws/src/sdks/python/test-suites/direct/py2/build.gradle'> line: 50
* What went wrong:
Execution failed for task ':sdks:python:test-suites:direct:py2:directRunnerIT'.
> Process 'command 'sh'' finished with non-zero exit value 1
* Try:
Run with --stacktrace option to get the stack trace. Run with --info or --debug option to get more log output. Run with --scan to get full insights.
==============================================================================
2: Task failed with an exception.
-----------
* Where:
Script '<https://ci-beam.apache.org/job/beam_PostCommit_Python2/ws/src/sdks/python/test-suites/dataflow/common.gradle'> line: 116
* What went wrong:
Execution failed for task ':sdks:python:test-suites:dataflow:py2:postCommitIT'.
> Process 'command 'sh'' finished with non-zero exit value 1
* Try:
Run with --stacktrace option to get the stack trace. Run with --info or --debug option to get more log output. Run with --scan to get full insights.
==============================================================================
* Get more help at https://help.gradle.org
Deprecated Gradle features were used in this build, making it incompatible with Gradle 6.0.
Use '--warning-mode all' to show the individual deprecation warnings.
See https://docs.gradle.org/5.2.1/userguide/command_line_interface.html#sec:command_line_warnings
BUILD FAILED in 1h 2m 36s
159 actionable tasks: 123 executed, 34 from cache, 2 up-to-date
Publishing build scan...
https://gradle.com/s/r7awbeu3bah54
Build step 'Invoke Gradle script' changed build result to FAILURE
Build step 'Invoke Gradle script' marked build as failure
---------------------------------------------------------------------
To unsubscribe, e-mail: builds-unsubscribe@beam.apache.org
For additional commands, e-mail: builds-help@beam.apache.org
Build failed in Jenkins: beam_PostCommit_Python2 #2802
Posted by Apache Jenkins Server <je...@builds.apache.org>.
See <https://ci-beam.apache.org/job/beam_PostCommit_Python2/2802/display/redirect>
Changes:
------------------------------------------
[...truncated 17.55 MB...]
}
],
"is_wrapper": true
},
"output_name": "None",
"user_name": "WriteToSpanner/make batches/ParDo(_BatchFn).out"
}
],
"parallel_input": {
"@type": "OutputReference",
"output_name": "None",
"step_name": "s3"
},
"serialized_fn": "<string of 692 bytes>",
"user_name": "WriteToSpanner/make batches/ParDo(_BatchFn)"
}
},
{
"kind": "Flatten",
"name": "s5",
"properties": {
"display_data": [],
"inputs": [
{
"@type": "OutputReference",
"output_name": "unbatchable",
"step_name": "s3"
},
{
"@type": "OutputReference",
"output_name": "None",
"step_name": "s4"
}
],
"output_info": [
{
"encoding": {
"@type": "kind:windowed_value",
"component_encodings": [
{
"@type": "FastPrimitivesCoder$<string of 176 bytes>",
"component_encodings": [
{
"@type": "FastPrimitivesCoder$<string of 176 bytes>",
"component_encodings": [],
"pipeline_proto_coder_id": "ref_Coder_FastPrimitivesCoder_3"
},
{
"@type": "FastPrimitivesCoder$<string of 176 bytes>",
"component_encodings": [],
"pipeline_proto_coder_id": "ref_Coder_FastPrimitivesCoder_3"
}
],
"is_pair_like": true,
"pipeline_proto_coder_id": "ref_Coder_FastPrimitivesCoder_3"
},
{
"@type": "kind:global_window"
}
],
"is_wrapper": true
},
"output_name": "out",
"user_name": "WriteToSpanner/make batches/Merging batchable and unbatchable.out"
}
],
"user_name": "WriteToSpanner/make batches/Merging batchable and unbatchable"
}
},
{
"kind": "ParallelDo",
"name": "s6",
"properties": {
"display_data": [
{
"key": "fn",
"label": "Transform Function",
"namespace": "apache_beam.transforms.core.ParDo",
"shortValue": "_WriteToSpannerDoFn",
"type": "STRING",
"value": "apache_beam.io.gcp.experimental.spannerio._WriteToSpannerDoFn"
}
],
"non_parallel_inputs": {},
"output_info": [
{
"encoding": {
"@type": "kind:windowed_value",
"component_encodings": [
{
"@type": "FastPrimitivesCoder$<string of 176 bytes>",
"component_encodings": [
{
"@type": "FastPrimitivesCoder$<string of 176 bytes>",
"component_encodings": [],
"pipeline_proto_coder_id": "ref_Coder_FastPrimitivesCoder_3"
},
{
"@type": "FastPrimitivesCoder$<string of 176 bytes>",
"component_encodings": [],
"pipeline_proto_coder_id": "ref_Coder_FastPrimitivesCoder_3"
}
],
"is_pair_like": true,
"pipeline_proto_coder_id": "ref_Coder_FastPrimitivesCoder_3"
},
{
"@type": "kind:global_window"
}
],
"is_wrapper": true
},
"output_name": "None",
"user_name": "WriteToSpanner/Writing to spanner.out"
}
],
"parallel_input": {
"@type": "OutputReference",
"output_name": "out",
"step_name": "s5"
},
"serialized_fn": "<string of 1156 bytes>",
"user_name": "WriteToSpanner/Writing to spanner"
}
}
],
"type": "JOB_TYPE_BATCH"
}
apache_beam.runners.dataflow.internal.apiclient: INFO: Create job: <Job
createTime: u'2020-08-17T12:16:19.530577Z'
currentStateTime: u'1970-01-01T00:00:00Z'
id: u'2020-08-17_05_16_18-13448982073050502205'
location: u'us-central1'
name: u'beamapp-jenkins-0817121609-676303'
projectId: u'apache-beam-testing'
stageStates: []
startTime: u'2020-08-17T12:16:19.530577Z'
steps: []
tempFiles: []
type: TypeValueValuesEnum(JOB_TYPE_BATCH, 1)>
apache_beam.runners.dataflow.internal.apiclient: INFO: Created job with id: [2020-08-17_05_16_18-13448982073050502205]
apache_beam.runners.dataflow.internal.apiclient: INFO: Submitted job: 2020-08-17_05_16_18-13448982073050502205
apache_beam.runners.dataflow.internal.apiclient: INFO: To access the Dataflow monitoring console, please navigate to https://console.cloud.google.com/dataflow/jobs/us-central1/2020-08-17_05_16_18-13448982073050502205?project=apache-beam-testing
--------------------- >> end captured logging << ---------------------
----------------------------------------------------------------------
XML: nosetests-postCommitIT-df-py27.xml
----------------------------------------------------------------------
XML: <https://ci-beam.apache.org/job/beam_PostCommit_Python2/ws/src/sdks/python/nosetests.xml>
----------------------------------------------------------------------
Ran 66 tests in 3647.322s
FAILED (SKIP=7, errors=4, failures=2)
Worker logs: https://console.cloud.google.com/dataflow/jobs/us-central1/2020-08-17_05_02_43-2589190592231476903?project=apache-beam-testing
Worker logs: https://console.cloud.google.com/dataflow/jobs/us-central1/2020-08-17_05_10_43-3052537082601961706?project=apache-beam-testing
Worker logs: https://console.cloud.google.com/dataflow/jobs/us-central1/2020-08-17_05_18_21-15493696127557958761?project=apache-beam-testing
Worker logs: https://console.cloud.google.com/dataflow/jobs/us-central1/2020-08-17_05_26_00-11805525286929515012?project=apache-beam-testing
Worker logs: https://console.cloud.google.com/dataflow/jobs/us-central1/2020-08-17_05_33_43-13951300951883070664?project=apache-beam-testing
Worker logs: https://console.cloud.google.com/dataflow/jobs/us-central1/2020-08-17_05_41_29-16348507061337570599?project=apache-beam-testing
Worker logs: https://console.cloud.google.com/dataflow/jobs/us-central1/2020-08-17_05_48_38-9251098877937854562?project=apache-beam-testing
Worker logs: https://console.cloud.google.com/dataflow/jobs/us-central1/2020-08-17_05_56_33-3032085746647547916?project=apache-beam-testing
Worker logs: https://console.cloud.google.com/dataflow/jobs/us-central1/2020-08-17_05_02_49-15204915248404805116?project=apache-beam-testing
Worker logs: https://console.cloud.google.com/dataflow/jobs/us-central1/2020-08-17_05_16_18-13448982073050502205?project=apache-beam-testing
Worker logs: https://console.cloud.google.com/dataflow/jobs/us-central1/2020-08-17_05_16_43-14582546713014624605?project=apache-beam-testing
Worker logs: https://console.cloud.google.com/dataflow/jobs/us-central1/2020-08-17_05_23_21-9958047145149327298?project=apache-beam-testing
Worker logs: https://console.cloud.google.com/dataflow/jobs/us-central1/2020-08-17_05_30_19-6571325634030893680?project=apache-beam-testing
Worker logs: https://console.cloud.google.com/dataflow/jobs/us-central1/2020-08-17_05_37_47-11164874170966509434?project=apache-beam-testing
Worker logs: https://console.cloud.google.com/dataflow/jobs/us-central1/2020-08-17_05_45_28-13004945444613576129?project=apache-beam-testing
Worker logs: https://console.cloud.google.com/dataflow/jobs/us-central1/2020-08-17_05_52_42-12006987933470791791?project=apache-beam-testing
Worker logs: https://console.cloud.google.com/dataflow/jobs/us-central1/2020-08-17_05_02_46-821305434592549951?project=apache-beam-testing
Worker logs: https://console.cloud.google.com/dataflow/jobs/us-central1/2020-08-17_05_23_54-6520936908794178279?project=apache-beam-testing
Worker logs: https://console.cloud.google.com/dataflow/jobs/us-central1/2020-08-17_05_31_28-17533181660107619062?project=apache-beam-testing
Worker logs: https://console.cloud.google.com/dataflow/jobs/us-central1/2020-08-17_05_02_46-16107749632373029239?project=apache-beam-testing
Worker logs: https://console.cloud.google.com/dataflow/jobs/us-central1/2020-08-17_05_14_10-11668294359985807023?project=apache-beam-testing
Worker logs: https://console.cloud.google.com/dataflow/jobs/us-central1/2020-08-17_05_21_31-12874408287845582452?project=apache-beam-testing
Worker logs: https://console.cloud.google.com/dataflow/jobs/us-central1/2020-08-17_05_28_26-18374299516953391282?project=apache-beam-testing
Worker logs: https://console.cloud.google.com/dataflow/jobs/us-central1/2020-08-17_05_35_55-4211391861206752558?project=apache-beam-testing
Worker logs: https://console.cloud.google.com/dataflow/jobs/us-central1/2020-08-17_05_43_26-6032667978788303544?project=apache-beam-testing
Worker logs: https://console.cloud.google.com/dataflow/jobs/us-central1/2020-08-17_05_02_42-6930531015574223230?project=apache-beam-testing
Worker logs: https://console.cloud.google.com/dataflow/jobs/us-central1/2020-08-17_05_19_50-2530807793445197720?project=apache-beam-testing
Worker logs: https://console.cloud.google.com/dataflow/jobs/us-central1/2020-08-17_05_27_21-16615986019769047322?project=apache-beam-testing
Worker logs: https://console.cloud.google.com/dataflow/jobs/us-central1/2020-08-17_05_34_09-14448175241466245415?project=apache-beam-testing
Worker logs: https://console.cloud.google.com/dataflow/jobs/us-central1/2020-08-17_05_41_21-266430329202602087?project=apache-beam-testing
Worker logs: https://console.cloud.google.com/dataflow/jobs/us-central1/2020-08-17_05_48_38-5901941549239504107?project=apache-beam-testing
Worker logs: https://console.cloud.google.com/dataflow/jobs/us-central1/2020-08-17_05_02_46-11682396574767785563?project=apache-beam-testing
Worker logs: https://console.cloud.google.com/dataflow/jobs/us-central1/2020-08-17_05_10_29-14792354944287028624?project=apache-beam-testing
Worker logs: https://console.cloud.google.com/dataflow/jobs/us-central1/2020-08-17_05_18_31-13540913707241290841?project=apache-beam-testing
Worker logs: https://console.cloud.google.com/dataflow/jobs/us-central1/2020-08-17_05_26_08-17180204450055260236?project=apache-beam-testing
Worker logs: https://console.cloud.google.com/dataflow/jobs/us-central1/2020-08-17_05_33_29-206813168850065232?project=apache-beam-testing
Worker logs: https://console.cloud.google.com/dataflow/jobs/us-central1/2020-08-17_05_41_07-3692773297733636313?project=apache-beam-testing
Worker logs: https://console.cloud.google.com/dataflow/jobs/us-central1/2020-08-17_05_48_36-16753024911332598806?project=apache-beam-testing
Worker logs: https://console.cloud.google.com/dataflow/jobs/us-central1/2020-08-17_05_02_44-6764984006380811951?project=apache-beam-testing
Worker logs: https://console.cloud.google.com/dataflow/jobs/us-central1/2020-08-17_05_10_45-10540820304178325635?project=apache-beam-testing
Worker logs: https://console.cloud.google.com/dataflow/jobs/us-central1/2020-08-17_05_17_55-17950374467707541931?project=apache-beam-testing
Worker logs: https://console.cloud.google.com/dataflow/jobs/us-central1/2020-08-17_05_18_32-484939575166505979?project=apache-beam-testing
Worker logs: https://console.cloud.google.com/dataflow/jobs/us-central1/2020-08-17_05_27_38-16855653419616695860?project=apache-beam-testing
Worker logs: https://console.cloud.google.com/dataflow/jobs/us-central1/2020-08-17_05_36_12-14224338141357989619?project=apache-beam-testing
Worker logs: https://console.cloud.google.com/dataflow/jobs/us-central1/2020-08-17_05_44_02-7154692680403071771?project=apache-beam-testing
Worker logs: https://console.cloud.google.com/dataflow/jobs/us-central1/2020-08-17_05_02_43-6688484043376345734?project=apache-beam-testing
Worker logs: https://console.cloud.google.com/dataflow/jobs/us-central1/2020-08-17_05_11_59-8313500223768881457?project=apache-beam-testing
Worker logs: https://console.cloud.google.com/dataflow/jobs/us-central1/2020-08-17_05_22_08-7295074168028444401?project=apache-beam-testing
Worker logs: https://console.cloud.google.com/dataflow/jobs/us-central1/2020-08-17_05_29_37-4866394102094196960?project=apache-beam-testing
Worker logs: https://console.cloud.google.com/dataflow/jobs/us-central1/2020-08-17_05_36_38-4897052726900218681?project=apache-beam-testing
Worker logs: https://console.cloud.google.com/dataflow/jobs/us-central1/2020-08-17_05_43_38-498275267308588536?project=apache-beam-testing
> Task :sdks:python:test-suites:dataflow:py2:postCommitIT FAILED
FAILURE: Build completed with 2 failures.
1: Task failed with an exception.
-----------
* Where:
Build file '<https://ci-beam.apache.org/job/beam_PostCommit_Python2/ws/src/sdks/python/test-suites/direct/py2/build.gradle'> line: 50
* What went wrong:
Execution failed for task ':sdks:python:test-suites:direct:py2:directRunnerIT'.
> Process 'command 'sh'' finished with non-zero exit value 1
* Try:
Run with --stacktrace option to get the stack trace. Run with --info or --debug option to get more log output. Run with --scan to get full insights.
==============================================================================
2: Task failed with an exception.
-----------
* Where:
Script '<https://ci-beam.apache.org/job/beam_PostCommit_Python2/ws/src/sdks/python/test-suites/dataflow/common.gradle'> line: 116
* What went wrong:
Execution failed for task ':sdks:python:test-suites:dataflow:py2:postCommitIT'.
> Process 'command 'sh'' finished with non-zero exit value 1
* Try:
Run with --stacktrace option to get the stack trace. Run with --info or --debug option to get more log output. Run with --scan to get full insights.
==============================================================================
* Get more help at https://help.gradle.org
Deprecated Gradle features were used in this build, making it incompatible with Gradle 6.0.
Use '--warning-mode all' to show the individual deprecation warnings.
See https://docs.gradle.org/5.2.1/userguide/command_line_interface.html#sec:command_line_warnings
BUILD FAILED in 1h 2m 37s
159 actionable tasks: 122 executed, 35 from cache, 2 up-to-date
Publishing build scan...
https://gradle.com/s/jgd3hiios2pho
Build step 'Invoke Gradle script' changed build result to FAILURE
Build step 'Invoke Gradle script' marked build as failure
---------------------------------------------------------------------
To unsubscribe, e-mail: builds-unsubscribe@beam.apache.org
For additional commands, e-mail: builds-help@beam.apache.org
Build failed in Jenkins: beam_PostCommit_Python2 #2801
Posted by Apache Jenkins Server <je...@builds.apache.org>.
See <https://ci-beam.apache.org/job/beam_PostCommit_Python2/2801/display/redirect>
Changes:
------------------------------------------
[...truncated 17.75 MB...]
"is_wrapper": true
},
"output_name": "None",
"user_name": "WriteToSpanner/make batches/ParDo(_BatchFn).out"
}
],
"parallel_input": {
"@type": "OutputReference",
"output_name": "None",
"step_name": "s3"
},
"serialized_fn": "<string of 692 bytes>",
"user_name": "WriteToSpanner/make batches/ParDo(_BatchFn)"
}
},
{
"kind": "Flatten",
"name": "s5",
"properties": {
"display_data": [],
"inputs": [
{
"@type": "OutputReference",
"output_name": "None",
"step_name": "s4"
},
{
"@type": "OutputReference",
"output_name": "unbatchable",
"step_name": "s3"
}
],
"output_info": [
{
"encoding": {
"@type": "kind:windowed_value",
"component_encodings": [
{
"@type": "FastPrimitivesCoder$<string of 176 bytes>",
"component_encodings": [
{
"@type": "FastPrimitivesCoder$<string of 176 bytes>",
"component_encodings": [],
"pipeline_proto_coder_id": "ref_Coder_FastPrimitivesCoder_4"
},
{
"@type": "FastPrimitivesCoder$<string of 176 bytes>",
"component_encodings": [],
"pipeline_proto_coder_id": "ref_Coder_FastPrimitivesCoder_4"
}
],
"is_pair_like": true,
"pipeline_proto_coder_id": "ref_Coder_FastPrimitivesCoder_4"
},
{
"@type": "kind:global_window"
}
],
"is_wrapper": true
},
"output_name": "out",
"user_name": "WriteToSpanner/make batches/Merging batchable and unbatchable.out"
}
],
"user_name": "WriteToSpanner/make batches/Merging batchable and unbatchable"
}
},
{
"kind": "ParallelDo",
"name": "s6",
"properties": {
"display_data": [
{
"key": "fn",
"label": "Transform Function",
"namespace": "apache_beam.transforms.core.ParDo",
"shortValue": "_WriteToSpannerDoFn",
"type": "STRING",
"value": "apache_beam.io.gcp.experimental.spannerio._WriteToSpannerDoFn"
}
],
"non_parallel_inputs": {},
"output_info": [
{
"encoding": {
"@type": "kind:windowed_value",
"component_encodings": [
{
"@type": "FastPrimitivesCoder$<string of 176 bytes>",
"component_encodings": [
{
"@type": "FastPrimitivesCoder$<string of 176 bytes>",
"component_encodings": [],
"pipeline_proto_coder_id": "ref_Coder_FastPrimitivesCoder_4"
},
{
"@type": "FastPrimitivesCoder$<string of 176 bytes>",
"component_encodings": [],
"pipeline_proto_coder_id": "ref_Coder_FastPrimitivesCoder_4"
}
],
"is_pair_like": true,
"pipeline_proto_coder_id": "ref_Coder_FastPrimitivesCoder_4"
},
{
"@type": "kind:global_window"
}
],
"is_wrapper": true
},
"output_name": "None",
"user_name": "WriteToSpanner/Writing to spanner.out"
}
],
"parallel_input": {
"@type": "OutputReference",
"output_name": "out",
"step_name": "s5"
},
"serialized_fn": "<string of 1164 bytes>",
"user_name": "WriteToSpanner/Writing to spanner"
}
}
],
"type": "JOB_TYPE_BATCH"
}
apache_beam.runners.dataflow.internal.apiclient: INFO: Create job: <Job
createTime: u'2020-08-17T06:16:41.989686Z'
currentStateTime: u'1970-01-01T00:00:00Z'
id: u'2020-08-16_23_16_40-15252608046116719310'
location: u'us-central1'
name: u'beamapp-jenkins-0817061632-087027'
projectId: u'apache-beam-testing'
stageStates: []
startTime: u'2020-08-17T06:16:41.989686Z'
steps: []
tempFiles: []
type: TypeValueValuesEnum(JOB_TYPE_BATCH, 1)>
apache_beam.runners.dataflow.internal.apiclient: INFO: Created job with id: [2020-08-16_23_16_40-15252608046116719310]
apache_beam.runners.dataflow.internal.apiclient: INFO: Submitted job: 2020-08-16_23_16_40-15252608046116719310
apache_beam.runners.dataflow.internal.apiclient: INFO: To access the Dataflow monitoring console, please navigate to https://console.cloud.google.com/dataflow/jobs/us-central1/2020-08-16_23_16_40-15252608046116719310?project=apache-beam-testing
--------------------- >> end captured logging << ---------------------
----------------------------------------------------------------------
XML: nosetests-postCommitIT-df-py27.xml
----------------------------------------------------------------------
XML: <https://ci-beam.apache.org/job/beam_PostCommit_Python2/ws/src/sdks/python/nosetests.xml>
----------------------------------------------------------------------
Ran 66 tests in 3627.717s
FAILED (SKIP=6, errors=6, failures=2)
Worker logs: https://console.cloud.google.com/dataflow/jobs/us-central1/2020-08-16_23_02_47-500581467438789032?project=apache-beam-testing
Worker logs: https://console.cloud.google.com/dataflow/jobs/us-central1/2020-08-16_23_10_17-2027742241518222346?project=apache-beam-testing
Worker logs: https://console.cloud.google.com/dataflow/jobs/us-central1/2020-08-16_23_17_55-4463153826128670717?project=apache-beam-testing
Worker logs: https://console.cloud.google.com/dataflow/jobs/us-central1/2020-08-16_23_25_59-11496506622101528416?project=apache-beam-testing
Worker logs: https://console.cloud.google.com/dataflow/jobs/us-central1/2020-08-16_23_33_46-10697354531340548081?project=apache-beam-testing
Worker logs: https://console.cloud.google.com/dataflow/jobs/us-central1/2020-08-16_23_41_26-7083457446869831080?project=apache-beam-testing
Worker logs: https://console.cloud.google.com/dataflow/jobs/us-central1/2020-08-16_23_48_33-8598839568702203829?project=apache-beam-testing
Worker logs: https://console.cloud.google.com/dataflow/jobs/us-central1/2020-08-16_23_56_04-13575944838677777380?project=apache-beam-testing
Worker logs: https://console.cloud.google.com/dataflow/jobs/us-central1/2020-08-16_23_02_48-4404175823507366400?project=apache-beam-testing
Worker logs: https://console.cloud.google.com/dataflow/jobs/us-central1/2020-08-16_23_16_16-11534200204100970148?project=apache-beam-testing
Worker logs: https://console.cloud.google.com/dataflow/jobs/us-central1/2020-08-16_23_16_40-15252608046116719310?project=apache-beam-testing
Worker logs: https://console.cloud.google.com/dataflow/jobs/us-central1/2020-08-16_23_17_06-4948409366245035591?project=apache-beam-testing
Worker logs: https://console.cloud.google.com/dataflow/jobs/us-central1/2020-08-16_23_24_08-10302251706235914515?project=apache-beam-testing
Worker logs: https://console.cloud.google.com/dataflow/jobs/us-central1/2020-08-16_23_31_35-18399365860717020659?project=apache-beam-testing
Worker logs: https://console.cloud.google.com/dataflow/jobs/us-central1/2020-08-16_23_39_17-7203678428582173763?project=apache-beam-testing
Worker logs: https://console.cloud.google.com/dataflow/jobs/us-central1/2020-08-16_23_46_27-4379841212372873888?project=apache-beam-testing
Worker logs: https://console.cloud.google.com/dataflow/jobs/us-central1/2020-08-16_23_02_44-9936254335699431543?project=apache-beam-testing
Worker logs: https://console.cloud.google.com/dataflow/jobs/us-central1/2020-08-16_23_20_06-6346240458841739617?project=apache-beam-testing
Worker logs: https://console.cloud.google.com/dataflow/jobs/us-central1/2020-08-16_23_27_25-3864372510182945662?project=apache-beam-testing
Worker logs: https://console.cloud.google.com/dataflow/jobs/us-central1/2020-08-16_23_34_12-11231326945042455857?project=apache-beam-testing
Worker logs: https://console.cloud.google.com/dataflow/jobs/us-central1/2020-08-16_23_41_37-8147629838540281852?project=apache-beam-testing
Worker logs: https://console.cloud.google.com/dataflow/jobs/us-central1/2020-08-16_23_02_46-8557133162365406733?project=apache-beam-testing
Worker logs: https://console.cloud.google.com/dataflow/jobs/us-central1/2020-08-16_23_14_08-15801051127940485085?project=apache-beam-testing
Worker logs: https://console.cloud.google.com/dataflow/jobs/us-central1/2020-08-16_23_21_03-18020647085342331817?project=apache-beam-testing
Worker logs: https://console.cloud.google.com/dataflow/jobs/us-central1/2020-08-16_23_27_52-77791610870647537?project=apache-beam-testing
Worker logs: https://console.cloud.google.com/dataflow/jobs/us-central1/2020-08-16_23_35_14-15242990265022832657?project=apache-beam-testing
Worker logs: https://console.cloud.google.com/dataflow/jobs/us-central1/2020-08-16_23_42_39-16990376507675329963?project=apache-beam-testing
Worker logs: https://console.cloud.google.com/dataflow/jobs/us-central1/2020-08-16_23_02_41-4952958443645175032?project=apache-beam-testing
Worker logs: https://console.cloud.google.com/dataflow/jobs/us-central1/2020-08-16_23_19_18-12876182376131303108?project=apache-beam-testing
Worker logs: https://console.cloud.google.com/dataflow/jobs/us-central1/2020-08-16_23_26_43-8691402418381029255?project=apache-beam-testing
Worker logs: https://console.cloud.google.com/dataflow/jobs/us-central1/2020-08-16_23_33_58-3666842934600333114?project=apache-beam-testing
Worker logs: https://console.cloud.google.com/dataflow/jobs/us-central1/2020-08-16_23_41_36-7620392319632983537?project=apache-beam-testing
Worker logs: https://console.cloud.google.com/dataflow/jobs/us-central1/2020-08-16_23_49_09-13349608915976462057?project=apache-beam-testing
Worker logs: https://console.cloud.google.com/dataflow/jobs/us-central1/2020-08-16_23_02_42-4414652352653680288?project=apache-beam-testing
Worker logs: https://console.cloud.google.com/dataflow/jobs/us-central1/2020-08-16_23_10_02-9187835479485933594?project=apache-beam-testing
Worker logs: https://console.cloud.google.com/dataflow/jobs/us-central1/2020-08-16_23_18_19-14955179303911804911?project=apache-beam-testing
Worker logs: https://console.cloud.google.com/dataflow/jobs/us-central1/2020-08-16_23_27_09-8067692138748275510?project=apache-beam-testing
Worker logs: https://console.cloud.google.com/dataflow/jobs/us-central1/2020-08-16_23_35_22-10903209992923520213?project=apache-beam-testing
Worker logs: https://console.cloud.google.com/dataflow/jobs/us-central1/2020-08-16_23_43_05-8142979176445221565?project=apache-beam-testing
Worker logs: https://console.cloud.google.com/dataflow/jobs/us-central1/2020-08-16_23_02_43-7758250009043621701?project=apache-beam-testing
Worker logs: https://console.cloud.google.com/dataflow/jobs/us-central1/2020-08-16_23_10_21-5734542396658544438?project=apache-beam-testing
Worker logs: https://console.cloud.google.com/dataflow/jobs/us-central1/2020-08-16_23_17_00-15410912708259316822?project=apache-beam-testing
Worker logs: https://console.cloud.google.com/dataflow/jobs/us-central1/2020-08-16_23_24_16-7763009209974607888?project=apache-beam-testing
Worker logs: https://console.cloud.google.com/dataflow/jobs/us-central1/2020-08-16_23_31_59-8465469760432575517?project=apache-beam-testing
Worker logs: https://console.cloud.google.com/dataflow/jobs/us-central1/2020-08-16_23_38_59-11747431665663428458?project=apache-beam-testing
Worker logs: https://console.cloud.google.com/dataflow/jobs/us-central1/2020-08-16_23_46_13-12324214010532801662?project=apache-beam-testing
Worker logs: https://console.cloud.google.com/dataflow/jobs/us-central1/2020-08-16_23_53_01-13762368734686546565?project=apache-beam-testing
Worker logs: https://console.cloud.google.com/dataflow/jobs/us-central1/2020-08-16_23_02_43-8065836938570033251?project=apache-beam-testing
Worker logs: https://console.cloud.google.com/dataflow/jobs/us-central1/2020-08-16_23_11_27-11368488362670487075?project=apache-beam-testing
Worker logs: https://console.cloud.google.com/dataflow/jobs/us-central1/2020-08-16_23_21_04-18373349525799249121?project=apache-beam-testing
Worker logs: https://console.cloud.google.com/dataflow/jobs/us-central1/2020-08-16_23_28_03-18021248849677555338?project=apache-beam-testing
Worker logs: https://console.cloud.google.com/dataflow/jobs/us-central1/2020-08-16_23_35_38-18061180553462666110?project=apache-beam-testing
Worker logs: https://console.cloud.google.com/dataflow/jobs/us-central1/2020-08-16_23_42_36-17774197520212026573?project=apache-beam-testing
> Task :sdks:python:test-suites:dataflow:py2:postCommitIT FAILED
FAILURE: Build completed with 2 failures.
1: Task failed with an exception.
-----------
* Where:
Build file '<https://ci-beam.apache.org/job/beam_PostCommit_Python2/ws/src/sdks/python/test-suites/direct/py2/build.gradle'> line: 50
* What went wrong:
Execution failed for task ':sdks:python:test-suites:direct:py2:directRunnerIT'.
> Process 'command 'sh'' finished with non-zero exit value 1
* Try:
Run with --stacktrace option to get the stack trace. Run with --info or --debug option to get more log output. Run with --scan to get full insights.
==============================================================================
2: Task failed with an exception.
-----------
* Where:
Script '<https://ci-beam.apache.org/job/beam_PostCommit_Python2/ws/src/sdks/python/test-suites/dataflow/common.gradle'> line: 116
* What went wrong:
Execution failed for task ':sdks:python:test-suites:dataflow:py2:postCommitIT'.
> Process 'command 'sh'' finished with non-zero exit value 1
* Try:
Run with --stacktrace option to get the stack trace. Run with --info or --debug option to get more log output. Run with --scan to get full insights.
==============================================================================
* Get more help at https://help.gradle.org
Deprecated Gradle features were used in this build, making it incompatible with Gradle 6.0.
Use '--warning-mode all' to show the individual deprecation warnings.
See https://docs.gradle.org/5.2.1/userguide/command_line_interface.html#sec:command_line_warnings
BUILD FAILED in 1h 2m 16s
159 actionable tasks: 122 executed, 35 from cache, 2 up-to-date
Publishing build scan...
https://gradle.com/s/vvzeftp5cavca
Build step 'Invoke Gradle script' changed build result to FAILURE
Build step 'Invoke Gradle script' marked build as failure
---------------------------------------------------------------------
To unsubscribe, e-mail: builds-unsubscribe@beam.apache.org
For additional commands, e-mail: builds-help@beam.apache.org
Build failed in Jenkins: beam_PostCommit_Python2 #2800
Posted by Apache Jenkins Server <je...@builds.apache.org>.
See <https://ci-beam.apache.org/job/beam_PostCommit_Python2/2800/display/redirect>
Changes:
------------------------------------------
[...truncated 17.88 MB...]
}
],
"parallel_input": {
"@type": "OutputReference",
"output_name": "None",
"step_name": "s39"
},
"user_name": "write/BigQueryBatchFileLoads/WaitForDestinationLoadJobs/_UnpickledSideInput(TriggerLoadJobsWithoutTempTables.out.0)",
"windowing_strategy": "%0A%88%11%22%40%0A%1Dref_Coder_GlobalWindowCoder_1%12%1F%0A%1D%0A%1Bbeam%3Acoder%3Aglobal_window%3Av1%2A%C3%10%0A%25ref_Environment_default_environment_1%12%99%10%12%12beam%3Aenv%3Adocker%3Av1%1A%3B%0A9gcr.io/cloud-dataflow/v1beta3/python%3Abeam-master-20200630%2A%14beam%3Acoder%3Avarint%3Av1%2A%13beam%3Acoder%3Abytes%3Av1%2A%13beam%3Acoder%3Atimer%3Av1%2A%1Bbeam%3Acoder%3Aglobal_window%3Av1%2A%1Dbeam%3Acoder%3Ainterval_window%3Av1%2A%16beam%3Acoder%3Aiterable%3Av1%2A%23beam%3Acoder%3Astate_backed_iterable%3Av1%2A%1Cbeam%3Acoder%3Awindowed_value%3Av1%2A%22beam%3Acoder%3Aparam_windowed_value%3Av1%2A%14beam%3Acoder%3Adouble%3Av1%2A%19beam%3Acoder%3Astring_utf8%3Av1%2A%1Bbeam%3Acoder%3Alength_prefix%3Av1%2A%12beam%3Acoder%3Abool%3Av1%2A%10beam%3Acoder%3Akv%3Av1%2A%11beam%3Acoder%3Arow%3Av1%2A%23beam%3Aprotocol%3Aprogress_reporting%3Av0%2A%1Ebeam%3Aprotocol%3Aworker_status%3Av1%2A%3Abeam%3Aversion%3Asdk_base%3Aapache/beam_python2.7_sdk%3A2.25.0.dev2q%0A%1Abeam%3Aartifact%3Atype%3Afile%3Av1%12%1D%0A%1Bpostcommit_requirements.txt%1A%20beam%3Aartifact%3Arole%3Astaging_to%3Av1%22%12%0A%10requirements.txt2%9B%01%0A%1Abeam%3Aartifact%3Atype%3Afile%3Av1%12%3D%0A%3B/tmp/dataflow-requirements-cache/parameterized-0.7.4.tar.gz%1A%20beam%3Aartifact%3Arole%3Astaging_to%3Av1%22%1C%0A%1Aparameterized-0.7.4.tar.gz2%89%01%0A%1Abeam%3Aartifact%3Atype%3Afile%3Av1%124%0A2/tmp/dataflow-requirements-cache/mock-2.0.0.tar.gz%1A%20beam%3Aartifact%3Arole%3Astaging_to%3Av1%22%13%0A%11mock-2.0.0.tar.gz2%89%01%0A%1Abeam%3Aartifact%3Atype%3Afile%3Av1%124%0A2/tmp/dataflow-requirements-cache/six-1.15.0.tar.gz%1A%20beam%3Aartifact%3Arole%3Astaging_to%3Av1%22%13%0A%11six-1.15.0.tar.gz2%91%01%0A%1Abeam%3Aartifact%3Atype%3Afile%3Av1%128%0A6/tmp/dataflow-requirements-cache/funcsigs-1.0.2.tar.gz%1A%20beam%3Aartifact%3Arole%3Astaging_to%3Av1%22%17%0A%15funcsigs-1.0.2.tar.gz2%87%01%0A%1Abeam%3Aartifact%3Atype%3Afile%3Av1%123%0A1/tmp/dataflow-requirements-cache/pbr-5.4.5.tar.gz%1A%20beam%3Aartifact%3Arole%3Astaging_to%3Av1%22%12%0A%10pbr-5.4.5.tar.gz2%97%01%0A%1Abeam%3Aartifact%3Atype%3Afile%3Av1%12%3B%0A9/tmp/dataflow-requirements-cache/PyHamcrest-1.10.1.tar.gz%1A%20beam%3Aartifact%3Arole%3Astaging_to%3Av1%22%1A%0A%18PyHamcrest-1.10.1.tar.gz2%C3%01%0A%1Abeam%3Aartifact%3Atype%3Afile%3Av1%12h%0Af<https://ci-beam.apache.org/job/beam_PostCommit_Python2/ws/src/sdks/python/build/apache-beam.tar.gz%1A%20beam%3Aartifact%3Arole%3Astaging_to%3Av1%22%19%0A%17dataflow_python_sdk.tar2%9B%02%0A%1Abeam%3Aartifact%3Atype%3Afile%3Av1%12%C3%01%0A%C0%01/home/jenkins/jenkins-slave/workspace/beam_PostCommit_Python2/src/runners/google-cloud-dataflow-java/worker/build/libs/beam-runners-google-cloud-dataflow-java-fn-api-worker-2.25.0-SNAPSHOT.jar%1A%20beam%3Aartifact%3Arole%3Astaging_to%3Av1%22%15%0A%13dataflow-worker.jarjx%0A%22%0A%20beam%3Awindow_fn%3Aglobal_windows%3Av1%10%01%1A%1Dref_Coder_GlobalWindowCoder_1%22%02%3A%00%28%010%018%01H%01Z%25ref_Environment_default_environment_1">
}
},
{
"kind": "ParallelDo",
"name": "s41",
"properties": {
"display_data": [
{
"key": "fn",
"label": "Transform Function",
"namespace": "apache_beam.transforms.core.ParDo",
"shortValue": "WaitForBQJobs",
"type": "STRING",
"value": "apache_beam.io.gcp.bigquery_file_loads.WaitForBQJobs"
}
],
"non_parallel_inputs": {
"python_side_input0-write/BigQueryBatchFileLoads/WaitForDestinationLoadJobs": {
"@type": "OutputReference",
"output_name": "out",
"step_name": "SideInput-s40"
}
},
"output_info": [
{
"encoding": {
"@type": "kind:windowed_value",
"component_encodings": [
{
"@type": "FastPrimitivesCoder$<string of 176 bytes>",
"component_encodings": [
{
"@type": "FastPrimitivesCoder$<string of 176 bytes>",
"component_encodings": [],
"pipeline_proto_coder_id": "ref_Coder_FastPrimitivesCoder_5"
},
{
"@type": "FastPrimitivesCoder$<string of 176 bytes>",
"component_encodings": [],
"pipeline_proto_coder_id": "ref_Coder_FastPrimitivesCoder_5"
}
],
"is_pair_like": true,
"pipeline_proto_coder_id": "ref_Coder_FastPrimitivesCoder_5"
},
{
"@type": "kind:global_window"
}
],
"is_wrapper": true
},
"output_name": "None",
"user_name": "write/BigQueryBatchFileLoads/WaitForDestinationLoadJobs.out"
}
],
"parallel_input": {
"@type": "OutputReference",
"output_name": "out",
"step_name": "s7"
},
"serialized_fn": "<string of 1276 bytes>",
"user_name": "write/BigQueryBatchFileLoads/WaitForDestinationLoadJobs/WaitForDestinationLoadJobs"
}
},
{
"kind": "Flatten",
"name": "s42",
"properties": {
"display_data": [],
"inputs": [
{
"@type": "OutputReference",
"output_name": "None",
"step_name": "s39"
},
{
"@type": "OutputReference",
"output_name": "None",
"step_name": "s25"
}
],
"output_info": [
{
"encoding": {
"@type": "kind:windowed_value",
"component_encodings": [
{
"@type": "FastPrimitivesCoder$<string of 176 bytes>",
"component_encodings": [
{
"@type": "FastPrimitivesCoder$<string of 176 bytes>",
"component_encodings": [],
"pipeline_proto_coder_id": "ref_Coder_FastPrimitivesCoder_5"
},
{
"@type": "FastPrimitivesCoder$<string of 176 bytes>",
"component_encodings": [],
"pipeline_proto_coder_id": "ref_Coder_FastPrimitivesCoder_5"
}
],
"is_pair_like": true,
"pipeline_proto_coder_id": "ref_Coder_FastPrimitivesCoder_5"
},
{
"@type": "kind:global_window"
}
],
"is_wrapper": true
},
"output_name": "out",
"user_name": "write/BigQueryBatchFileLoads/Flatten.out"
}
],
"user_name": "write/BigQueryBatchFileLoads/Flatten"
}
}
],
"type": "JOB_TYPE_BATCH"
}
apache_beam.runners.dataflow.internal.apiclient: INFO: Create job: <Job
createTime: u'2020-08-17T00:11:00.197608Z'
currentStateTime: u'1970-01-01T00:00:00Z'
id: u'2020-08-16_17_10_58-8320176444431885644'
location: u'us-central1'
name: u'beamapp-jenkins-0817001047-935605'
projectId: u'apache-beam-testing'
stageStates: []
startTime: u'2020-08-17T00:11:00.197608Z'
steps: []
tempFiles: []
type: TypeValueValuesEnum(JOB_TYPE_BATCH, 1)>
apache_beam.runners.dataflow.internal.apiclient: INFO: Created job with id: [2020-08-16_17_10_58-8320176444431885644]
apache_beam.runners.dataflow.internal.apiclient: INFO: Submitted job: 2020-08-16_17_10_58-8320176444431885644
apache_beam.runners.dataflow.internal.apiclient: INFO: To access the Dataflow monitoring console, please navigate to https://console.cloud.google.com/dataflow/jobs/us-central1/2020-08-16_17_10_58-8320176444431885644?project=apache-beam-testing
--------------------- >> end captured logging << ---------------------
----------------------------------------------------------------------
XML: nosetests-postCommitIT-df-py27.xml
----------------------------------------------------------------------
XML: <https://ci-beam.apache.org/job/beam_PostCommit_Python2/ws/src/sdks/python/nosetests.xml>
----------------------------------------------------------------------
Ran 66 tests in 3330.019s
FAILED (SKIP=6, errors=10, failures=1)
Worker logs: https://console.cloud.google.com/dataflow/jobs/us-central1/2020-08-16_17_02_53-12352280740364145555?project=apache-beam-testing
Worker logs: https://console.cloud.google.com/dataflow/jobs/us-central1/2020-08-16_17_20_40-2950212004276856473?project=apache-beam-testing
Worker logs: https://console.cloud.google.com/dataflow/jobs/us-central1/2020-08-16_17_27_54-7216477644595193567?project=apache-beam-testing
Worker logs: https://console.cloud.google.com/dataflow/jobs/us-central1/2020-08-16_17_34_45-3821921539300197111?project=apache-beam-testing
Worker logs: https://console.cloud.google.com/dataflow/jobs/us-central1/2020-08-16_17_42_29-5756479147685882942?project=apache-beam-testing
Worker logs: https://console.cloud.google.com/dataflow/jobs/us-central1/2020-08-16_17_02_52-5050775501988803715?project=apache-beam-testing
Worker logs: https://console.cloud.google.com/dataflow/jobs/us-central1/2020-08-16_17_11_11-8275273016453853602?project=apache-beam-testing
Worker logs: https://console.cloud.google.com/dataflow/jobs/us-central1/2020-08-16_17_13_50-1534222860241034356?project=apache-beam-testing
Worker logs: https://console.cloud.google.com/dataflow/jobs/us-central1/2020-08-16_17_21_38-18041215076540644483?project=apache-beam-testing
Worker logs: https://console.cloud.google.com/dataflow/jobs/us-central1/2020-08-16_17_28_46-13930513394300957639?project=apache-beam-testing
Worker logs: https://console.cloud.google.com/dataflow/jobs/us-central1/2020-08-16_17_36_36-10399981445308645459?project=apache-beam-testing
Worker logs: https://console.cloud.google.com/dataflow/jobs/us-central1/2020-08-16_17_44_05-5671635534086540570?project=apache-beam-testing
Worker logs: https://console.cloud.google.com/dataflow/jobs/us-central1/2020-08-16_17_51_00-13036111499325979556?project=apache-beam-testing
Worker logs: https://console.cloud.google.com/dataflow/jobs/us-central1/2020-08-16_17_02_53-923892069514823040?project=apache-beam-testing
Worker logs: https://console.cloud.google.com/dataflow/jobs/us-central1/2020-08-16_17_10_49-4350792244373642669?project=apache-beam-testing
Worker logs: https://console.cloud.google.com/dataflow/jobs/us-central1/2020-08-16_17_18_14-8692573255859819793?project=apache-beam-testing
Worker logs: https://console.cloud.google.com/dataflow/jobs/us-central1/2020-08-16_17_25_09-3215623499383196018?project=apache-beam-testing
Worker logs: https://console.cloud.google.com/dataflow/jobs/us-central1/2020-08-16_17_32_02-5216943840522071608?project=apache-beam-testing
Worker logs: https://console.cloud.google.com/dataflow/jobs/us-central1/2020-08-16_17_39_37-15764763610906820420?project=apache-beam-testing
Worker logs: https://console.cloud.google.com/dataflow/jobs/us-central1/2020-08-16_17_02_52-12693848953131613440?project=apache-beam-testing
Worker logs: https://console.cloud.google.com/dataflow/jobs/us-central1/2020-08-16_17_19_57-10629428035894046560?project=apache-beam-testing
Worker logs: https://console.cloud.google.com/dataflow/jobs/us-central1/2020-08-16_17_27_53-1519651388669688343?project=apache-beam-testing
Worker logs: https://console.cloud.google.com/dataflow/jobs/us-central1/2020-08-16_17_35_17-2073170089260081749?project=apache-beam-testing
Worker logs: https://console.cloud.google.com/dataflow/jobs/us-central1/2020-08-16_17_42_26-3980828217160640718?project=apache-beam-testing
Worker logs: https://console.cloud.google.com/dataflow/jobs/us-central1/2020-08-16_17_02_53-11240381908758701072?project=apache-beam-testing
Worker logs: https://console.cloud.google.com/dataflow/jobs/us-central1/2020-08-16_17_10_43-8438324651697591137?project=apache-beam-testing
Worker logs: https://console.cloud.google.com/dataflow/jobs/us-central1/2020-08-16_17_18_46-2742419711708180045?project=apache-beam-testing
Worker logs: https://console.cloud.google.com/dataflow/jobs/us-central1/2020-08-16_17_26_09-9735000967724747394?project=apache-beam-testing
Worker logs: https://console.cloud.google.com/dataflow/jobs/us-central1/2020-08-16_17_34_10-18340613571672327609?project=apache-beam-testing
Worker logs: https://console.cloud.google.com/dataflow/jobs/us-central1/2020-08-16_17_41_34-1196226002031252234?project=apache-beam-testing
Worker logs: https://console.cloud.google.com/dataflow/jobs/us-central1/2020-08-16_17_02_54-10692583158662591160?project=apache-beam-testing
Worker logs: https://console.cloud.google.com/dataflow/jobs/us-central1/2020-08-16_17_10_40-16080165229660200582?project=apache-beam-testing
Worker logs: https://console.cloud.google.com/dataflow/jobs/us-central1/2020-08-16_17_17_54-8094294301690784076?project=apache-beam-testing
Worker logs: https://console.cloud.google.com/dataflow/jobs/us-central1/2020-08-16_17_25_29-4539292049139792279?project=apache-beam-testing
Worker logs: https://console.cloud.google.com/dataflow/jobs/us-central1/2020-08-16_17_32_48-5675168987817430289?project=apache-beam-testing
Worker logs: https://console.cloud.google.com/dataflow/jobs/us-central1/2020-08-16_17_39_33-1084442588012697068?project=apache-beam-testing
Worker logs: https://console.cloud.google.com/dataflow/jobs/us-central1/2020-08-16_17_02_51-11165406862503273322?project=apache-beam-testing
Worker logs: https://console.cloud.google.com/dataflow/jobs/us-central1/2020-08-16_17_10_58-8320176444431885644?project=apache-beam-testing
Worker logs: https://console.cloud.google.com/dataflow/jobs/us-central1/2020-08-16_17_11_30-3711049002346121419?project=apache-beam-testing
Worker logs: https://console.cloud.google.com/dataflow/jobs/us-central1/2020-08-16_17_19_12-15355299681874566072?project=apache-beam-testing
Worker logs: https://console.cloud.google.com/dataflow/jobs/us-central1/2020-08-16_17_26_52-4823648990039949419?project=apache-beam-testing
Worker logs: https://console.cloud.google.com/dataflow/jobs/us-central1/2020-08-16_17_33_41-15836622248867048235?project=apache-beam-testing
Worker logs: https://console.cloud.google.com/dataflow/jobs/us-central1/2020-08-16_17_41_25-5722391388977096748?project=apache-beam-testing
Worker logs: https://console.cloud.google.com/dataflow/jobs/us-central1/2020-08-16_17_02_53-8598911045931417607?project=apache-beam-testing
Worker logs: https://console.cloud.google.com/dataflow/jobs/us-central1/2020-08-16_17_11_51-17971446844684260477?project=apache-beam-testing
Worker logs: https://console.cloud.google.com/dataflow/jobs/us-central1/2020-08-16_17_21_17-3416837983009866678?project=apache-beam-testing
Worker logs: https://console.cloud.google.com/dataflow/jobs/us-central1/2020-08-16_17_21_45-3426810319255603634?project=apache-beam-testing
Worker logs: https://console.cloud.google.com/dataflow/jobs/us-central1/2020-08-16_17_28_47-4395858767774280366?project=apache-beam-testing
Worker logs: https://console.cloud.google.com/dataflow/jobs/us-central1/2020-08-16_17_30_55-12999101192049619602?project=apache-beam-testing
Worker logs: https://console.cloud.google.com/dataflow/jobs/us-central1/2020-08-16_17_38_34-4770907757730731875?project=apache-beam-testing
Worker logs: https://console.cloud.google.com/dataflow/jobs/us-central1/2020-08-16_17_46_11-9375499353574257854?project=apache-beam-testing
> Task :sdks:python:test-suites:dataflow:py2:postCommitIT FAILED
FAILURE: Build completed with 2 failures.
1: Task failed with an exception.
-----------
* Where:
Build file '<https://ci-beam.apache.org/job/beam_PostCommit_Python2/ws/src/sdks/python/test-suites/direct/py2/build.gradle'> line: 50
* What went wrong:
Execution failed for task ':sdks:python:test-suites:direct:py2:directRunnerIT'.
> Process 'command 'sh'' finished with non-zero exit value 1
* Try:
Run with --stacktrace option to get the stack trace. Run with --info or --debug option to get more log output. Run with --scan to get full insights.
==============================================================================
2: Task failed with an exception.
-----------
* Where:
Script '<https://ci-beam.apache.org/job/beam_PostCommit_Python2/ws/src/sdks/python/test-suites/dataflow/common.gradle'> line: 116
* What went wrong:
Execution failed for task ':sdks:python:test-suites:dataflow:py2:postCommitIT'.
> Process 'command 'sh'' finished with non-zero exit value 1
* Try:
Run with --stacktrace option to get the stack trace. Run with --info or --debug option to get more log output. Run with --scan to get full insights.
==============================================================================
* Get more help at https://help.gradle.org
Deprecated Gradle features were used in this build, making it incompatible with Gradle 6.0.
Use '--warning-mode all' to show the individual deprecation warnings.
See https://docs.gradle.org/5.2.1/userguide/command_line_interface.html#sec:command_line_warnings
BUILD FAILED in 57m 26s
159 actionable tasks: 122 executed, 35 from cache, 2 up-to-date
Publishing build scan...
https://gradle.com/s/wpqwkggtfeaig
Build step 'Invoke Gradle script' changed build result to FAILURE
Build step 'Invoke Gradle script' marked build as failure
---------------------------------------------------------------------
To unsubscribe, e-mail: builds-unsubscribe@beam.apache.org
For additional commands, e-mail: builds-help@beam.apache.org