You are viewing a plain text version of this content. The canonical link for it is here.
Posted to dev@kafka.apache.org by Apache Jenkins Server <je...@builds.apache.org> on 2019/01/23 23:35:50 UTC

Build failed in Jenkins: kafka-2.1-jdk8 #113

See <https://builds.apache.org/job/kafka-2.1-jdk8/113/display/redirect?page=changes>

Changes:

[me] KAFKA-5117: Stop resolving externalized configs in Connect REST API

------------------------------------------
[...truncated 2.84 MB...]
org.apache.kafka.connect.runtime.standalone.StandaloneHerderTest > testRestartTask STARTED

org.apache.kafka.connect.runtime.standalone.StandaloneHerderTest > testRestartTask PASSED

org.apache.kafka.connect.runtime.standalone.StandaloneHerderTest > testAccessors STARTED

org.apache.kafka.connect.runtime.standalone.StandaloneHerderTest > testAccessors PASSED

org.apache.kafka.connect.runtime.standalone.StandaloneHerderTest > testRestartConnectorFailureOnStart STARTED

org.apache.kafka.connect.runtime.standalone.StandaloneHerderTest > testRestartConnectorFailureOnStart PASSED

org.apache.kafka.connect.runtime.standalone.StandaloneHerderTest > testCreateAndStop STARTED

org.apache.kafka.connect.runtime.standalone.StandaloneHerderTest > testCreateAndStop PASSED

org.apache.kafka.connect.runtime.standalone.StandaloneHerderTest > testPutConnectorConfig STARTED

org.apache.kafka.connect.runtime.standalone.StandaloneHerderTest > testPutConnectorConfig PASSED

org.apache.kafka.connect.runtime.standalone.StandaloneHerderTest > testPutTaskConfigs STARTED

org.apache.kafka.connect.runtime.standalone.StandaloneHerderTest > testPutTaskConfigs PASSED

org.apache.kafka.connect.runtime.WorkerTest > testStartAndStopConnector STARTED

org.apache.kafka.connect.runtime.WorkerTest > testStartAndStopConnector PASSED

org.apache.kafka.connect.runtime.WorkerTest > testStartConnectorFailure STARTED

org.apache.kafka.connect.runtime.WorkerTest > testStartConnectorFailure PASSED

org.apache.kafka.connect.runtime.WorkerTest > testAddConnectorByAlias STARTED

org.apache.kafka.connect.runtime.WorkerTest > testAddConnectorByAlias PASSED

org.apache.kafka.connect.runtime.WorkerTest > testAddConnectorByShortAlias STARTED

org.apache.kafka.connect.runtime.WorkerTest > testAddConnectorByShortAlias PASSED

org.apache.kafka.connect.runtime.WorkerTest > testStopInvalidConnector STARTED

org.apache.kafka.connect.runtime.WorkerTest > testStopInvalidConnector PASSED

org.apache.kafka.connect.runtime.WorkerTest > testReconfigureConnectorTasks STARTED

org.apache.kafka.connect.runtime.WorkerTest > testReconfigureConnectorTasks PASSED

org.apache.kafka.connect.runtime.WorkerTest > testAddRemoveTask STARTED

org.apache.kafka.connect.runtime.WorkerTest > testAddRemoveTask PASSED

org.apache.kafka.connect.runtime.WorkerTest > testStartTaskFailure STARTED

org.apache.kafka.connect.runtime.WorkerTest > testStartTaskFailure PASSED

org.apache.kafka.connect.runtime.WorkerTest > testCleanupTasksOnStop STARTED

org.apache.kafka.connect.runtime.WorkerTest > testCleanupTasksOnStop PASSED

org.apache.kafka.connect.runtime.WorkerTest > testConverterOverrides STARTED

org.apache.kafka.connect.runtime.WorkerTest > testConverterOverrides PASSED

org.apache.kafka.connect.runtime.isolation.PluginDescTest > testPluginDescWithNullVersion STARTED

org.apache.kafka.connect.runtime.isolation.PluginDescTest > testPluginDescWithNullVersion PASSED

org.apache.kafka.connect.runtime.isolation.PluginDescTest > testPluginDescComparison STARTED

org.apache.kafka.connect.runtime.isolation.PluginDescTest > testPluginDescComparison PASSED

org.apache.kafka.connect.runtime.isolation.PluginDescTest > testRegularPluginDesc STARTED

org.apache.kafka.connect.runtime.isolation.PluginDescTest > testRegularPluginDesc PASSED

org.apache.kafka.connect.runtime.isolation.PluginDescTest > testPluginDescEquality STARTED

org.apache.kafka.connect.runtime.isolation.PluginDescTest > testPluginDescEquality PASSED

org.apache.kafka.connect.runtime.isolation.PluginDescTest > testPluginDescWithSystemClassLoader STARTED

org.apache.kafka.connect.runtime.isolation.PluginDescTest > testPluginDescWithSystemClassLoader PASSED

org.apache.kafka.connect.runtime.isolation.DelegatingClassLoaderTest > testWhiteListedManifestResources STARTED

org.apache.kafka.connect.runtime.isolation.DelegatingClassLoaderTest > testWhiteListedManifestResources PASSED

org.apache.kafka.connect.runtime.isolation.DelegatingClassLoaderTest > testOtherResources STARTED

org.apache.kafka.connect.runtime.isolation.DelegatingClassLoaderTest > testOtherResources PASSED

org.apache.kafka.connect.runtime.isolation.PluginsTest > shouldInstantiateAndConfigureConnectRestExtension STARTED

org.apache.kafka.connect.runtime.isolation.PluginsTest > shouldInstantiateAndConfigureConnectRestExtension PASSED

org.apache.kafka.connect.runtime.isolation.PluginsTest > shouldInstantiateAndConfigureConverters STARTED

org.apache.kafka.connect.runtime.isolation.PluginsTest > shouldInstantiateAndConfigureConverters PASSED

org.apache.kafka.connect.runtime.isolation.PluginsTest > shouldInstantiateAndConfigureInternalConverters STARTED

org.apache.kafka.connect.runtime.isolation.PluginsTest > shouldInstantiateAndConfigureInternalConverters PASSED

org.apache.kafka.connect.runtime.isolation.PluginsTest > shouldInstantiateAndConfigureDefaultHeaderConverter STARTED

org.apache.kafka.connect.runtime.isolation.PluginsTest > shouldInstantiateAndConfigureDefaultHeaderConverter PASSED

org.apache.kafka.connect.runtime.isolation.PluginsTest > shouldInstantiateAndConfigureExplicitlySetHeaderConverterWithCurrentClassLoader STARTED

org.apache.kafka.connect.runtime.isolation.PluginsTest > shouldInstantiateAndConfigureExplicitlySetHeaderConverterWithCurrentClassLoader PASSED

org.apache.kafka.connect.runtime.isolation.PluginUtilsTest > testPluginUrlsWithRelativeSymlinkForwards STARTED

org.apache.kafka.connect.runtime.isolation.PluginUtilsTest > testPluginUrlsWithRelativeSymlinkForwards PASSED

org.apache.kafka.connect.runtime.isolation.PluginUtilsTest > testOrderOfPluginUrlsWithJars STARTED

org.apache.kafka.connect.runtime.isolation.PluginUtilsTest > testOrderOfPluginUrlsWithJars PASSED

org.apache.kafka.connect.runtime.isolation.PluginUtilsTest > testPluginUrlsWithClasses STARTED

org.apache.kafka.connect.runtime.isolation.PluginUtilsTest > testPluginUrlsWithClasses PASSED

org.apache.kafka.connect.runtime.isolation.PluginUtilsTest > testConnectFrameworkClasses STARTED

org.apache.kafka.connect.runtime.isolation.PluginUtilsTest > testConnectFrameworkClasses PASSED

org.apache.kafka.connect.runtime.isolation.PluginUtilsTest > testThirdPartyClasses STARTED

org.apache.kafka.connect.runtime.isolation.PluginUtilsTest > testThirdPartyClasses PASSED

org.apache.kafka.connect.runtime.isolation.PluginUtilsTest > testClientConfigProvider STARTED

org.apache.kafka.connect.runtime.isolation.PluginUtilsTest > testClientConfigProvider PASSED

org.apache.kafka.connect.runtime.isolation.PluginUtilsTest > testAllowedConnectFrameworkClasses STARTED

org.apache.kafka.connect.runtime.isolation.PluginUtilsTest > testAllowedConnectFrameworkClasses PASSED

org.apache.kafka.connect.runtime.isolation.PluginUtilsTest > testJavaLibraryClasses STARTED

org.apache.kafka.connect.runtime.isolation.PluginUtilsTest > testJavaLibraryClasses PASSED

org.apache.kafka.connect.runtime.isolation.PluginUtilsTest > testEmptyPluginUrls STARTED

org.apache.kafka.connect.runtime.isolation.PluginUtilsTest > testEmptyPluginUrls PASSED

org.apache.kafka.connect.runtime.isolation.PluginUtilsTest > testPluginUrlsWithJars STARTED

org.apache.kafka.connect.runtime.isolation.PluginUtilsTest > testPluginUrlsWithJars PASSED

org.apache.kafka.connect.runtime.isolation.PluginUtilsTest > testPluginUrlsWithZips STARTED

org.apache.kafka.connect.runtime.isolation.PluginUtilsTest > testPluginUrlsWithZips PASSED

org.apache.kafka.connect.runtime.isolation.PluginUtilsTest > testPluginUrlsWithRelativeSymlinkBackwards STARTED

org.apache.kafka.connect.runtime.isolation.PluginUtilsTest > testPluginUrlsWithRelativeSymlinkBackwards PASSED

org.apache.kafka.connect.runtime.isolation.PluginUtilsTest > testPluginUrlsWithAbsoluteSymlink STARTED

org.apache.kafka.connect.runtime.isolation.PluginUtilsTest > testPluginUrlsWithAbsoluteSymlink PASSED

org.apache.kafka.connect.runtime.isolation.PluginUtilsTest > testEmptyStructurePluginUrls STARTED

org.apache.kafka.connect.runtime.isolation.PluginUtilsTest > testEmptyStructurePluginUrls PASSED

org.apache.kafka.connect.runtime.TransformationConfigTest > testEmbeddedConfigCast STARTED

org.apache.kafka.connect.runtime.TransformationConfigTest > testEmbeddedConfigCast PASSED

org.apache.kafka.connect.runtime.TransformationConfigTest > testEmbeddedConfigRegexRouter STARTED

org.apache.kafka.connect.runtime.TransformationConfigTest > testEmbeddedConfigRegexRouter PASSED

org.apache.kafka.connect.runtime.TransformationConfigTest > testEmbeddedConfigSetSchemaMetadata STARTED

org.apache.kafka.connect.runtime.TransformationConfigTest > testEmbeddedConfigSetSchemaMetadata PASSED

org.apache.kafka.connect.runtime.TransformationConfigTest > testEmbeddedConfigTimestampConverter STARTED

org.apache.kafka.connect.runtime.TransformationConfigTest > testEmbeddedConfigTimestampConverter PASSED

org.apache.kafka.connect.runtime.TransformationConfigTest > testEmbeddedConfigHoistField STARTED

org.apache.kafka.connect.runtime.TransformationConfigTest > testEmbeddedConfigHoistField PASSED

org.apache.kafka.connect.runtime.TransformationConfigTest > testEmbeddedConfigMaskField STARTED

org.apache.kafka.connect.runtime.TransformationConfigTest > testEmbeddedConfigMaskField PASSED

org.apache.kafka.connect.runtime.TransformationConfigTest > testEmbeddedConfigInsertField STARTED

org.apache.kafka.connect.runtime.TransformationConfigTest > testEmbeddedConfigInsertField PASSED

org.apache.kafka.connect.runtime.TransformationConfigTest > testEmbeddedConfigFlatten STARTED

org.apache.kafka.connect.runtime.TransformationConfigTest > testEmbeddedConfigFlatten PASSED

org.apache.kafka.connect.runtime.TransformationConfigTest > testEmbeddedConfigReplaceField STARTED

org.apache.kafka.connect.runtime.TransformationConfigTest > testEmbeddedConfigReplaceField PASSED

org.apache.kafka.connect.runtime.TransformationConfigTest > testEmbeddedConfigTimestampRouter STARTED

org.apache.kafka.connect.runtime.TransformationConfigTest > testEmbeddedConfigTimestampRouter PASSED

org.apache.kafka.connect.runtime.TransformationConfigTest > testEmbeddedConfigValueToKey STARTED

org.apache.kafka.connect.runtime.TransformationConfigTest > testEmbeddedConfigValueToKey PASSED

org.apache.kafka.connect.runtime.TransformationConfigTest > testEmbeddedConfigExtractField STARTED

org.apache.kafka.connect.runtime.TransformationConfigTest > testEmbeddedConfigExtractField PASSED

380 tests completed, 1 failed

> Task :connect:runtime:test FAILED

FAILURE: Build failed with an exception.

* What went wrong:
Execution failed for task ':connect:runtime:test'.
> There were failing tests. See the report at: file://<https://builds.apache.org/job/kafka-2.1-jdk8/ws/connect/runtime/build/reports/tests/test/index.html>

* Try:
Run with --stacktrace option to get the stack trace. Run with --info or --debug option to get more log output. Run with --scan to get full insights.

* Get more help at https://help.gradle.org

BUILD FAILED in 4h 20m 56s
135 actionable tasks: 99 executed, 36 up-to-date
Build step 'Execute shell' marked build as failure
[FINDBUGS] Collecting findbugs analysis files...
Setting GRADLE_4_8_1_HOME=/home/jenkins/tools/gradle/4.8.1
[FINDBUGS] Searching for all files in <https://builds.apache.org/job/kafka-2.1-jdk8/ws/> that match the pattern **/build/reports/findbugs/*.xml
[FINDBUGS] No files found. Configuration error?
Setting GRADLE_4_8_1_HOME=/home/jenkins/tools/gradle/4.8.1
Setting GRADLE_4_8_1_HOME=/home/jenkins/tools/gradle/4.8.1
<Git Blamer> Using GitBlamer to create author and commit information for all warnings.
<Git Blamer> GIT_COMMIT=265b58bd11dfbd8014ccabe320589f7163a82925, workspace=<https://builds.apache.org/job/kafka-2.1-jdk8/ws/>
[FINDBUGS] Computing warning deltas based on reference build #96
Recording test results
Setting GRADLE_4_8_1_HOME=/home/jenkins/tools/gradle/4.8.1
Setting GRADLE_4_8_1_HOME=/home/jenkins/tools/gradle/4.8.1
Not sending mail to unregistered user ismael@juma.me.uk
Not sending mail to unregistered user manikumar.reddy@gmail.com
Not sending mail to unregistered user wangguoz@gmail.com

Jenkins build is back to normal : kafka-2.1-jdk8 #116

Posted by Apache Jenkins Server <je...@builds.apache.org>.
See <https://builds.apache.org/job/kafka-2.1-jdk8/116/display/redirect?page=changes>


Build failed in Jenkins: kafka-2.1-jdk8 #115

Posted by Apache Jenkins Server <je...@builds.apache.org>.
See <https://builds.apache.org/job/kafka-2.1-jdk8/115/display/redirect?page=changes>

Changes:

[jason] KAFKA-7692; Fix ProducerStateManager SequenceNumber overflow (#5990)

[jason] KAFKA-7693; Fix SequenceNumber overflow in producer (#5989)

------------------------------------------
[...truncated 1.63 MB...]
org.apache.kafka.connect.runtime.rest.resources.ConnectorsResourceTest > testPutConnectorConfigWithControlSequenceInName STARTED

org.apache.kafka.connect.runtime.rest.resources.ConnectorsResourceTest > testPutConnectorConfigWithControlSequenceInName PASSED

org.apache.kafka.connect.runtime.rest.resources.ConnectorsResourceTest > testPutConnectorConfigNameMismatch STARTED

org.apache.kafka.connect.runtime.rest.resources.ConnectorsResourceTest > testPutConnectorConfigNameMismatch PASSED

org.apache.kafka.connect.runtime.rest.resources.ConnectorsResourceTest > testCreateConnectorConfigNameMismatch STARTED

org.apache.kafka.connect.runtime.rest.resources.ConnectorsResourceTest > testCreateConnectorConfigNameMismatch PASSED

org.apache.kafka.connect.runtime.rest.resources.ConnectorsResourceTest > testGetConnectorTaskConfigs STARTED

org.apache.kafka.connect.runtime.rest.resources.ConnectorsResourceTest > testGetConnectorTaskConfigs PASSED

org.apache.kafka.connect.runtime.rest.resources.ConnectorsResourceTest > testRestartConnectorLeaderRedirect STARTED

org.apache.kafka.connect.runtime.rest.resources.ConnectorsResourceTest > testRestartConnectorLeaderRedirect PASSED

org.apache.kafka.connect.runtime.rest.resources.ConnectorsResourceTest > testRestartConnectorOwnerRedirect STARTED

org.apache.kafka.connect.runtime.rest.resources.ConnectorsResourceTest > testRestartConnectorOwnerRedirect PASSED

org.apache.kafka.connect.runtime.rest.resources.ConnectorsResourceTest > testRestartTaskNotFound STARTED

org.apache.kafka.connect.runtime.rest.resources.ConnectorsResourceTest > testRestartTaskNotFound PASSED

org.apache.kafka.connect.runtime.rest.resources.ConnectorsResourceTest > testRestartTaskLeaderRedirect STARTED

org.apache.kafka.connect.runtime.rest.resources.ConnectorsResourceTest > testRestartTaskLeaderRedirect PASSED

org.apache.kafka.connect.runtime.rest.resources.ConnectorsResourceTest > testRestartTaskOwnerRedirect STARTED

org.apache.kafka.connect.runtime.rest.resources.ConnectorsResourceTest > testRestartTaskOwnerRedirect PASSED

org.apache.kafka.connect.runtime.rest.resources.ConnectorsResourceTest > testListConnectorsNotLeader STARTED

org.apache.kafka.connect.runtime.rest.resources.ConnectorsResourceTest > testListConnectorsNotLeader PASSED

org.apache.kafka.connect.runtime.rest.resources.ConnectorsResourceTest > testCreateConnector STARTED

org.apache.kafka.connect.runtime.rest.resources.ConnectorsResourceTest > testCreateConnector PASSED

org.apache.kafka.connect.runtime.rest.resources.RootResourceTest > testRootGet STARTED

org.apache.kafka.connect.runtime.rest.resources.RootResourceTest > testRootGet PASSED

org.apache.kafka.connect.runtime.isolation.DelegatingClassLoaderTest > testWhiteListedManifestResources STARTED

org.apache.kafka.connect.runtime.isolation.DelegatingClassLoaderTest > testWhiteListedManifestResources PASSED

org.apache.kafka.connect.runtime.isolation.DelegatingClassLoaderTest > testOtherResources STARTED

org.apache.kafka.connect.runtime.isolation.DelegatingClassLoaderTest > testOtherResources PASSED

org.apache.kafka.connect.runtime.isolation.PluginDescTest > testPluginDescWithNullVersion STARTED

org.apache.kafka.connect.runtime.isolation.PluginDescTest > testPluginDescWithNullVersion PASSED

org.apache.kafka.connect.runtime.isolation.PluginDescTest > testPluginDescComparison STARTED

org.apache.kafka.connect.runtime.isolation.PluginDescTest > testPluginDescComparison PASSED

org.apache.kafka.connect.runtime.isolation.PluginDescTest > testRegularPluginDesc STARTED

org.apache.kafka.connect.runtime.isolation.PluginDescTest > testRegularPluginDesc PASSED

org.apache.kafka.connect.runtime.isolation.PluginDescTest > testPluginDescEquality STARTED

org.apache.kafka.connect.runtime.isolation.PluginDescTest > testPluginDescEquality PASSED

org.apache.kafka.connect.runtime.isolation.PluginDescTest > testPluginDescWithSystemClassLoader STARTED

org.apache.kafka.connect.runtime.isolation.PluginDescTest > testPluginDescWithSystemClassLoader PASSED

org.apache.kafka.connect.runtime.isolation.PluginsTest > shouldInstantiateAndConfigureConnectRestExtension STARTED

org.apache.kafka.connect.runtime.isolation.PluginsTest > shouldInstantiateAndConfigureConnectRestExtension PASSED

org.apache.kafka.connect.runtime.isolation.PluginsTest > shouldInstantiateAndConfigureConverters STARTED

org.apache.kafka.connect.runtime.isolation.PluginsTest > shouldInstantiateAndConfigureConverters PASSED

org.apache.kafka.connect.runtime.isolation.PluginsTest > shouldInstantiateAndConfigureInternalConverters STARTED

org.apache.kafka.connect.runtime.isolation.PluginsTest > shouldInstantiateAndConfigureInternalConverters PASSED

org.apache.kafka.connect.runtime.isolation.PluginsTest > shouldInstantiateAndConfigureDefaultHeaderConverter STARTED

org.apache.kafka.connect.runtime.isolation.PluginsTest > shouldInstantiateAndConfigureDefaultHeaderConverter PASSED

org.apache.kafka.connect.runtime.isolation.PluginsTest > shouldInstantiateAndConfigureExplicitlySetHeaderConverterWithCurrentClassLoader STARTED

org.apache.kafka.connect.runtime.isolation.PluginsTest > shouldInstantiateAndConfigureExplicitlySetHeaderConverterWithCurrentClassLoader PASSED

org.apache.kafka.connect.runtime.isolation.PluginUtilsTest > testPluginUrlsWithRelativeSymlinkForwards STARTED

org.apache.kafka.connect.runtime.isolation.PluginUtilsTest > testPluginUrlsWithRelativeSymlinkForwards PASSED

org.apache.kafka.connect.runtime.isolation.PluginUtilsTest > testOrderOfPluginUrlsWithJars STARTED

org.apache.kafka.connect.runtime.isolation.PluginUtilsTest > testOrderOfPluginUrlsWithJars PASSED

org.apache.kafka.connect.runtime.isolation.PluginUtilsTest > testPluginUrlsWithClasses STARTED

org.apache.kafka.connect.runtime.isolation.PluginUtilsTest > testPluginUrlsWithClasses PASSED

org.apache.kafka.connect.runtime.isolation.PluginUtilsTest > testConnectFrameworkClasses STARTED

org.apache.kafka.connect.runtime.isolation.PluginUtilsTest > testConnectFrameworkClasses PASSED

org.apache.kafka.connect.runtime.isolation.PluginUtilsTest > testThirdPartyClasses STARTED

org.apache.kafka.connect.runtime.isolation.PluginUtilsTest > testThirdPartyClasses PASSED

org.apache.kafka.connect.runtime.isolation.PluginUtilsTest > testClientConfigProvider STARTED

org.apache.kafka.connect.runtime.isolation.PluginUtilsTest > testClientConfigProvider PASSED

org.apache.kafka.connect.runtime.isolation.PluginUtilsTest > testAllowedConnectFrameworkClasses STARTED

org.apache.kafka.connect.runtime.isolation.PluginUtilsTest > testAllowedConnectFrameworkClasses PASSED

org.apache.kafka.connect.runtime.isolation.PluginUtilsTest > testJavaLibraryClasses STARTED

org.apache.kafka.connect.runtime.isolation.PluginUtilsTest > testJavaLibraryClasses PASSED

org.apache.kafka.connect.runtime.isolation.PluginUtilsTest > testEmptyPluginUrls STARTED

org.apache.kafka.connect.runtime.isolation.PluginUtilsTest > testEmptyPluginUrls PASSED

org.apache.kafka.connect.runtime.isolation.PluginUtilsTest > testPluginUrlsWithJars STARTED

org.apache.kafka.connect.runtime.isolation.PluginUtilsTest > testPluginUrlsWithJars PASSED

org.apache.kafka.connect.runtime.isolation.PluginUtilsTest > testPluginUrlsWithZips STARTED

org.apache.kafka.connect.runtime.isolation.PluginUtilsTest > testPluginUrlsWithZips PASSED

org.apache.kafka.connect.runtime.isolation.PluginUtilsTest > testPluginUrlsWithRelativeSymlinkBackwards STARTED

org.apache.kafka.connect.runtime.isolation.PluginUtilsTest > testPluginUrlsWithRelativeSymlinkBackwards PASSED

org.apache.kafka.connect.runtime.isolation.PluginUtilsTest > testPluginUrlsWithAbsoluteSymlink STARTED

org.apache.kafka.connect.runtime.isolation.PluginUtilsTest > testPluginUrlsWithAbsoluteSymlink PASSED

org.apache.kafka.connect.runtime.isolation.PluginUtilsTest > testEmptyStructurePluginUrls STARTED

org.apache.kafka.connect.runtime.isolation.PluginUtilsTest > testEmptyStructurePluginUrls PASSED

org.apache.kafka.connect.runtime.WorkerSinkTaskTest > testErrorInRebalancePartitionRevocation STARTED

org.apache.kafka.connect.runtime.WorkerSinkTaskTest > testErrorInRebalancePartitionRevocation PASSED

org.apache.kafka.connect.runtime.WorkerSinkTaskTest > testErrorInRebalancePartitionAssignment STARTED

org.apache.kafka.connect.runtime.WorkerSinkTaskTest > testErrorInRebalancePartitionAssignment PASSED

org.apache.kafka.connect.runtime.WorkerSinkTaskTest > testWakeupInCommitSyncCausesRetry STARTED

org.apache.kafka.connect.runtime.WorkerSinkTaskTest > testWakeupInCommitSyncCausesRetry PASSED

org.apache.kafka.connect.runtime.WorkerSinkTaskTest > testRequestCommit STARTED

org.apache.kafka.connect.runtime.WorkerSinkTaskTest > testRequestCommit PASSED

org.apache.kafka.connect.runtime.WorkerSinkTaskTest > testIgnoredCommit STARTED

org.apache.kafka.connect.runtime.WorkerSinkTaskTest > testIgnoredCommit PASSED

org.apache.kafka.connect.runtime.WorkerSinkTaskTest > testLongRunningCommitWithoutTimeout STARTED

org.apache.kafka.connect.runtime.WorkerSinkTaskTest > testLongRunningCommitWithoutTimeout PASSED

org.apache.kafka.connect.runtime.WorkerSinkTaskTest > testCommitWithOutOfOrderCallback STARTED

org.apache.kafka.connect.runtime.WorkerSinkTaskTest > testCommitWithOutOfOrderCallback PASSED

org.apache.kafka.connect.runtime.WorkerSinkTaskTest > testPreCommit STARTED

org.apache.kafka.connect.runtime.WorkerSinkTaskTest > testPreCommit PASSED

org.apache.kafka.connect.runtime.WorkerSinkTaskTest > testPollRedelivery STARTED

org.apache.kafka.connect.runtime.WorkerSinkTaskTest > testPollRedelivery PASSED

org.apache.kafka.connect.runtime.WorkerSinkTaskTest > testMetricsGroup STARTED

org.apache.kafka.connect.runtime.WorkerSinkTaskTest > testMetricsGroup PASSED

org.apache.kafka.connect.runtime.WorkerSinkTaskTest > testDeliveryWithMutatingTransform STARTED

org.apache.kafka.connect.runtime.WorkerSinkTaskTest > testDeliveryWithMutatingTransform PASSED

org.apache.kafka.connect.runtime.WorkerSinkTaskTest > testMissingTimestampPropagation STARTED

org.apache.kafka.connect.runtime.WorkerSinkTaskTest > testMissingTimestampPropagation PASSED

org.apache.kafka.connect.runtime.WorkerSinkTaskTest > testTimestampPropagation STARTED

org.apache.kafka.connect.runtime.WorkerSinkTaskTest > testTimestampPropagation PASSED

org.apache.kafka.connect.runtime.WorkerSinkTaskTest > testTopicsRegex STARTED

org.apache.kafka.connect.runtime.WorkerSinkTaskTest > testTopicsRegex PASSED

org.apache.kafka.connect.runtime.WorkerSinkTaskTest > testStartPaused STARTED

org.apache.kafka.connect.runtime.WorkerSinkTaskTest > testStartPaused PASSED

org.apache.kafka.connect.runtime.WorkerSinkTaskTest > testPause STARTED

org.apache.kafka.connect.runtime.WorkerSinkTaskTest > testPause PASSED

380 tests completed, 1 failed

> Task :connect:runtime:test FAILED

FAILURE: Build failed with an exception.

* What went wrong:
Execution failed for task ':connect:runtime:test'.
> There were failing tests. See the report at: file://<https://builds.apache.org/job/kafka-2.1-jdk8/ws/connect/runtime/build/reports/tests/test/index.html>

* Try:
Run with --stacktrace option to get the stack trace. Run with --info or --debug option to get more log output. Run with --scan to get full insights.

* Get more help at https://help.gradle.org

BUILD FAILED in 4h 32m 21s
133 actionable tasks: 97 executed, 36 up-to-date
Build step 'Execute shell' marked build as failure
[FINDBUGS] Collecting findbugs analysis files...
Setting GRADLE_4_8_1_HOME=/home/jenkins/tools/gradle/4.8.1
[FINDBUGS] Searching for all files in <https://builds.apache.org/job/kafka-2.1-jdk8/ws/> that match the pattern **/build/reports/findbugs/*.xml
[FINDBUGS] No files found. Configuration error?
Setting GRADLE_4_8_1_HOME=/home/jenkins/tools/gradle/4.8.1
Setting GRADLE_4_8_1_HOME=/home/jenkins/tools/gradle/4.8.1
<Git Blamer> Using GitBlamer to create author and commit information for all warnings.
<Git Blamer> GIT_COMMIT=85b7d0e6b1d20dff7dfdfd77432c287c929bfccf, workspace=<https://builds.apache.org/job/kafka-2.1-jdk8/ws/>
[FINDBUGS] Computing warning deltas based on reference build #96
Recording test results
Setting GRADLE_4_8_1_HOME=/home/jenkins/tools/gradle/4.8.1
Setting GRADLE_4_8_1_HOME=/home/jenkins/tools/gradle/4.8.1
Not sending mail to unregistered user ismael@juma.me.uk
Not sending mail to unregistered user manikumar.reddy@gmail.com
Not sending mail to unregistered user wangguoz@gmail.com

Build failed in Jenkins: kafka-2.1-jdk8 #114

Posted by Apache Jenkins Server <je...@builds.apache.org>.
See <https://builds.apache.org/job/kafka-2.1-jdk8/114/display/redirect?page=changes>

Changes:

[cmccabe] MINOR: update copyright year in the NOTICE file. (#6196)

------------------------------------------
[...truncated 693.88 KB...]
kafka.api.PlaintextProducerSendTest > testSendWithInvalidCreateTime PASSED

kafka.api.PlaintextProducerSendTest > testBatchSizeZero STARTED

kafka.api.PlaintextProducerSendTest > testBatchSizeZero PASSED

kafka.api.PlaintextProducerSendTest > testWrongSerializer STARTED

kafka.api.PlaintextProducerSendTest > testWrongSerializer PASSED

kafka.api.PlaintextProducerSendTest > testSendNonCompressedMessageWithLogAppendTime STARTED

kafka.api.PlaintextProducerSendTest > testSendNonCompressedMessageWithLogAppendTime PASSED

kafka.api.PlaintextProducerSendTest > testSendNonCompressedMessageWithCreateTime STARTED

kafka.api.PlaintextProducerSendTest > testSendNonCompressedMessageWithCreateTime PASSED

kafka.api.PlaintextProducerSendTest > testClose STARTED

kafka.api.PlaintextProducerSendTest > testClose PASSED

kafka.api.PlaintextProducerSendTest > testFlush STARTED

kafka.api.PlaintextProducerSendTest > testFlush PASSED

kafka.api.PlaintextProducerSendTest > testSendToPartition STARTED

kafka.api.PlaintextProducerSendTest > testSendToPartition PASSED

kafka.api.PlaintextProducerSendTest > testSendOffset STARTED

kafka.api.PlaintextProducerSendTest > testSendOffset PASSED

kafka.api.PlaintextProducerSendTest > testSendCompressedMessageWithCreateTime STARTED

kafka.api.PlaintextProducerSendTest > testSendCompressedMessageWithCreateTime PASSED

kafka.api.PlaintextProducerSendTest > testCloseWithZeroTimeoutFromCallerThread STARTED

kafka.api.PlaintextProducerSendTest > testCloseWithZeroTimeoutFromCallerThread PASSED

kafka.api.PlaintextProducerSendTest > testCloseWithZeroTimeoutFromSenderThread STARTED

kafka.api.PlaintextProducerSendTest > testCloseWithZeroTimeoutFromSenderThread PASSED

kafka.api.PlaintextProducerSendTest > testSendBeforeAndAfterPartitionExpansion STARTED

kafka.api.PlaintextProducerSendTest > testSendBeforeAndAfterPartitionExpansion PASSED

kafka.api.TransactionsBounceTest > testBrokerFailure STARTED

kafka.api.TransactionsBounceTest > testBrokerFailure PASSED

kafka.api.ApiUtilsTest > testShortStringNonASCII STARTED

kafka.api.ApiUtilsTest > testShortStringNonASCII PASSED

kafka.api.ApiUtilsTest > testShortStringASCII STARTED

kafka.api.ApiUtilsTest > testShortStringASCII PASSED

kafka.api.LegacyAdminClientTest > testDescribeConsumerGroup STARTED

kafka.api.LegacyAdminClientTest > testDescribeConsumerGroup PASSED

kafka.api.LegacyAdminClientTest > testListGroups STARTED

kafka.api.LegacyAdminClientTest > testListGroups PASSED

kafka.api.LegacyAdminClientTest > testListAllBrokerVersionInfo STARTED

kafka.api.LegacyAdminClientTest > testListAllBrokerVersionInfo PASSED

kafka.api.LegacyAdminClientTest > testOffsetsForTimesWhenOffsetNotFound STARTED

kafka.api.LegacyAdminClientTest > testOffsetsForTimesWhenOffsetNotFound PASSED

kafka.api.LegacyAdminClientTest > testDescribeConsumerGroupForNonExistentGroup STARTED

kafka.api.LegacyAdminClientTest > testDescribeConsumerGroupForNonExistentGroup PASSED

kafka.api.LegacyAdminClientTest > testGetConsumerGroupSummary STARTED

kafka.api.LegacyAdminClientTest > testGetConsumerGroupSummary PASSED

kafka.api.AdminClientIntegrationTest > testDescribeReplicaLogDirs STARTED

kafka.api.AdminClientIntegrationTest > testDescribeReplicaLogDirs PASSED

kafka.api.AdminClientIntegrationTest > testInvalidAlterConfigs STARTED

kafka.api.AdminClientIntegrationTest > testInvalidAlterConfigs PASSED

kafka.api.AdminClientIntegrationTest > testAlterLogDirsAfterDeleteRecords STARTED

kafka.api.AdminClientIntegrationTest > testAlterLogDirsAfterDeleteRecords PASSED

kafka.api.AdminClientIntegrationTest > testConsumeAfterDeleteRecords STARTED

kafka.api.AdminClientIntegrationTest > testConsumeAfterDeleteRecords PASSED

kafka.api.AdminClientIntegrationTest > testClose STARTED

kafka.api.AdminClientIntegrationTest > testClose PASSED

kafka.api.AdminClientIntegrationTest > testReplicaCanFetchFromLogStartOffsetAfterDeleteRecords STARTED

kafka.api.AdminClientIntegrationTest > testReplicaCanFetchFromLogStartOffsetAfterDeleteRecords PASSED

kafka.api.AdminClientIntegrationTest > testMinimumRequestTimeouts STARTED

kafka.api.AdminClientIntegrationTest > testMinimumRequestTimeouts PASSED

kafka.api.AdminClientIntegrationTest > testForceClose STARTED

kafka.api.AdminClientIntegrationTest > testForceClose PASSED

kafka.api.AdminClientIntegrationTest > testListNodes STARTED

kafka.api.AdminClientIntegrationTest > testListNodes PASSED

kafka.api.AdminClientIntegrationTest > testDelayedClose STARTED

kafka.api.AdminClientIntegrationTest > testDelayedClose PASSED

kafka.api.AdminClientIntegrationTest > testCreateDeleteTopics STARTED

kafka.api.AdminClientIntegrationTest > testCreateDeleteTopics PASSED

kafka.api.AdminClientIntegrationTest > testOffsetsForTimesAfterDeleteRecords STARTED

kafka.api.AdminClientIntegrationTest > testOffsetsForTimesAfterDeleteRecords PASSED

kafka.api.AdminClientIntegrationTest > testDeleteRecordsWithException STARTED

kafka.api.AdminClientIntegrationTest > testDeleteRecordsWithException PASSED

kafka.api.AdminClientIntegrationTest > testDescribeLogDirs STARTED

kafka.api.AdminClientIntegrationTest > testDescribeLogDirs PASSED

kafka.api.AdminClientIntegrationTest > testAlterReplicaLogDirs STARTED

kafka.api.AdminClientIntegrationTest > testAlterReplicaLogDirs PASSED

kafka.api.AdminClientIntegrationTest > testLogStartOffsetCheckpoint STARTED

kafka.api.AdminClientIntegrationTest > testLogStartOffsetCheckpoint PASSED

kafka.api.AdminClientIntegrationTest > testAclOperations STARTED

kafka.api.AdminClientIntegrationTest > testAclOperations PASSED

kafka.api.AdminClientIntegrationTest > testDescribeCluster STARTED

kafka.api.AdminClientIntegrationTest > testDescribeCluster PASSED

kafka.api.AdminClientIntegrationTest > testCreatePartitions STARTED

kafka.api.AdminClientIntegrationTest > testCreatePartitions PASSED

kafka.api.AdminClientIntegrationTest > testDescribeNonExistingTopic STARTED

kafka.api.AdminClientIntegrationTest > testDescribeNonExistingTopic PASSED

kafka.api.AdminClientIntegrationTest > testMetadataRefresh STARTED

kafka.api.AdminClientIntegrationTest > testMetadataRefresh PASSED

kafka.api.AdminClientIntegrationTest > testDescribeAndAlterConfigs STARTED

kafka.api.AdminClientIntegrationTest > testDescribeAndAlterConfigs PASSED

kafka.api.AdminClientIntegrationTest > testLogStartOffsetAfterDeleteRecords STARTED

kafka.api.AdminClientIntegrationTest > testLogStartOffsetAfterDeleteRecords PASSED

kafka.api.AdminClientIntegrationTest > testSeekAfterDeleteRecords STARTED

kafka.api.AdminClientIntegrationTest > testSeekAfterDeleteRecords PASSED

kafka.api.AdminClientIntegrationTest > testCallInFlightTimeouts STARTED

kafka.api.AdminClientIntegrationTest > testCallInFlightTimeouts PASSED

kafka.api.AdminClientIntegrationTest > testDescribeConfigsForTopic STARTED

kafka.api.AdminClientIntegrationTest > testDescribeConfigsForTopic PASSED

kafka.api.AdminClientIntegrationTest > testConsumerGroups STARTED

kafka.api.AdminClientIntegrationTest > testConsumerGroups PASSED

kafka.api.SaslPlaintextConsumerTest > testCoordinatorFailover STARTED

kafka.api.SaslPlaintextConsumerTest > testCoordinatorFailover PASSED

kafka.api.SaslPlaintextConsumerTest > testSimpleConsumption STARTED

kafka.api.SaslPlaintextConsumerTest > testSimpleConsumption PASSED

kafka.api.TransactionsTest > testBasicTransactions STARTED
ERROR: Could not install GRADLE_4_8_1_HOME
java.lang.NullPointerException
ERROR: Could not install GRADLE_4_8_1_HOME
java.lang.NullPointerException
ERROR: Could not install GRADLE_4_8_1_HOME
java.lang.NullPointerException
ERROR: Could not install GRADLE_4_8_1_HOME
java.lang.NullPointerException
Build timed out (after 360 minutes). Marking the build as failed.
Build was aborted
[FINDBUGS] Collecting findbugs analysis files...
Setting GRADLE_4_8_1_HOME=/home/jenkins/tools/gradle/4.8.1
[FINDBUGS] Searching for all files in <https://builds.apache.org/job/kafka-2.1-jdk8/ws/> that match the pattern **/build/reports/findbugs/*.xml
[FINDBUGS] No files found. Configuration error?
Setting GRADLE_4_8_1_HOME=/home/jenkins/tools/gradle/4.8.1
Setting GRADLE_4_8_1_HOME=/home/jenkins/tools/gradle/4.8.1
<Git Blamer> Using GitBlamer to create author and commit information for all warnings.
<Git Blamer> GIT_COMMIT=33cda6798e95f8ae59bf67e08f161af67f59e867, workspace=<https://builds.apache.org/job/kafka-2.1-jdk8/ws/>
[FINDBUGS] Computing warning deltas based on reference build #96
Recording test results
Setting GRADLE_4_8_1_HOME=/home/jenkins/tools/gradle/4.8.1
Setting GRADLE_4_8_1_HOME=/home/jenkins/tools/gradle/4.8.1

kafka.api.TransactionsTest > testBasicTransactions SKIPPED

> Task :kafka-2.1-jdk8:core:test FAILED
> Task :testScala_2_12 FAILED

FAILURE: Build failed with an exception.

* What went wrong:
Execution failed for task ':kafka-2.1-jdk8:core:test'.
> Process 'Gradle Test Executor 7' finished with non-zero exit value 143
  This problem might be caused by incorrect test process configuration.
  Please refer to the test execution section in the user guide at https://docs.gradle.org/4.10.3/userguide/java_plugin.html#sec:test_execution

* Try:
Run with --stacktrace option to get the stack trace. Run with --info or --debug option to get more log output. Run with --scan to get full insights.

* Get more help at https://help.gradle.org

BUILD FAILED in 5h 59m 45s
27 actionable tasks: 10 executed, 17 up-to-date
Not sending mail to unregistered user ismael@juma.me.uk
Not sending mail to unregistered user manikumar.reddy@gmail.com
Not sending mail to unregistered user wangguoz@gmail.com