You are viewing a plain text version of this content. The canonical link for it is here.
Posted to builds@beam.apache.org by Apache Jenkins Server <je...@builds.apache.org> on 2020/08/26 12:09:44 UTC
Build failed in Jenkins: beam_PerformanceTests_WordCountIT_Py27
#1872
See <https://ci-beam.apache.org/job/beam_PerformanceTests_WordCountIT_Py27/1872/display/redirect?page=changes>
Changes:
[noreply] [BEAM-10675] Add Python GBK Load Tests for streaming on Dataflow
------------------------------------------
[...truncated 211.70 KB...]
"parallel_input": {
"@type": "OutputReference",
"output_name": "None",
"step_name": "s8"
},
"user_name": "Write/Write/WriteImpl/FinalizeWrite/_UnpickledSideInput(InitializeWrite.out.0)",
"windowing_strategy": "%0A%98%07%22%40%0A%1Dref_Coder_GlobalWindowCoder_1%12%1F%0A%1D%0A%1Bbeam%3Acoder%3Aglobal_window%3Av1%2A%D3%06%0A%25ref_Environment_default_environment_1%12%A9%06%12%12beam%3Aenv%3Adocker%3Av1%1A%3B%0A9gcr.io/cloud-dataflow/v1beta3/python%3Abeam-master-20200630%2A%14beam%3Acoder%3Avarint%3Av1%2A%13beam%3Acoder%3Abytes%3Av1%2A%13beam%3Acoder%3Atimer%3Av1%2A%1Bbeam%3Acoder%3Aglobal_window%3Av1%2A%1Dbeam%3Acoder%3Ainterval_window%3Av1%2A%16beam%3Acoder%3Aiterable%3Av1%2A%23beam%3Acoder%3Astate_backed_iterable%3Av1%2A%1Cbeam%3Acoder%3Awindowed_value%3Av1%2A%22beam%3Acoder%3Aparam_windowed_value%3Av1%2A%14beam%3Acoder%3Adouble%3Av1%2A%19beam%3Acoder%3Astring_utf8%3Av1%2A%1Bbeam%3Acoder%3Alength_prefix%3Av1%2A%12beam%3Acoder%3Abool%3Av1%2A%10beam%3Acoder%3Akv%3Av1%2A%11beam%3Acoder%3Arow%3Av1%2A%23beam%3Aprotocol%3Aprogress_reporting%3Av0%2A%1Ebeam%3Aprotocol%3A****_status%3Av1%2A%3Abeam%3Aversion%3Asdk_base%3Aapache/beam_python2.7_sdk%3A2.25.0.dev2%D2%01%0A%1Abeam%3Aartifact%3Atype%3Afile%3Av1%12w%0Au<https://ci-beam.apache.org/job/beam_PerformanceTests_WordCountIT_Py27/ws/src/sdks/python/build/apache-beam.tar.gz%1A%20beam%3Aartifact%3Arole%3Astaging_to%3Av1%22%19%0A%17dataflow_python_sdk.tarjx%0A%22%0A%20beam%3Awindow_fn%3Aglobal_windows%3Av1%10%01%1A%1Dref_Coder_GlobalWindowCoder_1%22%02%3A%00%28%010%018%01H%01Z%25ref_Environment_default_environment_1">
}
},
{
"kind": "CollectionToSingleton",
"name": "SideInput-s19",
"properties": {
"output_info": [
{
"encoding": {
"@type": "kind:stream",
"component_encodings": [
{
"@type": "kind:windowed_value",
"component_encodings": [
{
"@type": "FastPrimitivesCoder$<string of 176 bytes>",
"component_encodings": [
{
"@type": "FastPrimitivesCoder$<string of 176 bytes>",
"component_encodings": [],
"pipeline_proto_coder_id": "ref_Coder_FastPrimitivesCoder_5"
},
{
"@type": "FastPrimitivesCoder$<string of 176 bytes>",
"component_encodings": [],
"pipeline_proto_coder_id": "ref_Coder_FastPrimitivesCoder_5"
}
],
"is_pair_like": true,
"pipeline_proto_coder_id": "ref_Coder_FastPrimitivesCoder_5"
},
{
"@type": "kind:global_window"
}
],
"is_wrapper": true
}
],
"is_stream_like": {
"value": true
}
},
"output_name": "out",
"user_name": "Write/Write/WriteImpl/FinalizeWrite/_UnpickledSideInput(Extract.out.0).output"
}
],
"parallel_input": {
"@type": "OutputReference",
"output_name": "None",
"step_name": "s14"
},
"user_name": "Write/Write/WriteImpl/FinalizeWrite/_UnpickledSideInput(Extract.out.0)",
"windowing_strategy": "%0A%98%07%22%40%0A%1Dref_Coder_GlobalWindowCoder_1%12%1F%0A%1D%0A%1Bbeam%3Acoder%3Aglobal_window%3Av1%2A%D3%06%0A%25ref_Environment_default_environment_1%12%A9%06%12%12beam%3Aenv%3Adocker%3Av1%1A%3B%0A9gcr.io/cloud-dataflow/v1beta3/python%3Abeam-master-20200630%2A%14beam%3Acoder%3Avarint%3Av1%2A%13beam%3Acoder%3Abytes%3Av1%2A%13beam%3Acoder%3Atimer%3Av1%2A%1Bbeam%3Acoder%3Aglobal_window%3Av1%2A%1Dbeam%3Acoder%3Ainterval_window%3Av1%2A%16beam%3Acoder%3Aiterable%3Av1%2A%23beam%3Acoder%3Astate_backed_iterable%3Av1%2A%1Cbeam%3Acoder%3Awindowed_value%3Av1%2A%22beam%3Acoder%3Aparam_windowed_value%3Av1%2A%14beam%3Acoder%3Adouble%3Av1%2A%19beam%3Acoder%3Astring_utf8%3Av1%2A%1Bbeam%3Acoder%3Alength_prefix%3Av1%2A%12beam%3Acoder%3Abool%3Av1%2A%10beam%3Acoder%3Akv%3Av1%2A%11beam%3Acoder%3Arow%3Av1%2A%23beam%3Aprotocol%3Aprogress_reporting%3Av0%2A%1Ebeam%3Aprotocol%3A****_status%3Av1%2A%3Abeam%3Aversion%3Asdk_base%3Aapache/beam_python2.7_sdk%3A2.25.0.dev2%D2%01%0A%1Abeam%3Aartifact%3Atype%3Afile%3Av1%12w%0Au<https://ci-beam.apache.org/job/beam_PerformanceTests_WordCountIT_Py27/ws/src/sdks/python/build/apache-beam.tar.gz%1A%20beam%3Aartifact%3Arole%3Astaging_to%3Av1%22%19%0A%17dataflow_python_sdk.tarjx%0A%22%0A%20beam%3Awindow_fn%3Aglobal_windows%3Av1%10%01%1A%1Dref_Coder_GlobalWindowCoder_1%22%02%3A%00%28%010%018%01H%01Z%25ref_Environment_default_environment_1">
}
},
{
"kind": "CollectionToSingleton",
"name": "SideInput-s20",
"properties": {
"output_info": [
{
"encoding": {
"@type": "kind:stream",
"component_encodings": [
{
"@type": "kind:windowed_value",
"component_encodings": [
{
"@type": "FastPrimitivesCoder$<string of 176 bytes>",
"component_encodings": [
{
"@type": "FastPrimitivesCoder$<string of 176 bytes>",
"component_encodings": [],
"pipeline_proto_coder_id": "ref_Coder_FastPrimitivesCoder_5"
},
{
"@type": "FastPrimitivesCoder$<string of 176 bytes>",
"component_encodings": [],
"pipeline_proto_coder_id": "ref_Coder_FastPrimitivesCoder_5"
}
],
"is_pair_like": true,
"pipeline_proto_coder_id": "ref_Coder_FastPrimitivesCoder_5"
},
{
"@type": "kind:global_window"
}
],
"is_wrapper": true
}
],
"is_stream_like": {
"value": true
}
},
"output_name": "out",
"user_name": "Write/Write/WriteImpl/FinalizeWrite/_UnpickledSideInput(PreFinalize.out.0).output"
}
],
"parallel_input": {
"@type": "OutputReference",
"output_name": "None",
"step_name": "s17"
},
"user_name": "Write/Write/WriteImpl/FinalizeWrite/_UnpickledSideInput(PreFinalize.out.0)",
"windowing_strategy": "%0A%98%07%22%40%0A%1Dref_Coder_GlobalWindowCoder_1%12%1F%0A%1D%0A%1Bbeam%3Acoder%3Aglobal_window%3Av1%2A%D3%06%0A%25ref_Environment_default_environment_1%12%A9%06%12%12beam%3Aenv%3Adocker%3Av1%1A%3B%0A9gcr.io/cloud-dataflow/v1beta3/python%3Abeam-master-20200630%2A%14beam%3Acoder%3Avarint%3Av1%2A%13beam%3Acoder%3Abytes%3Av1%2A%13beam%3Acoder%3Atimer%3Av1%2A%1Bbeam%3Acoder%3Aglobal_window%3Av1%2A%1Dbeam%3Acoder%3Ainterval_window%3Av1%2A%16beam%3Acoder%3Aiterable%3Av1%2A%23beam%3Acoder%3Astate_backed_iterable%3Av1%2A%1Cbeam%3Acoder%3Awindowed_value%3Av1%2A%22beam%3Acoder%3Aparam_windowed_value%3Av1%2A%14beam%3Acoder%3Adouble%3Av1%2A%19beam%3Acoder%3Astring_utf8%3Av1%2A%1Bbeam%3Acoder%3Alength_prefix%3Av1%2A%12beam%3Acoder%3Abool%3Av1%2A%10beam%3Acoder%3Akv%3Av1%2A%11beam%3Acoder%3Arow%3Av1%2A%23beam%3Aprotocol%3Aprogress_reporting%3Av0%2A%1Ebeam%3Aprotocol%3A****_status%3Av1%2A%3Abeam%3Aversion%3Asdk_base%3Aapache/beam_python2.7_sdk%3A2.25.0.dev2%D2%01%0A%1Abeam%3Aartifact%3Atype%3Afile%3Av1%12w%0Au<https://ci-beam.apache.org/job/beam_PerformanceTests_WordCountIT_Py27/ws/src/sdks/python/build/apache-beam.tar.gz%1A%20beam%3Aartifact%3Arole%3Astaging_to%3Av1%22%19%0A%17dataflow_python_sdk.tarjx%0A%22%0A%20beam%3Awindow_fn%3Aglobal_windows%3Av1%10%01%1A%1Dref_Coder_GlobalWindowCoder_1%22%02%3A%00%28%010%018%01H%01Z%25ref_Environment_default_environment_1">
}
},
{
"kind": "ParallelDo",
"name": "s21",
"properties": {
"display_data": [
{
"key": "fn",
"label": "Transform Function",
"namespace": "apache_beam.transforms.core.CallableWrapperDoFn",
"type": "STRING",
"value": "_finalize_write"
},
{
"key": "fn",
"label": "Transform Function",
"namespace": "apache_beam.transforms.core.ParDo",
"shortValue": "CallableWrapperDoFn",
"type": "STRING",
"value": "apache_beam.transforms.core.CallableWrapperDoFn"
}
],
"non_parallel_inputs": {
"python_side_input0-Write/Write/WriteImpl/FinalizeWrite": {
"@type": "OutputReference",
"output_name": "out",
"step_name": "SideInput-s18"
},
"python_side_input1-Write/Write/WriteImpl/FinalizeWrite": {
"@type": "OutputReference",
"output_name": "out",
"step_name": "SideInput-s19"
},
"python_side_input2-Write/Write/WriteImpl/FinalizeWrite": {
"@type": "OutputReference",
"output_name": "out",
"step_name": "SideInput-s20"
}
},
"output_info": [
{
"encoding": {
"@type": "kind:windowed_value",
"component_encodings": [
{
"@type": "FastPrimitivesCoder$<string of 176 bytes>",
"component_encodings": [
{
"@type": "FastPrimitivesCoder$<string of 176 bytes>",
"component_encodings": [],
"pipeline_proto_coder_id": "ref_Coder_FastPrimitivesCoder_5"
},
{
"@type": "FastPrimitivesCoder$<string of 176 bytes>",
"component_encodings": [],
"pipeline_proto_coder_id": "ref_Coder_FastPrimitivesCoder_5"
}
],
"is_pair_like": true,
"pipeline_proto_coder_id": "ref_Coder_FastPrimitivesCoder_5"
},
{
"@type": "kind:global_window"
}
],
"is_wrapper": true
},
"output_name": "None",
"user_name": "Write/Write/WriteImpl/FinalizeWrite.out"
}
],
"parallel_input": {
"@type": "OutputReference",
"output_name": "out",
"step_name": "s7"
},
"serialized_fn": "<string of 3488 bytes>",
"user_name": "Write/Write/WriteImpl/FinalizeWrite/FinalizeWrite"
}
}
],
"type": "JOB_TYPE_BATCH"
}
apache_beam.runners.dataflow.internal.apiclient: INFO: Create job: <Job
createTime: u'2020-08-26T12:09:31.939549Z'
currentStateTime: u'1970-01-01T00:00:00Z'
id: u'2020-08-26_05_09_30-17025465204063484982'
location: u'us-central1'
name: u'performance-tests-wordcount-python27-batch-1gb0826100259'
projectId: u'apache-beam-testing'
stageStates: []
startTime: u'2020-08-26T12:09:31.939549Z'
steps: []
tempFiles: []
type: TypeValueValuesEnum(JOB_TYPE_BATCH, 1)>
apache_beam.runners.dataflow.internal.apiclient: INFO: Created job with id: [2020-08-26_05_09_30-17025465204063484982]
apache_beam.runners.dataflow.internal.apiclient: INFO: Submitted job: 2020-08-26_05_09_30-17025465204063484982
apache_beam.runners.dataflow.internal.apiclient: INFO: To access the Dataflow monitoring console, please navigate to https://console.cloud.google.com/dataflow/jobs/us-central1/2020-08-26_05_09_30-17025465204063484982?project=apache-beam-testing
--------------------- >> end captured logging << ---------------------
----------------------------------------------------------------------
XML: nosetests-runPerformanceTest-df-py27.xml
----------------------------------------------------------------------
XML: <https://ci-beam.apache.org/job/beam_PerformanceTests_WordCountIT_Py27/ws/src/sdks/python/nosetests.xml>
----------------------------------------------------------------------
Ran 1 test in 15.398s
FAILED (failures=1)
> Task :sdks:python:test-suites:dataflow:py2:runPerformanceTest FAILED
:sdks:python:test-suites:dataflow:py2:runPerformanceTest (Thread[Execution **** for ':',5,main]) completed. Took 17.523 secs.
FAILURE: Build failed with an exception.
* What went wrong:
Execution failed for task ':sdks:python:test-suites:dataflow:py2:runPerformanceTest'.
> Process 'command 'sh'' finished with non-zero exit value 1
* Try:
Run with --stacktrace option to get the stack trace. Run with --debug option to get more log output. Run with --scan to get full insights.
* Get more help at https://help.gradle.org
Deprecated Gradle features were used in this build, making it incompatible with Gradle 6.0.
Use '--warning-mode all' to show the individual deprecation warnings.
See https://docs.gradle.org/5.2.1/userguide/command_line_interface.html#sec:command_line_warnings
BUILD FAILED in 1m 21s
5 actionable tasks: 5 executed
Publishing build scan...
https://gradle.com/s/ny3rpv6fbekxi
Build step 'Invoke Gradle script' changed build result to FAILURE
Build step 'Invoke Gradle script' marked build as failure
---------------------------------------------------------------------
To unsubscribe, e-mail: builds-unsubscribe@beam.apache.org
For additional commands, e-mail: builds-help@beam.apache.org
Jenkins build is back to normal :
beam_PerformanceTests_WordCountIT_Py27 #1879
Posted by Apache Jenkins Server <je...@builds.apache.org>.
See <https://ci-beam.apache.org/job/beam_PerformanceTests_WordCountIT_Py27/1879/display/redirect?page=changes>
---------------------------------------------------------------------
To unsubscribe, e-mail: builds-unsubscribe@beam.apache.org
For additional commands, e-mail: builds-help@beam.apache.org
Build failed in Jenkins: beam_PerformanceTests_WordCountIT_Py27
#1878
Posted by Apache Jenkins Server <je...@builds.apache.org>.
See <https://ci-beam.apache.org/job/beam_PerformanceTests_WordCountIT_Py27/1878/display/redirect?page=changes>
Changes:
[noreply] [BEAM-10699] Logging BigQuery streaming insert tail latencies (#12609)
------------------------------------------
[...truncated 211.56 KB...]
"parallel_input": {
"@type": "OutputReference",
"output_name": "None",
"step_name": "s8"
},
"user_name": "Write/Write/WriteImpl/FinalizeWrite/_UnpickledSideInput(InitializeWrite.out.0)",
"windowing_strategy": "%0A%98%07%22%40%0A%1Dref_Coder_GlobalWindowCoder_1%12%1F%0A%1D%0A%1Bbeam%3Acoder%3Aglobal_window%3Av1%2A%D3%06%0A%25ref_Environment_default_environment_1%12%A9%06%12%12beam%3Aenv%3Adocker%3Av1%1A%3B%0A9gcr.io/cloud-dataflow/v1beta3/python%3Abeam-master-20200630%2A%14beam%3Acoder%3Avarint%3Av1%2A%13beam%3Acoder%3Abytes%3Av1%2A%13beam%3Acoder%3Atimer%3Av1%2A%1Bbeam%3Acoder%3Aglobal_window%3Av1%2A%1Dbeam%3Acoder%3Ainterval_window%3Av1%2A%16beam%3Acoder%3Aiterable%3Av1%2A%23beam%3Acoder%3Astate_backed_iterable%3Av1%2A%1Cbeam%3Acoder%3Awindowed_value%3Av1%2A%22beam%3Acoder%3Aparam_windowed_value%3Av1%2A%14beam%3Acoder%3Adouble%3Av1%2A%19beam%3Acoder%3Astring_utf8%3Av1%2A%1Bbeam%3Acoder%3Alength_prefix%3Av1%2A%12beam%3Acoder%3Abool%3Av1%2A%10beam%3Acoder%3Akv%3Av1%2A%11beam%3Acoder%3Arow%3Av1%2A%23beam%3Aprotocol%3Aprogress_reporting%3Av0%2A%1Ebeam%3Aprotocol%3A****_status%3Av1%2A%3Abeam%3Aversion%3Asdk_base%3Aapache/beam_python2.7_sdk%3A2.25.0.dev2%D2%01%0A%1Abeam%3Aartifact%3Atype%3Afile%3Av1%12w%0Au<https://ci-beam.apache.org/job/beam_PerformanceTests_WordCountIT_Py27/ws/src/sdks/python/build/apache-beam.tar.gz%1A%20beam%3Aartifact%3Arole%3Astaging_to%3Av1%22%19%0A%17dataflow_python_sdk.tarjx%0A%22%0A%20beam%3Awindow_fn%3Aglobal_windows%3Av1%10%01%1A%1Dref_Coder_GlobalWindowCoder_1%22%02%3A%00%28%010%018%01H%01Z%25ref_Environment_default_environment_1">
}
},
{
"kind": "CollectionToSingleton",
"name": "SideInput-s19",
"properties": {
"output_info": [
{
"encoding": {
"@type": "kind:stream",
"component_encodings": [
{
"@type": "kind:windowed_value",
"component_encodings": [
{
"@type": "FastPrimitivesCoder$<string of 176 bytes>",
"component_encodings": [
{
"@type": "FastPrimitivesCoder$<string of 176 bytes>",
"component_encodings": [],
"pipeline_proto_coder_id": "ref_Coder_FastPrimitivesCoder_5"
},
{
"@type": "FastPrimitivesCoder$<string of 176 bytes>",
"component_encodings": [],
"pipeline_proto_coder_id": "ref_Coder_FastPrimitivesCoder_5"
}
],
"is_pair_like": true,
"pipeline_proto_coder_id": "ref_Coder_FastPrimitivesCoder_5"
},
{
"@type": "kind:global_window"
}
],
"is_wrapper": true
}
],
"is_stream_like": {
"value": true
}
},
"output_name": "out",
"user_name": "Write/Write/WriteImpl/FinalizeWrite/_UnpickledSideInput(Extract.out.0).output"
}
],
"parallel_input": {
"@type": "OutputReference",
"output_name": "None",
"step_name": "s14"
},
"user_name": "Write/Write/WriteImpl/FinalizeWrite/_UnpickledSideInput(Extract.out.0)",
"windowing_strategy": "%0A%98%07%22%40%0A%1Dref_Coder_GlobalWindowCoder_1%12%1F%0A%1D%0A%1Bbeam%3Acoder%3Aglobal_window%3Av1%2A%D3%06%0A%25ref_Environment_default_environment_1%12%A9%06%12%12beam%3Aenv%3Adocker%3Av1%1A%3B%0A9gcr.io/cloud-dataflow/v1beta3/python%3Abeam-master-20200630%2A%14beam%3Acoder%3Avarint%3Av1%2A%13beam%3Acoder%3Abytes%3Av1%2A%13beam%3Acoder%3Atimer%3Av1%2A%1Bbeam%3Acoder%3Aglobal_window%3Av1%2A%1Dbeam%3Acoder%3Ainterval_window%3Av1%2A%16beam%3Acoder%3Aiterable%3Av1%2A%23beam%3Acoder%3Astate_backed_iterable%3Av1%2A%1Cbeam%3Acoder%3Awindowed_value%3Av1%2A%22beam%3Acoder%3Aparam_windowed_value%3Av1%2A%14beam%3Acoder%3Adouble%3Av1%2A%19beam%3Acoder%3Astring_utf8%3Av1%2A%1Bbeam%3Acoder%3Alength_prefix%3Av1%2A%12beam%3Acoder%3Abool%3Av1%2A%10beam%3Acoder%3Akv%3Av1%2A%11beam%3Acoder%3Arow%3Av1%2A%23beam%3Aprotocol%3Aprogress_reporting%3Av0%2A%1Ebeam%3Aprotocol%3A****_status%3Av1%2A%3Abeam%3Aversion%3Asdk_base%3Aapache/beam_python2.7_sdk%3A2.25.0.dev2%D2%01%0A%1Abeam%3Aartifact%3Atype%3Afile%3Av1%12w%0Au<https://ci-beam.apache.org/job/beam_PerformanceTests_WordCountIT_Py27/ws/src/sdks/python/build/apache-beam.tar.gz%1A%20beam%3Aartifact%3Arole%3Astaging_to%3Av1%22%19%0A%17dataflow_python_sdk.tarjx%0A%22%0A%20beam%3Awindow_fn%3Aglobal_windows%3Av1%10%01%1A%1Dref_Coder_GlobalWindowCoder_1%22%02%3A%00%28%010%018%01H%01Z%25ref_Environment_default_environment_1">
}
},
{
"kind": "CollectionToSingleton",
"name": "SideInput-s20",
"properties": {
"output_info": [
{
"encoding": {
"@type": "kind:stream",
"component_encodings": [
{
"@type": "kind:windowed_value",
"component_encodings": [
{
"@type": "FastPrimitivesCoder$<string of 176 bytes>",
"component_encodings": [
{
"@type": "FastPrimitivesCoder$<string of 176 bytes>",
"component_encodings": [],
"pipeline_proto_coder_id": "ref_Coder_FastPrimitivesCoder_5"
},
{
"@type": "FastPrimitivesCoder$<string of 176 bytes>",
"component_encodings": [],
"pipeline_proto_coder_id": "ref_Coder_FastPrimitivesCoder_5"
}
],
"is_pair_like": true,
"pipeline_proto_coder_id": "ref_Coder_FastPrimitivesCoder_5"
},
{
"@type": "kind:global_window"
}
],
"is_wrapper": true
}
],
"is_stream_like": {
"value": true
}
},
"output_name": "out",
"user_name": "Write/Write/WriteImpl/FinalizeWrite/_UnpickledSideInput(PreFinalize.out.0).output"
}
],
"parallel_input": {
"@type": "OutputReference",
"output_name": "None",
"step_name": "s17"
},
"user_name": "Write/Write/WriteImpl/FinalizeWrite/_UnpickledSideInput(PreFinalize.out.0)",
"windowing_strategy": "%0A%98%07%22%40%0A%1Dref_Coder_GlobalWindowCoder_1%12%1F%0A%1D%0A%1Bbeam%3Acoder%3Aglobal_window%3Av1%2A%D3%06%0A%25ref_Environment_default_environment_1%12%A9%06%12%12beam%3Aenv%3Adocker%3Av1%1A%3B%0A9gcr.io/cloud-dataflow/v1beta3/python%3Abeam-master-20200630%2A%14beam%3Acoder%3Avarint%3Av1%2A%13beam%3Acoder%3Abytes%3Av1%2A%13beam%3Acoder%3Atimer%3Av1%2A%1Bbeam%3Acoder%3Aglobal_window%3Av1%2A%1Dbeam%3Acoder%3Ainterval_window%3Av1%2A%16beam%3Acoder%3Aiterable%3Av1%2A%23beam%3Acoder%3Astate_backed_iterable%3Av1%2A%1Cbeam%3Acoder%3Awindowed_value%3Av1%2A%22beam%3Acoder%3Aparam_windowed_value%3Av1%2A%14beam%3Acoder%3Adouble%3Av1%2A%19beam%3Acoder%3Astring_utf8%3Av1%2A%1Bbeam%3Acoder%3Alength_prefix%3Av1%2A%12beam%3Acoder%3Abool%3Av1%2A%10beam%3Acoder%3Akv%3Av1%2A%11beam%3Acoder%3Arow%3Av1%2A%23beam%3Aprotocol%3Aprogress_reporting%3Av0%2A%1Ebeam%3Aprotocol%3A****_status%3Av1%2A%3Abeam%3Aversion%3Asdk_base%3Aapache/beam_python2.7_sdk%3A2.25.0.dev2%D2%01%0A%1Abeam%3Aartifact%3Atype%3Afile%3Av1%12w%0Au<https://ci-beam.apache.org/job/beam_PerformanceTests_WordCountIT_Py27/ws/src/sdks/python/build/apache-beam.tar.gz%1A%20beam%3Aartifact%3Arole%3Astaging_to%3Av1%22%19%0A%17dataflow_python_sdk.tarjx%0A%22%0A%20beam%3Awindow_fn%3Aglobal_windows%3Av1%10%01%1A%1Dref_Coder_GlobalWindowCoder_1%22%02%3A%00%28%010%018%01H%01Z%25ref_Environment_default_environment_1">
}
},
{
"kind": "ParallelDo",
"name": "s21",
"properties": {
"display_data": [
{
"key": "fn",
"label": "Transform Function",
"namespace": "apache_beam.transforms.core.CallableWrapperDoFn",
"type": "STRING",
"value": "_finalize_write"
},
{
"key": "fn",
"label": "Transform Function",
"namespace": "apache_beam.transforms.core.ParDo",
"shortValue": "CallableWrapperDoFn",
"type": "STRING",
"value": "apache_beam.transforms.core.CallableWrapperDoFn"
}
],
"non_parallel_inputs": {
"python_side_input0-Write/Write/WriteImpl/FinalizeWrite": {
"@type": "OutputReference",
"output_name": "out",
"step_name": "SideInput-s18"
},
"python_side_input1-Write/Write/WriteImpl/FinalizeWrite": {
"@type": "OutputReference",
"output_name": "out",
"step_name": "SideInput-s19"
},
"python_side_input2-Write/Write/WriteImpl/FinalizeWrite": {
"@type": "OutputReference",
"output_name": "out",
"step_name": "SideInput-s20"
}
},
"output_info": [
{
"encoding": {
"@type": "kind:windowed_value",
"component_encodings": [
{
"@type": "FastPrimitivesCoder$<string of 176 bytes>",
"component_encodings": [
{
"@type": "FastPrimitivesCoder$<string of 176 bytes>",
"component_encodings": [],
"pipeline_proto_coder_id": "ref_Coder_FastPrimitivesCoder_5"
},
{
"@type": "FastPrimitivesCoder$<string of 176 bytes>",
"component_encodings": [],
"pipeline_proto_coder_id": "ref_Coder_FastPrimitivesCoder_5"
}
],
"is_pair_like": true,
"pipeline_proto_coder_id": "ref_Coder_FastPrimitivesCoder_5"
},
{
"@type": "kind:global_window"
}
],
"is_wrapper": true
},
"output_name": "None",
"user_name": "Write/Write/WriteImpl/FinalizeWrite.out"
}
],
"parallel_input": {
"@type": "OutputReference",
"output_name": "out",
"step_name": "s7"
},
"serialized_fn": "<string of 3484 bytes>",
"user_name": "Write/Write/WriteImpl/FinalizeWrite/FinalizeWrite"
}
}
],
"type": "JOB_TYPE_BATCH"
}
apache_beam.runners.dataflow.internal.apiclient: INFO: Create job: <Job
createTime: u'2020-08-28T00:09:42.522500Z'
currentStateTime: u'1970-01-01T00:00:00Z'
id: u'2020-08-27_17_09_41-2067854460710705547'
location: u'us-central1'
name: u'performance-tests-wordcount-python27-batch-1gb0828000732'
projectId: u'apache-beam-testing'
stageStates: []
startTime: u'2020-08-28T00:09:42.522500Z'
steps: []
tempFiles: []
type: TypeValueValuesEnum(JOB_TYPE_BATCH, 1)>
apache_beam.runners.dataflow.internal.apiclient: INFO: Created job with id: [2020-08-27_17_09_41-2067854460710705547]
apache_beam.runners.dataflow.internal.apiclient: INFO: Submitted job: 2020-08-27_17_09_41-2067854460710705547
apache_beam.runners.dataflow.internal.apiclient: INFO: To access the Dataflow monitoring console, please navigate to https://console.cloud.google.com/dataflow/jobs/us-central1/2020-08-27_17_09_41-2067854460710705547?project=apache-beam-testing
--------------------- >> end captured logging << ---------------------
----------------------------------------------------------------------
XML: nosetests-runPerformanceTest-df-py27.xml
----------------------------------------------------------------------
XML: <https://ci-beam.apache.org/job/beam_PerformanceTests_WordCountIT_Py27/ws/src/sdks/python/nosetests.xml>
----------------------------------------------------------------------
Ran 1 test in 25.389s
FAILED (failures=1)
> Task :sdks:python:test-suites:dataflow:py2:runPerformanceTest FAILED
:sdks:python:test-suites:dataflow:py2:runPerformanceTest (Thread[Execution **** for ':' Thread 3,5,main]) completed. Took 28.238 secs.
FAILURE: Build failed with an exception.
* What went wrong:
Execution failed for task ':sdks:python:test-suites:dataflow:py2:runPerformanceTest'.
> Process 'command 'sh'' finished with non-zero exit value 1
* Try:
Run with --stacktrace option to get the stack trace. Run with --debug option to get more log output. Run with --scan to get full insights.
* Get more help at https://help.gradle.org
Deprecated Gradle features were used in this build, making it incompatible with Gradle 6.0.
Use '--warning-mode all' to show the individual deprecation warnings.
See https://docs.gradle.org/5.2.1/userguide/command_line_interface.html#sec:command_line_warnings
BUILD FAILED in 1m 43s
5 actionable tasks: 5 executed
Publishing build scan...
https://gradle.com/s/wmoqzxaijizvc
Build step 'Invoke Gradle script' changed build result to FAILURE
Build step 'Invoke Gradle script' marked build as failure
---------------------------------------------------------------------
To unsubscribe, e-mail: builds-unsubscribe@beam.apache.org
For additional commands, e-mail: builds-help@beam.apache.org
Build failed in Jenkins: beam_PerformanceTests_WordCountIT_Py27
#1877
Posted by Apache Jenkins Server <je...@builds.apache.org>.
See <https://ci-beam.apache.org/job/beam_PerformanceTests_WordCountIT_Py27/1877/display/redirect?page=changes>
Changes:
[Luke Cwik] [BEAM-10820] Delete dead code SDFFeederViaStateAndTimers.java
[Udi Meiri] [BEAM-10701] Fix paths yet again
------------------------------------------
[...truncated 211.51 KB...]
"parallel_input": {
"@type": "OutputReference",
"output_name": "None",
"step_name": "s8"
},
"user_name": "Write/Write/WriteImpl/FinalizeWrite/_UnpickledSideInput(InitializeWrite.out.0)",
"windowing_strategy": "%0A%98%07%22%40%0A%1Dref_Coder_GlobalWindowCoder_1%12%1F%0A%1D%0A%1Bbeam%3Acoder%3Aglobal_window%3Av1%2A%D3%06%0A%25ref_Environment_default_environment_1%12%A9%06%12%12beam%3Aenv%3Adocker%3Av1%1A%3B%0A9gcr.io/cloud-dataflow/v1beta3/python%3Abeam-master-20200630%2A%14beam%3Acoder%3Avarint%3Av1%2A%13beam%3Acoder%3Abytes%3Av1%2A%13beam%3Acoder%3Atimer%3Av1%2A%1Bbeam%3Acoder%3Aglobal_window%3Av1%2A%1Dbeam%3Acoder%3Ainterval_window%3Av1%2A%16beam%3Acoder%3Aiterable%3Av1%2A%23beam%3Acoder%3Astate_backed_iterable%3Av1%2A%1Cbeam%3Acoder%3Awindowed_value%3Av1%2A%22beam%3Acoder%3Aparam_windowed_value%3Av1%2A%14beam%3Acoder%3Adouble%3Av1%2A%19beam%3Acoder%3Astring_utf8%3Av1%2A%1Bbeam%3Acoder%3Alength_prefix%3Av1%2A%12beam%3Acoder%3Abool%3Av1%2A%10beam%3Acoder%3Akv%3Av1%2A%11beam%3Acoder%3Arow%3Av1%2A%23beam%3Aprotocol%3Aprogress_reporting%3Av0%2A%1Ebeam%3Aprotocol%3A****_status%3Av1%2A%3Abeam%3Aversion%3Asdk_base%3Aapache/beam_python2.7_sdk%3A2.25.0.dev2%D2%01%0A%1Abeam%3Aartifact%3Atype%3Afile%3Av1%12w%0Au<https://ci-beam.apache.org/job/beam_PerformanceTests_WordCountIT_Py27/ws/src/sdks/python/build/apache-beam.tar.gz%1A%20beam%3Aartifact%3Arole%3Astaging_to%3Av1%22%19%0A%17dataflow_python_sdk.tarjx%0A%22%0A%20beam%3Awindow_fn%3Aglobal_windows%3Av1%10%01%1A%1Dref_Coder_GlobalWindowCoder_1%22%02%3A%00%28%010%018%01H%01Z%25ref_Environment_default_environment_1">
}
},
{
"kind": "CollectionToSingleton",
"name": "SideInput-s19",
"properties": {
"output_info": [
{
"encoding": {
"@type": "kind:stream",
"component_encodings": [
{
"@type": "kind:windowed_value",
"component_encodings": [
{
"@type": "FastPrimitivesCoder$<string of 176 bytes>",
"component_encodings": [
{
"@type": "FastPrimitivesCoder$<string of 176 bytes>",
"component_encodings": [],
"pipeline_proto_coder_id": "ref_Coder_FastPrimitivesCoder_5"
},
{
"@type": "FastPrimitivesCoder$<string of 176 bytes>",
"component_encodings": [],
"pipeline_proto_coder_id": "ref_Coder_FastPrimitivesCoder_5"
}
],
"is_pair_like": true,
"pipeline_proto_coder_id": "ref_Coder_FastPrimitivesCoder_5"
},
{
"@type": "kind:global_window"
}
],
"is_wrapper": true
}
],
"is_stream_like": {
"value": true
}
},
"output_name": "out",
"user_name": "Write/Write/WriteImpl/FinalizeWrite/_UnpickledSideInput(Extract.out.0).output"
}
],
"parallel_input": {
"@type": "OutputReference",
"output_name": "None",
"step_name": "s14"
},
"user_name": "Write/Write/WriteImpl/FinalizeWrite/_UnpickledSideInput(Extract.out.0)",
"windowing_strategy": "%0A%98%07%22%40%0A%1Dref_Coder_GlobalWindowCoder_1%12%1F%0A%1D%0A%1Bbeam%3Acoder%3Aglobal_window%3Av1%2A%D3%06%0A%25ref_Environment_default_environment_1%12%A9%06%12%12beam%3Aenv%3Adocker%3Av1%1A%3B%0A9gcr.io/cloud-dataflow/v1beta3/python%3Abeam-master-20200630%2A%14beam%3Acoder%3Avarint%3Av1%2A%13beam%3Acoder%3Abytes%3Av1%2A%13beam%3Acoder%3Atimer%3Av1%2A%1Bbeam%3Acoder%3Aglobal_window%3Av1%2A%1Dbeam%3Acoder%3Ainterval_window%3Av1%2A%16beam%3Acoder%3Aiterable%3Av1%2A%23beam%3Acoder%3Astate_backed_iterable%3Av1%2A%1Cbeam%3Acoder%3Awindowed_value%3Av1%2A%22beam%3Acoder%3Aparam_windowed_value%3Av1%2A%14beam%3Acoder%3Adouble%3Av1%2A%19beam%3Acoder%3Astring_utf8%3Av1%2A%1Bbeam%3Acoder%3Alength_prefix%3Av1%2A%12beam%3Acoder%3Abool%3Av1%2A%10beam%3Acoder%3Akv%3Av1%2A%11beam%3Acoder%3Arow%3Av1%2A%23beam%3Aprotocol%3Aprogress_reporting%3Av0%2A%1Ebeam%3Aprotocol%3A****_status%3Av1%2A%3Abeam%3Aversion%3Asdk_base%3Aapache/beam_python2.7_sdk%3A2.25.0.dev2%D2%01%0A%1Abeam%3Aartifact%3Atype%3Afile%3Av1%12w%0Au<https://ci-beam.apache.org/job/beam_PerformanceTests_WordCountIT_Py27/ws/src/sdks/python/build/apache-beam.tar.gz%1A%20beam%3Aartifact%3Arole%3Astaging_to%3Av1%22%19%0A%17dataflow_python_sdk.tarjx%0A%22%0A%20beam%3Awindow_fn%3Aglobal_windows%3Av1%10%01%1A%1Dref_Coder_GlobalWindowCoder_1%22%02%3A%00%28%010%018%01H%01Z%25ref_Environment_default_environment_1">
}
},
{
"kind": "CollectionToSingleton",
"name": "SideInput-s20",
"properties": {
"output_info": [
{
"encoding": {
"@type": "kind:stream",
"component_encodings": [
{
"@type": "kind:windowed_value",
"component_encodings": [
{
"@type": "FastPrimitivesCoder$<string of 176 bytes>",
"component_encodings": [
{
"@type": "FastPrimitivesCoder$<string of 176 bytes>",
"component_encodings": [],
"pipeline_proto_coder_id": "ref_Coder_FastPrimitivesCoder_5"
},
{
"@type": "FastPrimitivesCoder$<string of 176 bytes>",
"component_encodings": [],
"pipeline_proto_coder_id": "ref_Coder_FastPrimitivesCoder_5"
}
],
"is_pair_like": true,
"pipeline_proto_coder_id": "ref_Coder_FastPrimitivesCoder_5"
},
{
"@type": "kind:global_window"
}
],
"is_wrapper": true
}
],
"is_stream_like": {
"value": true
}
},
"output_name": "out",
"user_name": "Write/Write/WriteImpl/FinalizeWrite/_UnpickledSideInput(PreFinalize.out.0).output"
}
],
"parallel_input": {
"@type": "OutputReference",
"output_name": "None",
"step_name": "s17"
},
"user_name": "Write/Write/WriteImpl/FinalizeWrite/_UnpickledSideInput(PreFinalize.out.0)",
"windowing_strategy": "%0A%98%07%22%40%0A%1Dref_Coder_GlobalWindowCoder_1%12%1F%0A%1D%0A%1Bbeam%3Acoder%3Aglobal_window%3Av1%2A%D3%06%0A%25ref_Environment_default_environment_1%12%A9%06%12%12beam%3Aenv%3Adocker%3Av1%1A%3B%0A9gcr.io/cloud-dataflow/v1beta3/python%3Abeam-master-20200630%2A%14beam%3Acoder%3Avarint%3Av1%2A%13beam%3Acoder%3Abytes%3Av1%2A%13beam%3Acoder%3Atimer%3Av1%2A%1Bbeam%3Acoder%3Aglobal_window%3Av1%2A%1Dbeam%3Acoder%3Ainterval_window%3Av1%2A%16beam%3Acoder%3Aiterable%3Av1%2A%23beam%3Acoder%3Astate_backed_iterable%3Av1%2A%1Cbeam%3Acoder%3Awindowed_value%3Av1%2A%22beam%3Acoder%3Aparam_windowed_value%3Av1%2A%14beam%3Acoder%3Adouble%3Av1%2A%19beam%3Acoder%3Astring_utf8%3Av1%2A%1Bbeam%3Acoder%3Alength_prefix%3Av1%2A%12beam%3Acoder%3Abool%3Av1%2A%10beam%3Acoder%3Akv%3Av1%2A%11beam%3Acoder%3Arow%3Av1%2A%23beam%3Aprotocol%3Aprogress_reporting%3Av0%2A%1Ebeam%3Aprotocol%3A****_status%3Av1%2A%3Abeam%3Aversion%3Asdk_base%3Aapache/beam_python2.7_sdk%3A2.25.0.dev2%D2%01%0A%1Abeam%3Aartifact%3Atype%3Afile%3Av1%12w%0Au<https://ci-beam.apache.org/job/beam_PerformanceTests_WordCountIT_Py27/ws/src/sdks/python/build/apache-beam.tar.gz%1A%20beam%3Aartifact%3Arole%3Astaging_to%3Av1%22%19%0A%17dataflow_python_sdk.tarjx%0A%22%0A%20beam%3Awindow_fn%3Aglobal_windows%3Av1%10%01%1A%1Dref_Coder_GlobalWindowCoder_1%22%02%3A%00%28%010%018%01H%01Z%25ref_Environment_default_environment_1">
}
},
{
"kind": "ParallelDo",
"name": "s21",
"properties": {
"display_data": [
{
"key": "fn",
"label": "Transform Function",
"namespace": "apache_beam.transforms.core.CallableWrapperDoFn",
"type": "STRING",
"value": "_finalize_write"
},
{
"key": "fn",
"label": "Transform Function",
"namespace": "apache_beam.transforms.core.ParDo",
"shortValue": "CallableWrapperDoFn",
"type": "STRING",
"value": "apache_beam.transforms.core.CallableWrapperDoFn"
}
],
"non_parallel_inputs": {
"python_side_input0-Write/Write/WriteImpl/FinalizeWrite": {
"@type": "OutputReference",
"output_name": "out",
"step_name": "SideInput-s18"
},
"python_side_input1-Write/Write/WriteImpl/FinalizeWrite": {
"@type": "OutputReference",
"output_name": "out",
"step_name": "SideInput-s19"
},
"python_side_input2-Write/Write/WriteImpl/FinalizeWrite": {
"@type": "OutputReference",
"output_name": "out",
"step_name": "SideInput-s20"
}
},
"output_info": [
{
"encoding": {
"@type": "kind:windowed_value",
"component_encodings": [
{
"@type": "FastPrimitivesCoder$<string of 176 bytes>",
"component_encodings": [
{
"@type": "FastPrimitivesCoder$<string of 176 bytes>",
"component_encodings": [],
"pipeline_proto_coder_id": "ref_Coder_FastPrimitivesCoder_5"
},
{
"@type": "FastPrimitivesCoder$<string of 176 bytes>",
"component_encodings": [],
"pipeline_proto_coder_id": "ref_Coder_FastPrimitivesCoder_5"
}
],
"is_pair_like": true,
"pipeline_proto_coder_id": "ref_Coder_FastPrimitivesCoder_5"
},
{
"@type": "kind:global_window"
}
],
"is_wrapper": true
},
"output_name": "None",
"user_name": "Write/Write/WriteImpl/FinalizeWrite.out"
}
],
"parallel_input": {
"@type": "OutputReference",
"output_name": "out",
"step_name": "s7"
},
"serialized_fn": "<string of 3532 bytes>",
"user_name": "Write/Write/WriteImpl/FinalizeWrite/FinalizeWrite"
}
}
],
"type": "JOB_TYPE_BATCH"
}
apache_beam.runners.dataflow.internal.apiclient: INFO: Create job: <Job
createTime: u'2020-08-27T18:09:41.720752Z'
currentStateTime: u'1970-01-01T00:00:00Z'
id: u'2020-08-27_11_09_40-10630837354868261952'
location: u'us-central1'
name: u'performance-tests-wordcount-python27-batch-1gb0827154844'
projectId: u'apache-beam-testing'
stageStates: []
startTime: u'2020-08-27T18:09:41.720752Z'
steps: []
tempFiles: []
type: TypeValueValuesEnum(JOB_TYPE_BATCH, 1)>
apache_beam.runners.dataflow.internal.apiclient: INFO: Created job with id: [2020-08-27_11_09_40-10630837354868261952]
apache_beam.runners.dataflow.internal.apiclient: INFO: Submitted job: 2020-08-27_11_09_40-10630837354868261952
apache_beam.runners.dataflow.internal.apiclient: INFO: To access the Dataflow monitoring console, please navigate to https://console.cloud.google.com/dataflow/jobs/us-central1/2020-08-27_11_09_40-10630837354868261952?project=apache-beam-testing
--------------------- >> end captured logging << ---------------------
----------------------------------------------------------------------
XML: nosetests-runPerformanceTest-df-py27.xml
----------------------------------------------------------------------
XML: <https://ci-beam.apache.org/job/beam_PerformanceTests_WordCountIT_Py27/ws/src/sdks/python/nosetests.xml>
----------------------------------------------------------------------
Ran 1 test in 25.660s
FAILED (failures=1)
> Task :sdks:python:test-suites:dataflow:py2:runPerformanceTest FAILED
:sdks:python:test-suites:dataflow:py2:runPerformanceTest (Thread[Execution **** for ':',5,main]) completed. Took 27.708 secs.
FAILURE: Build failed with an exception.
* What went wrong:
Execution failed for task ':sdks:python:test-suites:dataflow:py2:runPerformanceTest'.
> Process 'command 'sh'' finished with non-zero exit value 1
* Try:
Run with --stacktrace option to get the stack trace. Run with --debug option to get more log output. Run with --scan to get full insights.
* Get more help at https://help.gradle.org
Deprecated Gradle features were used in this build, making it incompatible with Gradle 6.0.
Use '--warning-mode all' to show the individual deprecation warnings.
See https://docs.gradle.org/5.2.1/userguide/command_line_interface.html#sec:command_line_warnings
BUILD FAILED in 1m 43s
5 actionable tasks: 5 executed
Publishing build scan...
https://gradle.com/s/b22vbqaych6dy
Build step 'Invoke Gradle script' changed build result to FAILURE
Build step 'Invoke Gradle script' marked build as failure
---------------------------------------------------------------------
To unsubscribe, e-mail: builds-unsubscribe@beam.apache.org
For additional commands, e-mail: builds-help@beam.apache.org
Build failed in Jenkins: beam_PerformanceTests_WordCountIT_Py27
#1876
Posted by Apache Jenkins Server <je...@builds.apache.org>.
See <https://ci-beam.apache.org/job/beam_PerformanceTests_WordCountIT_Py27/1876/display/redirect?page=changes>
Changes:
[Kamil Wasilewski] [BEAM-10675] Clean up Python Load Tests
------------------------------------------
[...truncated 211.43 KB...]
"parallel_input": {
"@type": "OutputReference",
"output_name": "None",
"step_name": "s8"
},
"user_name": "Write/Write/WriteImpl/FinalizeWrite/_UnpickledSideInput(InitializeWrite.out.0)",
"windowing_strategy": "%0A%98%07%22%40%0A%1Dref_Coder_GlobalWindowCoder_1%12%1F%0A%1D%0A%1Bbeam%3Acoder%3Aglobal_window%3Av1%2A%D3%06%0A%25ref_Environment_default_environment_1%12%A9%06%12%12beam%3Aenv%3Adocker%3Av1%1A%3B%0A9gcr.io/cloud-dataflow/v1beta3/python%3Abeam-master-20200630%2A%14beam%3Acoder%3Avarint%3Av1%2A%13beam%3Acoder%3Abytes%3Av1%2A%13beam%3Acoder%3Atimer%3Av1%2A%1Bbeam%3Acoder%3Aglobal_window%3Av1%2A%1Dbeam%3Acoder%3Ainterval_window%3Av1%2A%16beam%3Acoder%3Aiterable%3Av1%2A%23beam%3Acoder%3Astate_backed_iterable%3Av1%2A%1Cbeam%3Acoder%3Awindowed_value%3Av1%2A%22beam%3Acoder%3Aparam_windowed_value%3Av1%2A%14beam%3Acoder%3Adouble%3Av1%2A%19beam%3Acoder%3Astring_utf8%3Av1%2A%1Bbeam%3Acoder%3Alength_prefix%3Av1%2A%12beam%3Acoder%3Abool%3Av1%2A%10beam%3Acoder%3Akv%3Av1%2A%11beam%3Acoder%3Arow%3Av1%2A%23beam%3Aprotocol%3Aprogress_reporting%3Av0%2A%1Ebeam%3Aprotocol%3A****_status%3Av1%2A%3Abeam%3Aversion%3Asdk_base%3Aapache/beam_python2.7_sdk%3A2.25.0.dev2%D2%01%0A%1Abeam%3Aartifact%3Atype%3Afile%3Av1%12w%0Au<https://ci-beam.apache.org/job/beam_PerformanceTests_WordCountIT_Py27/ws/src/sdks/python/build/apache-beam.tar.gz%1A%20beam%3Aartifact%3Arole%3Astaging_to%3Av1%22%19%0A%17dataflow_python_sdk.tarjx%0A%22%0A%20beam%3Awindow_fn%3Aglobal_windows%3Av1%10%01%1A%1Dref_Coder_GlobalWindowCoder_1%22%02%3A%00%28%010%018%01H%01Z%25ref_Environment_default_environment_1">
}
},
{
"kind": "CollectionToSingleton",
"name": "SideInput-s19",
"properties": {
"output_info": [
{
"encoding": {
"@type": "kind:stream",
"component_encodings": [
{
"@type": "kind:windowed_value",
"component_encodings": [
{
"@type": "FastPrimitivesCoder$<string of 176 bytes>",
"component_encodings": [
{
"@type": "FastPrimitivesCoder$<string of 176 bytes>",
"component_encodings": [],
"pipeline_proto_coder_id": "ref_Coder_FastPrimitivesCoder_5"
},
{
"@type": "FastPrimitivesCoder$<string of 176 bytes>",
"component_encodings": [],
"pipeline_proto_coder_id": "ref_Coder_FastPrimitivesCoder_5"
}
],
"is_pair_like": true,
"pipeline_proto_coder_id": "ref_Coder_FastPrimitivesCoder_5"
},
{
"@type": "kind:global_window"
}
],
"is_wrapper": true
}
],
"is_stream_like": {
"value": true
}
},
"output_name": "out",
"user_name": "Write/Write/WriteImpl/FinalizeWrite/_UnpickledSideInput(Extract.out.0).output"
}
],
"parallel_input": {
"@type": "OutputReference",
"output_name": "None",
"step_name": "s14"
},
"user_name": "Write/Write/WriteImpl/FinalizeWrite/_UnpickledSideInput(Extract.out.0)",
"windowing_strategy": "%0A%98%07%22%40%0A%1Dref_Coder_GlobalWindowCoder_1%12%1F%0A%1D%0A%1Bbeam%3Acoder%3Aglobal_window%3Av1%2A%D3%06%0A%25ref_Environment_default_environment_1%12%A9%06%12%12beam%3Aenv%3Adocker%3Av1%1A%3B%0A9gcr.io/cloud-dataflow/v1beta3/python%3Abeam-master-20200630%2A%14beam%3Acoder%3Avarint%3Av1%2A%13beam%3Acoder%3Abytes%3Av1%2A%13beam%3Acoder%3Atimer%3Av1%2A%1Bbeam%3Acoder%3Aglobal_window%3Av1%2A%1Dbeam%3Acoder%3Ainterval_window%3Av1%2A%16beam%3Acoder%3Aiterable%3Av1%2A%23beam%3Acoder%3Astate_backed_iterable%3Av1%2A%1Cbeam%3Acoder%3Awindowed_value%3Av1%2A%22beam%3Acoder%3Aparam_windowed_value%3Av1%2A%14beam%3Acoder%3Adouble%3Av1%2A%19beam%3Acoder%3Astring_utf8%3Av1%2A%1Bbeam%3Acoder%3Alength_prefix%3Av1%2A%12beam%3Acoder%3Abool%3Av1%2A%10beam%3Acoder%3Akv%3Av1%2A%11beam%3Acoder%3Arow%3Av1%2A%23beam%3Aprotocol%3Aprogress_reporting%3Av0%2A%1Ebeam%3Aprotocol%3A****_status%3Av1%2A%3Abeam%3Aversion%3Asdk_base%3Aapache/beam_python2.7_sdk%3A2.25.0.dev2%D2%01%0A%1Abeam%3Aartifact%3Atype%3Afile%3Av1%12w%0Au<https://ci-beam.apache.org/job/beam_PerformanceTests_WordCountIT_Py27/ws/src/sdks/python/build/apache-beam.tar.gz%1A%20beam%3Aartifact%3Arole%3Astaging_to%3Av1%22%19%0A%17dataflow_python_sdk.tarjx%0A%22%0A%20beam%3Awindow_fn%3Aglobal_windows%3Av1%10%01%1A%1Dref_Coder_GlobalWindowCoder_1%22%02%3A%00%28%010%018%01H%01Z%25ref_Environment_default_environment_1">
}
},
{
"kind": "CollectionToSingleton",
"name": "SideInput-s20",
"properties": {
"output_info": [
{
"encoding": {
"@type": "kind:stream",
"component_encodings": [
{
"@type": "kind:windowed_value",
"component_encodings": [
{
"@type": "FastPrimitivesCoder$<string of 176 bytes>",
"component_encodings": [
{
"@type": "FastPrimitivesCoder$<string of 176 bytes>",
"component_encodings": [],
"pipeline_proto_coder_id": "ref_Coder_FastPrimitivesCoder_5"
},
{
"@type": "FastPrimitivesCoder$<string of 176 bytes>",
"component_encodings": [],
"pipeline_proto_coder_id": "ref_Coder_FastPrimitivesCoder_5"
}
],
"is_pair_like": true,
"pipeline_proto_coder_id": "ref_Coder_FastPrimitivesCoder_5"
},
{
"@type": "kind:global_window"
}
],
"is_wrapper": true
}
],
"is_stream_like": {
"value": true
}
},
"output_name": "out",
"user_name": "Write/Write/WriteImpl/FinalizeWrite/_UnpickledSideInput(PreFinalize.out.0).output"
}
],
"parallel_input": {
"@type": "OutputReference",
"output_name": "None",
"step_name": "s17"
},
"user_name": "Write/Write/WriteImpl/FinalizeWrite/_UnpickledSideInput(PreFinalize.out.0)",
"windowing_strategy": "%0A%98%07%22%40%0A%1Dref_Coder_GlobalWindowCoder_1%12%1F%0A%1D%0A%1Bbeam%3Acoder%3Aglobal_window%3Av1%2A%D3%06%0A%25ref_Environment_default_environment_1%12%A9%06%12%12beam%3Aenv%3Adocker%3Av1%1A%3B%0A9gcr.io/cloud-dataflow/v1beta3/python%3Abeam-master-20200630%2A%14beam%3Acoder%3Avarint%3Av1%2A%13beam%3Acoder%3Abytes%3Av1%2A%13beam%3Acoder%3Atimer%3Av1%2A%1Bbeam%3Acoder%3Aglobal_window%3Av1%2A%1Dbeam%3Acoder%3Ainterval_window%3Av1%2A%16beam%3Acoder%3Aiterable%3Av1%2A%23beam%3Acoder%3Astate_backed_iterable%3Av1%2A%1Cbeam%3Acoder%3Awindowed_value%3Av1%2A%22beam%3Acoder%3Aparam_windowed_value%3Av1%2A%14beam%3Acoder%3Adouble%3Av1%2A%19beam%3Acoder%3Astring_utf8%3Av1%2A%1Bbeam%3Acoder%3Alength_prefix%3Av1%2A%12beam%3Acoder%3Abool%3Av1%2A%10beam%3Acoder%3Akv%3Av1%2A%11beam%3Acoder%3Arow%3Av1%2A%23beam%3Aprotocol%3Aprogress_reporting%3Av0%2A%1Ebeam%3Aprotocol%3A****_status%3Av1%2A%3Abeam%3Aversion%3Asdk_base%3Aapache/beam_python2.7_sdk%3A2.25.0.dev2%D2%01%0A%1Abeam%3Aartifact%3Atype%3Afile%3Av1%12w%0Au<https://ci-beam.apache.org/job/beam_PerformanceTests_WordCountIT_Py27/ws/src/sdks/python/build/apache-beam.tar.gz%1A%20beam%3Aartifact%3Arole%3Astaging_to%3Av1%22%19%0A%17dataflow_python_sdk.tarjx%0A%22%0A%20beam%3Awindow_fn%3Aglobal_windows%3Av1%10%01%1A%1Dref_Coder_GlobalWindowCoder_1%22%02%3A%00%28%010%018%01H%01Z%25ref_Environment_default_environment_1">
}
},
{
"kind": "ParallelDo",
"name": "s21",
"properties": {
"display_data": [
{
"key": "fn",
"label": "Transform Function",
"namespace": "apache_beam.transforms.core.CallableWrapperDoFn",
"type": "STRING",
"value": "_finalize_write"
},
{
"key": "fn",
"label": "Transform Function",
"namespace": "apache_beam.transforms.core.ParDo",
"shortValue": "CallableWrapperDoFn",
"type": "STRING",
"value": "apache_beam.transforms.core.CallableWrapperDoFn"
}
],
"non_parallel_inputs": {
"python_side_input0-Write/Write/WriteImpl/FinalizeWrite": {
"@type": "OutputReference",
"output_name": "out",
"step_name": "SideInput-s18"
},
"python_side_input1-Write/Write/WriteImpl/FinalizeWrite": {
"@type": "OutputReference",
"output_name": "out",
"step_name": "SideInput-s19"
},
"python_side_input2-Write/Write/WriteImpl/FinalizeWrite": {
"@type": "OutputReference",
"output_name": "out",
"step_name": "SideInput-s20"
}
},
"output_info": [
{
"encoding": {
"@type": "kind:windowed_value",
"component_encodings": [
{
"@type": "FastPrimitivesCoder$<string of 176 bytes>",
"component_encodings": [
{
"@type": "FastPrimitivesCoder$<string of 176 bytes>",
"component_encodings": [],
"pipeline_proto_coder_id": "ref_Coder_FastPrimitivesCoder_5"
},
{
"@type": "FastPrimitivesCoder$<string of 176 bytes>",
"component_encodings": [],
"pipeline_proto_coder_id": "ref_Coder_FastPrimitivesCoder_5"
}
],
"is_pair_like": true,
"pipeline_proto_coder_id": "ref_Coder_FastPrimitivesCoder_5"
},
{
"@type": "kind:global_window"
}
],
"is_wrapper": true
},
"output_name": "None",
"user_name": "Write/Write/WriteImpl/FinalizeWrite.out"
}
],
"parallel_input": {
"@type": "OutputReference",
"output_name": "out",
"step_name": "s7"
},
"serialized_fn": "<string of 3540 bytes>",
"user_name": "Write/Write/WriteImpl/FinalizeWrite/FinalizeWrite"
}
}
],
"type": "JOB_TYPE_BATCH"
}
apache_beam.runners.dataflow.internal.apiclient: INFO: Create job: <Job
createTime: u'2020-08-27T12:09:18.047545Z'
currentStateTime: u'1970-01-01T00:00:00Z'
id: u'2020-08-27_05_09_16-9654924163177944097'
location: u'us-central1'
name: u'performance-tests-wordcount-python27-batch-1gb0827100300'
projectId: u'apache-beam-testing'
stageStates: []
startTime: u'2020-08-27T12:09:18.047545Z'
steps: []
tempFiles: []
type: TypeValueValuesEnum(JOB_TYPE_BATCH, 1)>
apache_beam.runners.dataflow.internal.apiclient: INFO: Created job with id: [2020-08-27_05_09_16-9654924163177944097]
apache_beam.runners.dataflow.internal.apiclient: INFO: Submitted job: 2020-08-27_05_09_16-9654924163177944097
apache_beam.runners.dataflow.internal.apiclient: INFO: To access the Dataflow monitoring console, please navigate to https://console.cloud.google.com/dataflow/jobs/us-central1/2020-08-27_05_09_16-9654924163177944097?project=apache-beam-testing
--------------------- >> end captured logging << ---------------------
----------------------------------------------------------------------
XML: nosetests-runPerformanceTest-df-py27.xml
----------------------------------------------------------------------
XML: <https://ci-beam.apache.org/job/beam_PerformanceTests_WordCountIT_Py27/ws/src/sdks/python/nosetests.xml>
----------------------------------------------------------------------
Ran 1 test in 24.088s
FAILED (failures=1)
> Task :sdks:python:test-suites:dataflow:py2:runPerformanceTest FAILED
:sdks:python:test-suites:dataflow:py2:runPerformanceTest (Thread[Execution **** for ':' Thread 10,5,main]) completed. Took 26.202 secs.
FAILURE: Build failed with an exception.
* What went wrong:
Execution failed for task ':sdks:python:test-suites:dataflow:py2:runPerformanceTest'.
> Process 'command 'sh'' finished with non-zero exit value 1
* Try:
Run with --stacktrace option to get the stack trace. Run with --debug option to get more log output. Run with --scan to get full insights.
* Get more help at https://help.gradle.org
Deprecated Gradle features were used in this build, making it incompatible with Gradle 6.0.
Use '--warning-mode all' to show the individual deprecation warnings.
See https://docs.gradle.org/5.2.1/userguide/command_line_interface.html#sec:command_line_warnings
BUILD FAILED in 1m 19s
5 actionable tasks: 5 executed
Publishing build scan...
https://gradle.com/s/xjsmyhceqcjye
Build step 'Invoke Gradle script' changed build result to FAILURE
Build step 'Invoke Gradle script' marked build as failure
---------------------------------------------------------------------
To unsubscribe, e-mail: builds-unsubscribe@beam.apache.org
For additional commands, e-mail: builds-help@beam.apache.org
Build failed in Jenkins: beam_PerformanceTests_WordCountIT_Py27
#1875
Posted by Apache Jenkins Server <je...@builds.apache.org>.
See <https://ci-beam.apache.org/job/beam_PerformanceTests_WordCountIT_Py27/1875/display/redirect?page=changes>
Changes:
[zyichi] Fix PairWithRestrictionFn process no attribute signature error
[Boyuan Zhang] Handle split when truncate observes windows.
[noreply] [BEAM-10821] Add Python SDK typing improvements to CHANGES.md (#12693)
------------------------------------------
[...truncated 212.63 KB...]
"parallel_input": {
"@type": "OutputReference",
"output_name": "None",
"step_name": "s8"
},
"user_name": "Write/Write/WriteImpl/FinalizeWrite/_UnpickledSideInput(InitializeWrite.out.0)",
"windowing_strategy": "%0A%98%07%22%40%0A%1Dref_Coder_GlobalWindowCoder_1%12%1F%0A%1D%0A%1Bbeam%3Acoder%3Aglobal_window%3Av1%2A%D3%06%0A%25ref_Environment_default_environment_1%12%A9%06%12%12beam%3Aenv%3Adocker%3Av1%1A%3B%0A9gcr.io/cloud-dataflow/v1beta3/python%3Abeam-master-20200630%2A%14beam%3Acoder%3Avarint%3Av1%2A%13beam%3Acoder%3Abytes%3Av1%2A%13beam%3Acoder%3Atimer%3Av1%2A%1Bbeam%3Acoder%3Aglobal_window%3Av1%2A%1Dbeam%3Acoder%3Ainterval_window%3Av1%2A%16beam%3Acoder%3Aiterable%3Av1%2A%23beam%3Acoder%3Astate_backed_iterable%3Av1%2A%1Cbeam%3Acoder%3Awindowed_value%3Av1%2A%22beam%3Acoder%3Aparam_windowed_value%3Av1%2A%14beam%3Acoder%3Adouble%3Av1%2A%19beam%3Acoder%3Astring_utf8%3Av1%2A%1Bbeam%3Acoder%3Alength_prefix%3Av1%2A%12beam%3Acoder%3Abool%3Av1%2A%10beam%3Acoder%3Akv%3Av1%2A%11beam%3Acoder%3Arow%3Av1%2A%23beam%3Aprotocol%3Aprogress_reporting%3Av0%2A%1Ebeam%3Aprotocol%3A****_status%3Av1%2A%3Abeam%3Aversion%3Asdk_base%3Aapache/beam_python2.7_sdk%3A2.25.0.dev2%D2%01%0A%1Abeam%3Aartifact%3Atype%3Afile%3Av1%12w%0Au<https://ci-beam.apache.org/job/beam_PerformanceTests_WordCountIT_Py27/ws/src/sdks/python/build/apache-beam.tar.gz%1A%20beam%3Aartifact%3Arole%3Astaging_to%3Av1%22%19%0A%17dataflow_python_sdk.tarjx%0A%22%0A%20beam%3Awindow_fn%3Aglobal_windows%3Av1%10%01%1A%1Dref_Coder_GlobalWindowCoder_1%22%02%3A%00%28%010%018%01H%01Z%25ref_Environment_default_environment_1">
}
},
{
"kind": "CollectionToSingleton",
"name": "SideInput-s19",
"properties": {
"output_info": [
{
"encoding": {
"@type": "kind:stream",
"component_encodings": [
{
"@type": "kind:windowed_value",
"component_encodings": [
{
"@type": "FastPrimitivesCoder$<string of 176 bytes>",
"component_encodings": [
{
"@type": "FastPrimitivesCoder$<string of 176 bytes>",
"component_encodings": [],
"pipeline_proto_coder_id": "ref_Coder_FastPrimitivesCoder_5"
},
{
"@type": "FastPrimitivesCoder$<string of 176 bytes>",
"component_encodings": [],
"pipeline_proto_coder_id": "ref_Coder_FastPrimitivesCoder_5"
}
],
"is_pair_like": true,
"pipeline_proto_coder_id": "ref_Coder_FastPrimitivesCoder_5"
},
{
"@type": "kind:global_window"
}
],
"is_wrapper": true
}
],
"is_stream_like": {
"value": true
}
},
"output_name": "out",
"user_name": "Write/Write/WriteImpl/FinalizeWrite/_UnpickledSideInput(Extract.out.0).output"
}
],
"parallel_input": {
"@type": "OutputReference",
"output_name": "None",
"step_name": "s14"
},
"user_name": "Write/Write/WriteImpl/FinalizeWrite/_UnpickledSideInput(Extract.out.0)",
"windowing_strategy": "%0A%98%07%22%40%0A%1Dref_Coder_GlobalWindowCoder_1%12%1F%0A%1D%0A%1Bbeam%3Acoder%3Aglobal_window%3Av1%2A%D3%06%0A%25ref_Environment_default_environment_1%12%A9%06%12%12beam%3Aenv%3Adocker%3Av1%1A%3B%0A9gcr.io/cloud-dataflow/v1beta3/python%3Abeam-master-20200630%2A%14beam%3Acoder%3Avarint%3Av1%2A%13beam%3Acoder%3Abytes%3Av1%2A%13beam%3Acoder%3Atimer%3Av1%2A%1Bbeam%3Acoder%3Aglobal_window%3Av1%2A%1Dbeam%3Acoder%3Ainterval_window%3Av1%2A%16beam%3Acoder%3Aiterable%3Av1%2A%23beam%3Acoder%3Astate_backed_iterable%3Av1%2A%1Cbeam%3Acoder%3Awindowed_value%3Av1%2A%22beam%3Acoder%3Aparam_windowed_value%3Av1%2A%14beam%3Acoder%3Adouble%3Av1%2A%19beam%3Acoder%3Astring_utf8%3Av1%2A%1Bbeam%3Acoder%3Alength_prefix%3Av1%2A%12beam%3Acoder%3Abool%3Av1%2A%10beam%3Acoder%3Akv%3Av1%2A%11beam%3Acoder%3Arow%3Av1%2A%23beam%3Aprotocol%3Aprogress_reporting%3Av0%2A%1Ebeam%3Aprotocol%3A****_status%3Av1%2A%3Abeam%3Aversion%3Asdk_base%3Aapache/beam_python2.7_sdk%3A2.25.0.dev2%D2%01%0A%1Abeam%3Aartifact%3Atype%3Afile%3Av1%12w%0Au<https://ci-beam.apache.org/job/beam_PerformanceTests_WordCountIT_Py27/ws/src/sdks/python/build/apache-beam.tar.gz%1A%20beam%3Aartifact%3Arole%3Astaging_to%3Av1%22%19%0A%17dataflow_python_sdk.tarjx%0A%22%0A%20beam%3Awindow_fn%3Aglobal_windows%3Av1%10%01%1A%1Dref_Coder_GlobalWindowCoder_1%22%02%3A%00%28%010%018%01H%01Z%25ref_Environment_default_environment_1">
}
},
{
"kind": "CollectionToSingleton",
"name": "SideInput-s20",
"properties": {
"output_info": [
{
"encoding": {
"@type": "kind:stream",
"component_encodings": [
{
"@type": "kind:windowed_value",
"component_encodings": [
{
"@type": "FastPrimitivesCoder$<string of 176 bytes>",
"component_encodings": [
{
"@type": "FastPrimitivesCoder$<string of 176 bytes>",
"component_encodings": [],
"pipeline_proto_coder_id": "ref_Coder_FastPrimitivesCoder_5"
},
{
"@type": "FastPrimitivesCoder$<string of 176 bytes>",
"component_encodings": [],
"pipeline_proto_coder_id": "ref_Coder_FastPrimitivesCoder_5"
}
],
"is_pair_like": true,
"pipeline_proto_coder_id": "ref_Coder_FastPrimitivesCoder_5"
},
{
"@type": "kind:global_window"
}
],
"is_wrapper": true
}
],
"is_stream_like": {
"value": true
}
},
"output_name": "out",
"user_name": "Write/Write/WriteImpl/FinalizeWrite/_UnpickledSideInput(PreFinalize.out.0).output"
}
],
"parallel_input": {
"@type": "OutputReference",
"output_name": "None",
"step_name": "s17"
},
"user_name": "Write/Write/WriteImpl/FinalizeWrite/_UnpickledSideInput(PreFinalize.out.0)",
"windowing_strategy": "%0A%98%07%22%40%0A%1Dref_Coder_GlobalWindowCoder_1%12%1F%0A%1D%0A%1Bbeam%3Acoder%3Aglobal_window%3Av1%2A%D3%06%0A%25ref_Environment_default_environment_1%12%A9%06%12%12beam%3Aenv%3Adocker%3Av1%1A%3B%0A9gcr.io/cloud-dataflow/v1beta3/python%3Abeam-master-20200630%2A%14beam%3Acoder%3Avarint%3Av1%2A%13beam%3Acoder%3Abytes%3Av1%2A%13beam%3Acoder%3Atimer%3Av1%2A%1Bbeam%3Acoder%3Aglobal_window%3Av1%2A%1Dbeam%3Acoder%3Ainterval_window%3Av1%2A%16beam%3Acoder%3Aiterable%3Av1%2A%23beam%3Acoder%3Astate_backed_iterable%3Av1%2A%1Cbeam%3Acoder%3Awindowed_value%3Av1%2A%22beam%3Acoder%3Aparam_windowed_value%3Av1%2A%14beam%3Acoder%3Adouble%3Av1%2A%19beam%3Acoder%3Astring_utf8%3Av1%2A%1Bbeam%3Acoder%3Alength_prefix%3Av1%2A%12beam%3Acoder%3Abool%3Av1%2A%10beam%3Acoder%3Akv%3Av1%2A%11beam%3Acoder%3Arow%3Av1%2A%23beam%3Aprotocol%3Aprogress_reporting%3Av0%2A%1Ebeam%3Aprotocol%3A****_status%3Av1%2A%3Abeam%3Aversion%3Asdk_base%3Aapache/beam_python2.7_sdk%3A2.25.0.dev2%D2%01%0A%1Abeam%3Aartifact%3Atype%3Afile%3Av1%12w%0Au<https://ci-beam.apache.org/job/beam_PerformanceTests_WordCountIT_Py27/ws/src/sdks/python/build/apache-beam.tar.gz%1A%20beam%3Aartifact%3Arole%3Astaging_to%3Av1%22%19%0A%17dataflow_python_sdk.tarjx%0A%22%0A%20beam%3Awindow_fn%3Aglobal_windows%3Av1%10%01%1A%1Dref_Coder_GlobalWindowCoder_1%22%02%3A%00%28%010%018%01H%01Z%25ref_Environment_default_environment_1">
}
},
{
"kind": "ParallelDo",
"name": "s21",
"properties": {
"display_data": [
{
"key": "fn",
"label": "Transform Function",
"namespace": "apache_beam.transforms.core.CallableWrapperDoFn",
"type": "STRING",
"value": "_finalize_write"
},
{
"key": "fn",
"label": "Transform Function",
"namespace": "apache_beam.transforms.core.ParDo",
"shortValue": "CallableWrapperDoFn",
"type": "STRING",
"value": "apache_beam.transforms.core.CallableWrapperDoFn"
}
],
"non_parallel_inputs": {
"python_side_input0-Write/Write/WriteImpl/FinalizeWrite": {
"@type": "OutputReference",
"output_name": "out",
"step_name": "SideInput-s18"
},
"python_side_input1-Write/Write/WriteImpl/FinalizeWrite": {
"@type": "OutputReference",
"output_name": "out",
"step_name": "SideInput-s19"
},
"python_side_input2-Write/Write/WriteImpl/FinalizeWrite": {
"@type": "OutputReference",
"output_name": "out",
"step_name": "SideInput-s20"
}
},
"output_info": [
{
"encoding": {
"@type": "kind:windowed_value",
"component_encodings": [
{
"@type": "FastPrimitivesCoder$<string of 176 bytes>",
"component_encodings": [
{
"@type": "FastPrimitivesCoder$<string of 176 bytes>",
"component_encodings": [],
"pipeline_proto_coder_id": "ref_Coder_FastPrimitivesCoder_5"
},
{
"@type": "FastPrimitivesCoder$<string of 176 bytes>",
"component_encodings": [],
"pipeline_proto_coder_id": "ref_Coder_FastPrimitivesCoder_5"
}
],
"is_pair_like": true,
"pipeline_proto_coder_id": "ref_Coder_FastPrimitivesCoder_5"
},
{
"@type": "kind:global_window"
}
],
"is_wrapper": true
},
"output_name": "None",
"user_name": "Write/Write/WriteImpl/FinalizeWrite.out"
}
],
"parallel_input": {
"@type": "OutputReference",
"output_name": "out",
"step_name": "s7"
},
"serialized_fn": "<string of 3544 bytes>",
"user_name": "Write/Write/WriteImpl/FinalizeWrite/FinalizeWrite"
}
}
],
"type": "JOB_TYPE_BATCH"
}
apache_beam.runners.dataflow.internal.apiclient: INFO: Create job: <Job
createTime: u'2020-08-27T06:09:26.374993Z'
currentStateTime: u'1970-01-01T00:00:00Z'
id: u'2020-08-26_23_09_25-701490291532778496'
location: u'us-central1'
name: u'performance-tests-wordcount-python27-batch-1gb0827050318'
projectId: u'apache-beam-testing'
stageStates: []
startTime: u'2020-08-27T06:09:26.374993Z'
steps: []
tempFiles: []
type: TypeValueValuesEnum(JOB_TYPE_BATCH, 1)>
apache_beam.runners.dataflow.internal.apiclient: INFO: Created job with id: [2020-08-26_23_09_25-701490291532778496]
apache_beam.runners.dataflow.internal.apiclient: INFO: Submitted job: 2020-08-26_23_09_25-701490291532778496
apache_beam.runners.dataflow.internal.apiclient: INFO: To access the Dataflow monitoring console, please navigate to https://console.cloud.google.com/dataflow/jobs/us-central1/2020-08-26_23_09_25-701490291532778496?project=apache-beam-testing
--------------------- >> end captured logging << ---------------------
----------------------------------------------------------------------
XML: nosetests-runPerformanceTest-df-py27.xml
----------------------------------------------------------------------
XML: <https://ci-beam.apache.org/job/beam_PerformanceTests_WordCountIT_Py27/ws/src/sdks/python/nosetests.xml>
----------------------------------------------------------------------
Ran 1 test in 20.652s
FAILED (failures=1)
> Task :sdks:python:test-suites:dataflow:py2:runPerformanceTest FAILED
:sdks:python:test-suites:dataflow:py2:runPerformanceTest (Thread[Execution **** for ':',5,main]) completed. Took 22.822 secs.
FAILURE: Build failed with an exception.
* What went wrong:
Execution failed for task ':sdks:python:test-suites:dataflow:py2:runPerformanceTest'.
> Process 'command 'sh'' finished with non-zero exit value 1
* Try:
Run with --stacktrace option to get the stack trace. Run with --debug option to get more log output. Run with --scan to get full insights.
* Get more help at https://help.gradle.org
Deprecated Gradle features were used in this build, making it incompatible with Gradle 6.0.
Use '--warning-mode all' to show the individual deprecation warnings.
See https://docs.gradle.org/5.2.1/userguide/command_line_interface.html#sec:command_line_warnings
BUILD FAILED in 1m 24s
5 actionable tasks: 5 executed
Publishing build scan...
https://gradle.com/s/u4ouerukjea7w
Build step 'Invoke Gradle script' changed build result to FAILURE
Build step 'Invoke Gradle script' marked build as failure
---------------------------------------------------------------------
To unsubscribe, e-mail: builds-unsubscribe@beam.apache.org
For additional commands, e-mail: builds-help@beam.apache.org
Build failed in Jenkins: beam_PerformanceTests_WordCountIT_Py27
#1874
Posted by Apache Jenkins Server <je...@builds.apache.org>.
See <https://ci-beam.apache.org/job/beam_PerformanceTests_WordCountIT_Py27/1874/display/redirect?page=changes>
Changes:
[leiyiz] implement query 12
[saavan] Fix author names
[noreply] [BEAM-10701] Add codecov config, fix paths hopefully (#12684)
[noreply] Merge pull request #12674 from [BEAM-8258] basic metric feature for
[noreply] Add skipped tests for Series.dt and Series.str methods (#12615)
[noreply] [BEAM-9547] Add a few more DataFrame operations (#12682)
------------------------------------------
[...truncated 242.67 KB...]
"python_side_input2-Write/Write/WriteImpl/FinalizeWrite": {
"@type": "OutputReference",
"output_name": "out",
"step_name": "SideInput-s20"
}
},
"output_info": [
{
"encoding": {
"@type": "kind:windowed_value",
"component_encodings": [
{
"@type": "FastPrimitivesCoder$<string of 176 bytes>",
"component_encodings": [
{
"@type": "FastPrimitivesCoder$<string of 176 bytes>",
"component_encodings": [],
"pipeline_proto_coder_id": "ref_Coder_FastPrimitivesCoder_5"
},
{
"@type": "FastPrimitivesCoder$<string of 176 bytes>",
"component_encodings": [],
"pipeline_proto_coder_id": "ref_Coder_FastPrimitivesCoder_5"
}
],
"is_pair_like": true,
"pipeline_proto_coder_id": "ref_Coder_FastPrimitivesCoder_5"
},
{
"@type": "kind:global_window"
}
],
"is_wrapper": true
},
"output_name": "None",
"user_name": "Write/Write/WriteImpl/FinalizeWrite.out"
}
],
"parallel_input": {
"@type": "OutputReference",
"output_name": "out",
"step_name": "s7"
},
"serialized_fn": "<string of 3492 bytes>",
"user_name": "Write/Write/WriteImpl/FinalizeWrite/FinalizeWrite"
}
}
],
"type": "JOB_TYPE_BATCH"
}
apache_beam.runners.dataflow.internal.apiclient: INFO: Create job: <Job
createTime: u'2020-08-27T00:10:18.973708Z'
currentStateTime: u'1970-01-01T00:00:00Z'
id: u'2020-08-26_17_10_08-9871808995493422516'
location: u'us-central1'
name: u'performance-tests-wordcount-python27-batch-1gb0826200325'
projectId: u'apache-beam-testing'
stageStates: []
startTime: u'2020-08-27T00:10:18.973708Z'
steps: []
tempFiles: []
type: TypeValueValuesEnum(JOB_TYPE_BATCH, 1)>
apache_beam.runners.dataflow.internal.apiclient: INFO: Created job with id: [2020-08-26_17_10_08-9871808995493422516]
apache_beam.runners.dataflow.internal.apiclient: INFO: Submitted job: 2020-08-26_17_10_08-9871808995493422516
apache_beam.runners.dataflow.internal.apiclient: INFO: To access the Dataflow monitoring console, please navigate to https://console.cloud.google.com/dataflow/jobs/us-central1/2020-08-26_17_10_08-9871808995493422516?project=apache-beam-testing
apache_beam.runners.dataflow.dataflow_runner: INFO: Job 2020-08-26_17_10_08-9871808995493422516 is in state JOB_STATE_RUNNING
apache_beam.runners.dataflow.dataflow_runner: INFO: 2020-08-27T00:10:22.012Z: JOB_MESSAGE_BASIC: Worker configuration: n1-standard-1 in us-central1-a.
apache_beam.runners.dataflow.dataflow_runner: INFO: 2020-08-27T00:10:22.864Z: JOB_MESSAGE_DETAILED: Expanding CoGroupByKey operations into optimizable parts.
apache_beam.runners.dataflow.dataflow_runner: INFO: 2020-08-27T00:10:22.901Z: JOB_MESSAGE_DEBUG: Combiner lifting skipped for step Write/Write/WriteImpl/GroupByKey: GroupByKey not followed by a combiner.
apache_beam.runners.dataflow.dataflow_runner: INFO: 2020-08-27T00:10:23.034Z: JOB_MESSAGE_DETAILED: Expanding GroupByKey operations into optimizable parts.
apache_beam.runners.dataflow.dataflow_runner: INFO: 2020-08-27T00:10:23.060Z: JOB_MESSAGE_DETAILED: Lifting ValueCombiningMappingFns into MergeBucketsMappingFns
apache_beam.runners.dataflow.dataflow_runner: INFO: 2020-08-27T00:10:23.165Z: JOB_MESSAGE_DEBUG: Annotating graph with Autotuner information.
apache_beam.runners.dataflow.dataflow_runner: INFO: 2020-08-27T00:10:23.199Z: JOB_MESSAGE_DETAILED: Fusing adjacent ParDo, Read, Write, and Flatten operations
apache_beam.runners.dataflow.dataflow_runner: INFO: 2020-08-27T00:10:23.304Z: JOB_MESSAGE_DETAILED: Fusing consumer Split into Read/Read
apache_beam.runners.dataflow.dataflow_runner: INFO: 2020-08-27T00:10:23.339Z: JOB_MESSAGE_DETAILED: Fusing consumer PairWIthOne into Split
apache_beam.runners.dataflow.dataflow_runner: INFO: 2020-08-27T00:10:23.373Z: JOB_MESSAGE_DETAILED: Fusing consumer GroupAndSum/GroupByKey+GroupAndSum/Combine/Partial into PairWIthOne
apache_beam.runners.dataflow.dataflow_runner: INFO: 2020-08-27T00:10:23.406Z: JOB_MESSAGE_DETAILED: Fusing consumer GroupAndSum/GroupByKey/Reify into GroupAndSum/GroupByKey+GroupAndSum/Combine/Partial
apache_beam.runners.dataflow.dataflow_runner: INFO: 2020-08-27T00:10:23.431Z: JOB_MESSAGE_DETAILED: Fusing consumer GroupAndSum/GroupByKey/Write into GroupAndSum/GroupByKey/Reify
apache_beam.runners.dataflow.dataflow_runner: INFO: 2020-08-27T00:10:23.455Z: JOB_MESSAGE_DETAILED: Fusing consumer GroupAndSum/Combine into GroupAndSum/GroupByKey/Read
apache_beam.runners.dataflow.dataflow_runner: INFO: 2020-08-27T00:10:23.488Z: JOB_MESSAGE_DETAILED: Fusing consumer GroupAndSum/Combine/Extract into GroupAndSum/Combine
apache_beam.runners.dataflow.dataflow_runner: INFO: 2020-08-27T00:10:23.515Z: JOB_MESSAGE_DETAILED: Fusing consumer Format into GroupAndSum/Combine/Extract
apache_beam.runners.dataflow.dataflow_runner: INFO: 2020-08-27T00:10:23.535Z: JOB_MESSAGE_DETAILED: Fusing consumer Write/Write/WriteImpl/WindowInto(WindowIntoFn) into Format
apache_beam.runners.dataflow.dataflow_runner: INFO: 2020-08-27T00:10:23.578Z: JOB_MESSAGE_DETAILED: Fusing consumer Write/Write/WriteImpl/WriteBundles/WriteBundles into Write/Write/WriteImpl/WindowInto(WindowIntoFn)
apache_beam.runners.dataflow.dataflow_runner: INFO: 2020-08-27T00:10:23.610Z: JOB_MESSAGE_DETAILED: Fusing consumer Write/Write/WriteImpl/Pair into Write/Write/WriteImpl/WriteBundles/WriteBundles
apache_beam.runners.dataflow.dataflow_runner: INFO: 2020-08-27T00:10:23.642Z: JOB_MESSAGE_DETAILED: Fusing consumer Write/Write/WriteImpl/GroupByKey/Reify into Write/Write/WriteImpl/Pair
apache_beam.runners.dataflow.dataflow_runner: INFO: 2020-08-27T00:10:23.668Z: JOB_MESSAGE_DETAILED: Fusing consumer Write/Write/WriteImpl/GroupByKey/Write into Write/Write/WriteImpl/GroupByKey/Reify
apache_beam.runners.dataflow.dataflow_runner: INFO: 2020-08-27T00:10:23.703Z: JOB_MESSAGE_DETAILED: Fusing consumer Write/Write/WriteImpl/GroupByKey/GroupByWindow into Write/Write/WriteImpl/GroupByKey/Read
apache_beam.runners.dataflow.dataflow_runner: INFO: 2020-08-27T00:10:23.736Z: JOB_MESSAGE_DETAILED: Fusing consumer Write/Write/WriteImpl/Extract into Write/Write/WriteImpl/GroupByKey/GroupByWindow
apache_beam.runners.dataflow.dataflow_runner: INFO: 2020-08-27T00:10:23.772Z: JOB_MESSAGE_DETAILED: Fusing consumer Write/Write/WriteImpl/InitializeWrite into Write/Write/WriteImpl/DoOnce/Read
apache_beam.runners.dataflow.dataflow_runner: INFO: 2020-08-27T00:10:23.809Z: JOB_MESSAGE_DEBUG: Workflow config is missing a default resource spec.
apache_beam.runners.dataflow.dataflow_runner: INFO: 2020-08-27T00:10:23.842Z: JOB_MESSAGE_DEBUG: Adding StepResource setup and teardown to workflow graph.
apache_beam.runners.dataflow.dataflow_runner: INFO: 2020-08-27T00:10:23.879Z: JOB_MESSAGE_DEBUG: Adding workflow start and stop steps.
apache_beam.runners.dataflow.dataflow_runner: INFO: 2020-08-27T00:10:23.913Z: JOB_MESSAGE_DEBUG: Assigning stage ids.
apache_beam.runners.dataflow.dataflow_runner: INFO: 2020-08-27T00:10:24.051Z: JOB_MESSAGE_DEBUG: Executing wait step start35
apache_beam.runners.dataflow.dataflow_runner: INFO: 2020-08-27T00:10:24.163Z: JOB_MESSAGE_BASIC: Executing operation Write/Write/WriteImpl/DoOnce/Read+Write/Write/WriteImpl/InitializeWrite
apache_beam.runners.dataflow.dataflow_runner: INFO: 2020-08-27T00:10:24.199Z: JOB_MESSAGE_BASIC: Executing operation Write/Write/WriteImpl/GroupByKey/Create
apache_beam.runners.dataflow.dataflow_runner: INFO: 2020-08-27T00:10:24.200Z: JOB_MESSAGE_DEBUG: Starting **** pool setup.
apache_beam.runners.dataflow.dataflow_runner: INFO: 2020-08-27T00:10:24.223Z: JOB_MESSAGE_BASIC: Executing operation GroupAndSum/GroupByKey/Create
apache_beam.runners.dataflow.dataflow_runner: INFO: 2020-08-27T00:10:24.223Z: JOB_MESSAGE_BASIC: Starting 10 ****s in us-central1-a...
apache_beam.runners.dataflow.dataflow_runner: INFO: 2020-08-27T00:10:24.279Z: JOB_MESSAGE_BASIC: Finished operation GroupAndSum/GroupByKey/Create
apache_beam.runners.dataflow.dataflow_runner: INFO: 2020-08-27T00:10:24.279Z: JOB_MESSAGE_BASIC: Finished operation Write/Write/WriteImpl/GroupByKey/Create
apache_beam.runners.dataflow.dataflow_runner: INFO: 2020-08-27T00:10:24.340Z: JOB_MESSAGE_DEBUG: Value "Write/Write/WriteImpl/GroupByKey/Session" materialized.
apache_beam.runners.dataflow.dataflow_runner: INFO: 2020-08-27T00:10:24.378Z: JOB_MESSAGE_DEBUG: Value "GroupAndSum/GroupByKey/Session" materialized.
apache_beam.runners.dataflow.dataflow_runner: INFO: 2020-08-27T00:10:24.447Z: JOB_MESSAGE_BASIC: Executing operation Read/Read+Split+PairWIthOne+GroupAndSum/GroupByKey+GroupAndSum/Combine/Partial+GroupAndSum/GroupByKey/Reify+GroupAndSum/GroupByKey/Write
apache_beam.runners.dataflow.dataflow_runner: INFO: 2020-08-27T00:10:40.100Z: JOB_MESSAGE_WARNING: Your project already contains 100 Dataflow-created metric descriptors and Stackdriver will not create new Dataflow custom metrics for this job. Each unique user-defined metric name (independent of the DoFn in which it is defined) produces a new metric descriptor. To delete old / unused metric descriptors see https://developers.google.com/apis-explorer/#p/monitoring/v3/monitoring.projects.metricDescriptors.list and https://developers.google.com/apis-explorer/#p/monitoring/v3/monitoring.projects.metricDescriptors.delete
apache_beam.runners.dataflow.dataflow_runner: INFO: 2020-08-27T00:10:58.640Z: JOB_MESSAGE_DETAILED: Autoscaling: Raised the number of ****s to 1 based on the rate of progress in the currently running stage(s).
apache_beam.runners.dataflow.dataflow_runner: INFO: 2020-08-27T00:10:58.669Z: JOB_MESSAGE_DETAILED: Resized **** pool to 1, though goal was 10. This could be a quota issue.
apache_beam.runners.dataflow.dataflow_runner: INFO: 2020-08-27T00:11:04.504Z: JOB_MESSAGE_DETAILED: Autoscaling: Raised the number of ****s to 9 based on the rate of progress in the currently running stage(s).
apache_beam.runners.dataflow.dataflow_runner: INFO: 2020-08-27T00:11:04.539Z: JOB_MESSAGE_DETAILED: Resized **** pool to 9, though goal was 10. This could be a quota issue.
apache_beam.runners.dataflow.dataflow_runner: INFO: 2020-08-27T00:11:10.036Z: JOB_MESSAGE_DETAILED: Autoscaling: Raised the number of ****s to 10 based on the rate of progress in the currently running stage(s).
apache_beam.runners.dataflow.dataflow_runner: INFO: 2020-08-27T00:12:37.399Z: JOB_MESSAGE_DETAILED: Workers have started successfully.
apache_beam.runners.dataflow.dataflow_runner: INFO: 2020-08-27T00:12:37.427Z: JOB_MESSAGE_DETAILED: Workers have started successfully.
apache_beam.runners.dataflow.dataflow_runner: INFO: 2020-08-27T00:15:42.702Z: JOB_MESSAGE_BASIC: Finished operation Write/Write/WriteImpl/DoOnce/Read+Write/Write/WriteImpl/InitializeWrite
apache_beam.runners.dataflow.dataflow_runner: INFO: 2020-08-27T00:15:42.765Z: JOB_MESSAGE_DEBUG: Value "Write/Write/WriteImpl/DoOnce/Read.out" materialized.
apache_beam.runners.dataflow.dataflow_runner: INFO: 2020-08-27T00:15:42.786Z: JOB_MESSAGE_DEBUG: Value "Write/Write/WriteImpl/InitializeWrite.out" materialized.
apache_beam.runners.dataflow.dataflow_runner: INFO: 2020-08-27T00:15:42.851Z: JOB_MESSAGE_BASIC: Executing operation Write/Write/WriteImpl/WriteBundles/_UnpickledSideInput(InitializeWrite.out.0)
apache_beam.runners.dataflow.dataflow_runner: INFO: 2020-08-27T00:15:42.885Z: JOB_MESSAGE_BASIC: Executing operation Write/Write/WriteImpl/FinalizeWrite/_UnpickledSideInput(InitializeWrite.out.0)
apache_beam.runners.dataflow.dataflow_runner: INFO: 2020-08-27T00:15:42.900Z: JOB_MESSAGE_BASIC: Finished operation Write/Write/WriteImpl/WriteBundles/_UnpickledSideInput(InitializeWrite.out.0)
apache_beam.runners.dataflow.dataflow_runner: INFO: 2020-08-27T00:15:42.912Z: JOB_MESSAGE_BASIC: Executing operation Write/Write/WriteImpl/PreFinalize/_UnpickledSideInput(InitializeWrite.out.0)
apache_beam.runners.dataflow.dataflow_runner: INFO: 2020-08-27T00:15:42.929Z: JOB_MESSAGE_BASIC: Finished operation Write/Write/WriteImpl/FinalizeWrite/_UnpickledSideInput(InitializeWrite.out.0)
apache_beam.runners.dataflow.dataflow_runner: INFO: 2020-08-27T00:15:42.962Z: JOB_MESSAGE_BASIC: Finished operation Write/Write/WriteImpl/PreFinalize/_UnpickledSideInput(InitializeWrite.out.0)
apache_beam.runners.dataflow.dataflow_runner: INFO: 2020-08-27T00:15:42.967Z: JOB_MESSAGE_DEBUG: Value "Write/Write/WriteImpl/WriteBundles/_UnpickledSideInput(InitializeWrite.out.0).output" materialized.
apache_beam.runners.dataflow.dataflow_runner: INFO: 2020-08-27T00:15:43Z: JOB_MESSAGE_DEBUG: Value "Write/Write/WriteImpl/FinalizeWrite/_UnpickledSideInput(InitializeWrite.out.0).output" materialized.
apache_beam.runners.dataflow.dataflow_runner: INFO: 2020-08-27T00:15:43.024Z: JOB_MESSAGE_DEBUG: Value "Write/Write/WriteImpl/PreFinalize/_UnpickledSideInput(InitializeWrite.out.0).output" materialized.
apache_beam.runners.dataflow.dataflow_runner: INFO: 2020-08-27T00:18:19.309Z: JOB_MESSAGE_BASIC: Finished operation Read/Read+Split+PairWIthOne+GroupAndSum/GroupByKey+GroupAndSum/Combine/Partial+GroupAndSum/GroupByKey/Reify+GroupAndSum/GroupByKey/Write
apache_beam.runners.dataflow.dataflow_runner: INFO: 2020-08-27T00:18:19.385Z: JOB_MESSAGE_BASIC: Executing operation GroupAndSum/GroupByKey/Close
apache_beam.runners.dataflow.dataflow_runner: INFO: 2020-08-27T00:18:19.435Z: JOB_MESSAGE_BASIC: Finished operation GroupAndSum/GroupByKey/Close
apache_beam.runners.dataflow.dataflow_runner: INFO: 2020-08-27T00:18:19.500Z: JOB_MESSAGE_BASIC: Executing operation GroupAndSum/GroupByKey/Read+GroupAndSum/Combine+GroupAndSum/Combine/Extract+Format+Write/Write/WriteImpl/WindowInto(WindowIntoFn)+Write/Write/WriteImpl/WriteBundles/WriteBundles+Write/Write/WriteImpl/Pair+Write/Write/WriteImpl/GroupByKey/Reify+Write/Write/WriteImpl/GroupByKey/Write
apache_beam.runners.dataflow.dataflow_runner: INFO: 2020-08-27T00:21:32.921Z: JOB_MESSAGE_BASIC: Finished operation GroupAndSum/GroupByKey/Read+GroupAndSum/Combine+GroupAndSum/Combine/Extract+Format+Write/Write/WriteImpl/WindowInto(WindowIntoFn)+Write/Write/WriteImpl/WriteBundles/WriteBundles+Write/Write/WriteImpl/Pair+Write/Write/WriteImpl/GroupByKey/Reify+Write/Write/WriteImpl/GroupByKey/Write
apache_beam.runners.dataflow.dataflow_runner: INFO: 2020-08-27T00:21:33.086Z: JOB_MESSAGE_BASIC: Executing operation Write/Write/WriteImpl/GroupByKey/Close
apache_beam.runners.dataflow.dataflow_runner: INFO: 2020-08-27T00:21:33.139Z: JOB_MESSAGE_BASIC: Finished operation Write/Write/WriteImpl/GroupByKey/Close
apache_beam.runners.dataflow.dataflow_runner: INFO: 2020-08-27T00:21:33.226Z: JOB_MESSAGE_BASIC: Executing operation Write/Write/WriteImpl/GroupByKey/Read+Write/Write/WriteImpl/GroupByKey/GroupByWindow+Write/Write/WriteImpl/Extract
apache_beam.runners.dataflow.dataflow_runner: INFO: 2020-08-27T00:21:35.645Z: JOB_MESSAGE_BASIC: Finished operation Write/Write/WriteImpl/GroupByKey/Read+Write/Write/WriteImpl/GroupByKey/GroupByWindow+Write/Write/WriteImpl/Extract
apache_beam.runners.dataflow.dataflow_runner: INFO: 2020-08-27T00:21:35.717Z: JOB_MESSAGE_DEBUG: Value "Write/Write/WriteImpl/Extract.out" materialized.
apache_beam.runners.dataflow.dataflow_runner: INFO: 2020-08-27T00:21:35.789Z: JOB_MESSAGE_BASIC: Executing operation Write/Write/WriteImpl/FinalizeWrite/_UnpickledSideInput(Extract.out.0)
apache_beam.runners.dataflow.dataflow_runner: INFO: 2020-08-27T00:21:35.813Z: JOB_MESSAGE_BASIC: Executing operation Write/Write/WriteImpl/PreFinalize/_UnpickledSideInput(Extract.out.0)
apache_beam.runners.dataflow.dataflow_runner: INFO: 2020-08-27T00:21:35.848Z: JOB_MESSAGE_BASIC: Finished operation Write/Write/WriteImpl/FinalizeWrite/_UnpickledSideInput(Extract.out.0)
apache_beam.runners.dataflow.dataflow_runner: INFO: 2020-08-27T00:21:35.867Z: JOB_MESSAGE_BASIC: Finished operation Write/Write/WriteImpl/PreFinalize/_UnpickledSideInput(Extract.out.0)
apache_beam.runners.dataflow.dataflow_runner: INFO: 2020-08-27T00:21:35.924Z: JOB_MESSAGE_DEBUG: Value "Write/Write/WriteImpl/FinalizeWrite/_UnpickledSideInput(Extract.out.0).output" materialized.
apache_beam.runners.dataflow.dataflow_runner: INFO: 2020-08-27T00:21:35.960Z: JOB_MESSAGE_DEBUG: Value "Write/Write/WriteImpl/PreFinalize/_UnpickledSideInput(Extract.out.0).output" materialized.
apache_beam.runners.dataflow.dataflow_runner: INFO: 2020-08-27T00:21:36.031Z: JOB_MESSAGE_BASIC: Executing operation Write/Write/WriteImpl/PreFinalize/PreFinalize
apache_beam.runners.dataflow.dataflow_runner: INFO: 2020-08-27T00:21:38.481Z: JOB_MESSAGE_BASIC: Finished operation Write/Write/WriteImpl/PreFinalize/PreFinalize
apache_beam.runners.dataflow.dataflow_runner: INFO: 2020-08-27T00:21:38.553Z: JOB_MESSAGE_DEBUG: Value "Write/Write/WriteImpl/PreFinalize.out" materialized.
apache_beam.runners.dataflow.dataflow_runner: INFO: 2020-08-27T00:21:38.623Z: JOB_MESSAGE_BASIC: Executing operation Write/Write/WriteImpl/FinalizeWrite/_UnpickledSideInput(PreFinalize.out.0)
apache_beam.runners.dataflow.dataflow_runner: INFO: 2020-08-27T00:21:38.690Z: JOB_MESSAGE_BASIC: Finished operation Write/Write/WriteImpl/FinalizeWrite/_UnpickledSideInput(PreFinalize.out.0)
apache_beam.runners.dataflow.dataflow_runner: INFO: 2020-08-27T00:21:38.760Z: JOB_MESSAGE_DEBUG: Value "Write/Write/WriteImpl/FinalizeWrite/_UnpickledSideInput(PreFinalize.out.0).output" materialized.
apache_beam.runners.dataflow.dataflow_runner: INFO: 2020-08-27T00:21:38.830Z: JOB_MESSAGE_BASIC: Executing operation Write/Write/WriteImpl/FinalizeWrite/FinalizeWrite
apache_beam.runners.dataflow.dataflow_runner: INFO: 2020-08-27T00:21:41.608Z: JOB_MESSAGE_BASIC: Finished operation Write/Write/WriteImpl/FinalizeWrite/FinalizeWrite
apache_beam.runners.dataflow.dataflow_runner: INFO: 2020-08-27T00:21:41.682Z: JOB_MESSAGE_DEBUG: Executing success step success33
apache_beam.runners.dataflow.dataflow_runner: INFO: 2020-08-27T00:21:41.742Z: JOB_MESSAGE_DETAILED: Cleaning up.
apache_beam.runners.dataflow.dataflow_runner: INFO: 2020-08-27T00:21:41.876Z: JOB_MESSAGE_DEBUG: Starting **** pool teardown.
apache_beam.runners.dataflow.dataflow_runner: INFO: 2020-08-27T00:21:41.896Z: JOB_MESSAGE_BASIC: Stopping **** pool...
apache_beam.runners.dataflow.dataflow_runner: INFO: 2020-08-27T00:22:42.586Z: JOB_MESSAGE_DETAILED: Autoscaling: Resized **** pool from 10 to 0.
apache_beam.runners.dataflow.dataflow_runner: INFO: 2020-08-27T00:22:42.636Z: JOB_MESSAGE_BASIC: Worker pool stopped.
apache_beam.runners.dataflow.dataflow_runner: INFO: 2020-08-27T00:22:42.681Z: JOB_MESSAGE_DEBUG: Tearing down pending resources...
apache_beam.runners.dataflow.dataflow_runner: INFO: Job 2020-08-26_17_10_08-9871808995493422516 is in state JOB_STATE_DONE
apache_beam.io.filesystem: DEBUG: Listing files in 'gs://temp-storage-for-end-to-end-tests/py-it-cloud/output/1598487005455/results'
apache_beam.io.filesystem: DEBUG: translate_pattern: 'gs://temp-storage-for-end-to-end-tests/py-it-cloud/output/1598487005455/results*-of-*' -> 'gs\\:\\/\\/temp\\-storage\\-for\\-end\\-to\\-end\\-tests\\/py\\-it\\-cloud\\/output\\/1598487005455\\/results[^/\\\\]*\\-of\\-[^/\\\\]*'
apache_beam.io.gcp.gcsio: INFO: Starting the size estimation of the input
apache_beam.io.gcp.gcsio: INFO: Finished listing 30 files in 0.0653400421143 seconds.
apache_beam.testing.pipeline_verifiers: INFO: Find 30 files in gs://temp-storage-for-end-to-end-tests/py-it-cloud/output/1598487005455/results*-of-*:
gs://temp-storage-for-end-to-end-tests/py-it-cloud/output/1598487005455/results-00007-of-00030
gs://temp-storage-for-end-to-end-tests/py-it-cloud/output/1598487005455/results-00024-of-00030
gs://temp-storage-for-end-to-end-tests/py-it-cloud/output/1598487005455/results-00021-of-00030
gs://temp-storage-for-end-to-end-tests/py-it-cloud/output/1598487005455/results-00002-of-00030
gs://temp-storage-for-end-to-end-tests/py-it-cloud/output/1598487005455/results-00006-of-00030
gs://temp-storage-for-end-to-end-tests/py-it-cloud/output/1598487005455/results-00019-of-00030
gs://temp-storage-for-end-to-end-tests/py-it-cloud/output/1598487005455/results-00008-of-00030
gs://temp-storage-for-end-to-end-tests/py-it-cloud/output/1598487005455/results-00028-of-00030
gs://temp-storage-for-end-to-end-tests/py-it-cloud/output/1598487005455/results-00012-of-00030
gs://temp-storage-for-end-to-end-tests/py-it-cloud/output/1598487005455/results-00000-of-00030
gs://temp-storage-for-end-to-end-tests/py-it-cloud/output/1598487005455/results-00015-of-00030
gs://temp-storage-for-end-to-end-tests/py-it-cloud/output/1598487005455/results-00005-of-00030
gs://temp-storage-for-end-to-end-tests/py-it-cloud/output/1598487005455/results-00004-of-00030
gs://temp-storage-for-end-to-end-tests/py-it-cloud/output/1598487005455/results-00010-of-00030
gs://temp-storage-for-end-to-end-tests/py-it-cloud/output/1598487005455/results-00014-of-00030
gs://temp-storage-for-end-to-end-tests/py-it-cloud/output/1598487005455/results-00011-of-00030
gs://temp-storage-for-end-to-end-tests/py-it-cloud/output/1598487005455/results-00026-of-00030
gs://temp-storage-for-end-to-end-tests/py-it-cloud/output/1598487005455/results-00018-of-00030
gs://temp-storage-for-end-to-end-tests/py-it-cloud/output/1598487005455/results-00001-of-00030
gs://temp-storage-for-end-to-end-tests/py-it-cloud/output/1598487005455/results-00029-of-00030
gs://temp-storage-for-end-to-end-tests/py-it-cloud/output/1598487005455/results-00023-of-00030
gs://temp-storage-for-end-to-end-tests/py-it-cloud/output/1598487005455/results-00009-of-00030
gs://temp-storage-for-end-to-end-tests/py-it-cloud/output/1598487005455/results-00022-of-00030
gs://temp-storage-for-end-to-end-tests/py-it-cloud/output/1598487005455/results-00027-of-00030
gs://temp-storage-for-end-to-end-tests/py-it-cloud/output/1598487005455/results-00013-of-00030
gs://temp-storage-for-end-to-end-tests/py-it-cloud/output/1598487005455/results-00025-of-00030
gs://temp-storage-for-end-to-end-tests/py-it-cloud/output/1598487005455/results-00020-of-00030
gs://temp-storage-for-end-to-end-tests/py-it-cloud/output/1598487005455/results-00016-of-00030
gs://temp-storage-for-end-to-end-tests/py-it-cloud/output/1598487005455/results-00017-of-00030
gs://temp-storage-for-end-to-end-tests/py-it-cloud/output/1598487005455/results-00003-of-00030
apache_beam.testing.pipeline_verifiers: INFO: Read from given path gs://temp-storage-for-end-to-end-tests/py-it-cloud/output/1598487005455/results*-of-*, 26186927 lines, checksum: ea0ca2e5ee4ea5f218790f28d0b9fe7d09d8d710.
google.auth._default: DEBUG: Checking None for explicit credentials as part of auth process...
google.auth._default: DEBUG: Checking Cloud SDK credentials as part of auth process...
google.auth._default: DEBUG: Cloud SDK credentials not found on disk; not using them
google.auth._default: DEBUG: Checking for App Engine runtime as part of auth process...
google.auth._default: DEBUG: No App Engine library was found so cannot authentication via App Engine Identity Credentials.
google.auth.transport._http_client: DEBUG: Making request: GET http://169.254.169.254
google.auth.transport._http_client: DEBUG: Making request: GET http://metadata.google.internal/computeMetadata/v1/project/project-id
urllib3.util.retry: DEBUG: Converted retries value: 3 -> Retry(total=3, connect=None, read=None, redirect=None, status=None)
google.auth.transport.requests: DEBUG: Making request: GET http://metadata.google.internal/computeMetadata/v1/instance/service-accounts/default/?recursive=true
urllib3.connectionpool: DEBUG: Starting new HTTP connection (1): metadata.google.internal:80
urllib3.connectionpool: DEBUG: http://metadata.google.internal:80 "GET /computeMetadata/v1/instance/service-accounts/default/?recursive=true HTTP/1.1" 200 144
google.auth.transport.requests: DEBUG: Making request: GET http://metadata.google.internal/computeMetadata/v1/instance/service-accounts/844138762903-compute@developer.gserviceaccount.com/token
urllib3.connectionpool: DEBUG: http://metadata.google.internal:80 "GET /computeMetadata/v1/instance/service-accounts/844138762903-compute@developer.gserviceaccount.com/token HTTP/1.1" 200 221
urllib3.connectionpool: DEBUG: Starting new HTTPS connection (1): bigquery.googleapis.com:443
urllib3.connectionpool: DEBUG: https://bigquery.googleapis.com:443 "GET /bigquery/v2/projects/apache-beam-testing/datasets/beam_performance HTTP/1.1" 200 None
urllib3.connectionpool: DEBUG: https://bigquery.googleapis.com:443 "GET /bigquery/v2/projects/apache-beam-testing/datasets/beam_performance/tables/wordcount_py27_pkb_results HTTP/1.1" 200 None
apache_beam.testing.load_tests.load_test_metrics_utils: INFO: Load test results for test: 27134448ec8e407bb97e2549d56fb587 and timestamp: 1598487907.4:
apache_beam.testing.load_tests.load_test_metrics_utils: INFO: Metric: runtime Value: 901
urllib3.connectionpool: DEBUG: https://bigquery.googleapis.com:443 "POST /bigquery/v2/projects/apache-beam-testing/datasets/beam_performance/tables/wordcount_py27_pkb_results/insertAll HTTP/1.1" 200 None
apache_beam.testing.load_tests.load_test_metrics_utils: ERROR: no such field.
--------------------- >> end captured logging << ---------------------
----------------------------------------------------------------------
XML: nosetests-runPerformanceTest-df-py27.xml
----------------------------------------------------------------------
XML: <https://ci-beam.apache.org/job/beam_PerformanceTests_WordCountIT_Py27/ws/src/sdks/python/nosetests.xml>
----------------------------------------------------------------------
Ran 1 test in 902.447s
FAILED (errors=1)
> Task :sdks:python:test-suites:dataflow:py2:runPerformanceTest FAILED
:sdks:python:test-suites:dataflow:py2:runPerformanceTest (Thread[Execution **** for ':',5,main]) completed. Took 15 mins 4.622 secs.
FAILURE: Build failed with an exception.
* What went wrong:
Execution failed for task ':sdks:python:test-suites:dataflow:py2:runPerformanceTest'.
> Process 'command 'sh'' finished with non-zero exit value 1
* Try:
Run with --stacktrace option to get the stack trace. Run with --debug option to get more log output. Run with --scan to get full insights.
* Get more help at https://help.gradle.org
Deprecated Gradle features were used in this build, making it incompatible with Gradle 6.0.
Use '--warning-mode all' to show the individual deprecation warnings.
See https://docs.gradle.org/5.2.1/userguide/command_line_interface.html#sec:command_line_warnings
BUILD FAILED in 16m 52s
5 actionable tasks: 5 executed
Publishing build scan...
https://gradle.com/s/wicmelrjj3dqy
Build step 'Invoke Gradle script' changed build result to FAILURE
Build step 'Invoke Gradle script' marked build as failure
---------------------------------------------------------------------
To unsubscribe, e-mail: builds-unsubscribe@beam.apache.org
For additional commands, e-mail: builds-help@beam.apache.org
Build failed in Jenkins: beam_PerformanceTests_WordCountIT_Py27
#1873
Posted by Apache Jenkins Server <je...@builds.apache.org>.
See <https://ci-beam.apache.org/job/beam_PerformanceTests_WordCountIT_Py27/1873/display/redirect?page=changes>
Changes:
[sychen] Refactor to reuse computation+key
[Luke Cwik] [BEAM-10771] Fix whitespace error causing whitespace lint to fail
[noreply] [BEAM-4980] Upgrade to Netty 4.1.51.Final and Netty_tcnative
[noreply] [BEAM-10670] Make Twister2Runner opt-out for using an SDF powered Read
------------------------------------------
[...truncated 243.51 KB...]
"@type": "OutputReference",
"output_name": "out",
"step_name": "SideInput-s20"
}
},
"output_info": [
{
"encoding": {
"@type": "kind:windowed_value",
"component_encodings": [
{
"@type": "FastPrimitivesCoder$<string of 176 bytes>",
"component_encodings": [
{
"@type": "FastPrimitivesCoder$<string of 176 bytes>",
"component_encodings": [],
"pipeline_proto_coder_id": "ref_Coder_FastPrimitivesCoder_5"
},
{
"@type": "FastPrimitivesCoder$<string of 176 bytes>",
"component_encodings": [],
"pipeline_proto_coder_id": "ref_Coder_FastPrimitivesCoder_5"
}
],
"is_pair_like": true,
"pipeline_proto_coder_id": "ref_Coder_FastPrimitivesCoder_5"
},
{
"@type": "kind:global_window"
}
],
"is_wrapper": true
},
"output_name": "None",
"user_name": "Write/Write/WriteImpl/FinalizeWrite.out"
}
],
"parallel_input": {
"@type": "OutputReference",
"output_name": "out",
"step_name": "s7"
},
"serialized_fn": "<string of 3484 bytes>",
"user_name": "Write/Write/WriteImpl/FinalizeWrite/FinalizeWrite"
}
}
],
"type": "JOB_TYPE_BATCH"
}
apache_beam.runners.dataflow.internal.apiclient: INFO: Create job: <Job
createTime: u'2020-08-26T18:10:29.894849Z'
currentStateTime: u'1970-01-01T00:00:00Z'
id: u'2020-08-26_11_10_25-13956320774075308504'
location: u'us-central1'
name: u'performance-tests-wordcount-python27-batch-1gb0826150316'
projectId: u'apache-beam-testing'
stageStates: []
startTime: u'2020-08-26T18:10:29.894849Z'
steps: []
tempFiles: []
type: TypeValueValuesEnum(JOB_TYPE_BATCH, 1)>
apache_beam.runners.dataflow.internal.apiclient: INFO: Created job with id: [2020-08-26_11_10_25-13956320774075308504]
apache_beam.runners.dataflow.internal.apiclient: INFO: Submitted job: 2020-08-26_11_10_25-13956320774075308504
apache_beam.runners.dataflow.internal.apiclient: INFO: To access the Dataflow monitoring console, please navigate to https://console.cloud.google.com/dataflow/jobs/us-central1/2020-08-26_11_10_25-13956320774075308504?project=apache-beam-testing
apache_beam.runners.dataflow.dataflow_runner: INFO: Job 2020-08-26_11_10_25-13956320774075308504 is in state JOB_STATE_RUNNING
apache_beam.runners.dataflow.dataflow_runner: INFO: 2020-08-26T18:10:32.878Z: JOB_MESSAGE_BASIC: Worker configuration: n1-standard-1 in us-central1-f.
apache_beam.runners.dataflow.dataflow_runner: INFO: 2020-08-26T18:10:33.766Z: JOB_MESSAGE_DETAILED: Expanding CoGroupByKey operations into optimizable parts.
apache_beam.runners.dataflow.dataflow_runner: INFO: 2020-08-26T18:10:33.801Z: JOB_MESSAGE_DEBUG: Combiner lifting skipped for step Write/Write/WriteImpl/GroupByKey: GroupByKey not followed by a combiner.
apache_beam.runners.dataflow.dataflow_runner: INFO: 2020-08-26T18:10:33.858Z: JOB_MESSAGE_DETAILED: Expanding GroupByKey operations into optimizable parts.
apache_beam.runners.dataflow.dataflow_runner: INFO: 2020-08-26T18:10:33.888Z: JOB_MESSAGE_DETAILED: Lifting ValueCombiningMappingFns into MergeBucketsMappingFns
apache_beam.runners.dataflow.dataflow_runner: INFO: 2020-08-26T18:10:33.987Z: JOB_MESSAGE_DEBUG: Annotating graph with Autotuner information.
apache_beam.runners.dataflow.dataflow_runner: INFO: 2020-08-26T18:10:34.033Z: JOB_MESSAGE_DETAILED: Fusing adjacent ParDo, Read, Write, and Flatten operations
apache_beam.runners.dataflow.dataflow_runner: INFO: 2020-08-26T18:10:34.065Z: JOB_MESSAGE_DETAILED: Fusing consumer Split into Read/Read
apache_beam.runners.dataflow.dataflow_runner: INFO: 2020-08-26T18:10:34.097Z: JOB_MESSAGE_DETAILED: Fusing consumer PairWIthOne into Split
apache_beam.runners.dataflow.dataflow_runner: INFO: 2020-08-26T18:10:34.130Z: JOB_MESSAGE_DETAILED: Fusing consumer GroupAndSum/GroupByKey+GroupAndSum/Combine/Partial into PairWIthOne
apache_beam.runners.dataflow.dataflow_runner: INFO: 2020-08-26T18:10:34.165Z: JOB_MESSAGE_DETAILED: Fusing consumer GroupAndSum/GroupByKey/Reify into GroupAndSum/GroupByKey+GroupAndSum/Combine/Partial
apache_beam.runners.dataflow.dataflow_runner: INFO: 2020-08-26T18:10:34.201Z: JOB_MESSAGE_DETAILED: Fusing consumer GroupAndSum/GroupByKey/Write into GroupAndSum/GroupByKey/Reify
apache_beam.runners.dataflow.dataflow_runner: INFO: 2020-08-26T18:10:34.236Z: JOB_MESSAGE_DETAILED: Fusing consumer GroupAndSum/Combine into GroupAndSum/GroupByKey/Read
apache_beam.runners.dataflow.dataflow_runner: INFO: 2020-08-26T18:10:34.261Z: JOB_MESSAGE_DETAILED: Fusing consumer GroupAndSum/Combine/Extract into GroupAndSum/Combine
apache_beam.runners.dataflow.dataflow_runner: INFO: 2020-08-26T18:10:34.293Z: JOB_MESSAGE_DETAILED: Fusing consumer Format into GroupAndSum/Combine/Extract
apache_beam.runners.dataflow.dataflow_runner: INFO: 2020-08-26T18:10:34.327Z: JOB_MESSAGE_DETAILED: Fusing consumer Write/Write/WriteImpl/WindowInto(WindowIntoFn) into Format
apache_beam.runners.dataflow.dataflow_runner: INFO: 2020-08-26T18:10:34.362Z: JOB_MESSAGE_DETAILED: Fusing consumer Write/Write/WriteImpl/WriteBundles/WriteBundles into Write/Write/WriteImpl/WindowInto(WindowIntoFn)
apache_beam.runners.dataflow.dataflow_runner: INFO: 2020-08-26T18:10:34.396Z: JOB_MESSAGE_DETAILED: Fusing consumer Write/Write/WriteImpl/Pair into Write/Write/WriteImpl/WriteBundles/WriteBundles
apache_beam.runners.dataflow.dataflow_runner: INFO: 2020-08-26T18:10:34.431Z: JOB_MESSAGE_DETAILED: Fusing consumer Write/Write/WriteImpl/GroupByKey/Reify into Write/Write/WriteImpl/Pair
apache_beam.runners.dataflow.dataflow_runner: INFO: 2020-08-26T18:10:34.464Z: JOB_MESSAGE_DETAILED: Fusing consumer Write/Write/WriteImpl/GroupByKey/Write into Write/Write/WriteImpl/GroupByKey/Reify
apache_beam.runners.dataflow.dataflow_runner: INFO: 2020-08-26T18:10:34.498Z: JOB_MESSAGE_DETAILED: Fusing consumer Write/Write/WriteImpl/GroupByKey/GroupByWindow into Write/Write/WriteImpl/GroupByKey/Read
apache_beam.runners.dataflow.dataflow_runner: INFO: 2020-08-26T18:10:34.530Z: JOB_MESSAGE_DETAILED: Fusing consumer Write/Write/WriteImpl/Extract into Write/Write/WriteImpl/GroupByKey/GroupByWindow
apache_beam.runners.dataflow.dataflow_runner: INFO: 2020-08-26T18:10:34.567Z: JOB_MESSAGE_DETAILED: Fusing consumer Write/Write/WriteImpl/InitializeWrite into Write/Write/WriteImpl/DoOnce/Read
apache_beam.runners.dataflow.dataflow_runner: INFO: 2020-08-26T18:10:34.602Z: JOB_MESSAGE_DEBUG: Workflow config is missing a default resource spec.
apache_beam.runners.dataflow.dataflow_runner: INFO: 2020-08-26T18:10:34.632Z: JOB_MESSAGE_DEBUG: Adding StepResource setup and teardown to workflow graph.
apache_beam.runners.dataflow.dataflow_runner: INFO: 2020-08-26T18:10:34.674Z: JOB_MESSAGE_DEBUG: Adding workflow start and stop steps.
apache_beam.runners.dataflow.dataflow_runner: INFO: 2020-08-26T18:10:34.706Z: JOB_MESSAGE_DEBUG: Assigning stage ids.
apache_beam.runners.dataflow.dataflow_runner: INFO: 2020-08-26T18:10:34.978Z: JOB_MESSAGE_DEBUG: Executing wait step start35
apache_beam.runners.dataflow.dataflow_runner: INFO: 2020-08-26T18:10:35.045Z: JOB_MESSAGE_BASIC: Executing operation Write/Write/WriteImpl/DoOnce/Read+Write/Write/WriteImpl/InitializeWrite
apache_beam.runners.dataflow.dataflow_runner: INFO: 2020-08-26T18:10:35.078Z: JOB_MESSAGE_BASIC: Executing operation Write/Write/WriteImpl/GroupByKey/Create
apache_beam.runners.dataflow.dataflow_runner: INFO: 2020-08-26T18:10:35.090Z: JOB_MESSAGE_DEBUG: Starting **** pool setup.
apache_beam.runners.dataflow.dataflow_runner: INFO: 2020-08-26T18:10:35.112Z: JOB_MESSAGE_BASIC: Executing operation GroupAndSum/GroupByKey/Create
apache_beam.runners.dataflow.dataflow_runner: INFO: 2020-08-26T18:10:35.122Z: JOB_MESSAGE_BASIC: Starting 10 ****s in us-central1-f...
apache_beam.runners.dataflow.dataflow_runner: INFO: 2020-08-26T18:10:35.180Z: JOB_MESSAGE_BASIC: Finished operation Write/Write/WriteImpl/GroupByKey/Create
apache_beam.runners.dataflow.dataflow_runner: INFO: 2020-08-26T18:10:35.180Z: JOB_MESSAGE_BASIC: Finished operation GroupAndSum/GroupByKey/Create
apache_beam.runners.dataflow.dataflow_runner: INFO: 2020-08-26T18:10:35.251Z: JOB_MESSAGE_DEBUG: Value "GroupAndSum/GroupByKey/Session" materialized.
apache_beam.runners.dataflow.dataflow_runner: INFO: 2020-08-26T18:10:35.282Z: JOB_MESSAGE_DEBUG: Value "Write/Write/WriteImpl/GroupByKey/Session" materialized.
apache_beam.runners.dataflow.dataflow_runner: INFO: 2020-08-26T18:10:35.327Z: JOB_MESSAGE_BASIC: Executing operation Read/Read+Split+PairWIthOne+GroupAndSum/GroupByKey+GroupAndSum/Combine/Partial+GroupAndSum/GroupByKey/Reify+GroupAndSum/GroupByKey/Write
apache_beam.runners.dataflow.dataflow_runner: INFO: 2020-08-26T18:10:58.862Z: JOB_MESSAGE_WARNING: Your project already contains 100 Dataflow-created metric descriptors and Stackdriver will not create new Dataflow custom metrics for this job. Each unique user-defined metric name (independent of the DoFn in which it is defined) produces a new metric descriptor. To delete old / unused metric descriptors see https://developers.google.com/apis-explorer/#p/monitoring/v3/monitoring.projects.metricDescriptors.list and https://developers.google.com/apis-explorer/#p/monitoring/v3/monitoring.projects.metricDescriptors.delete
apache_beam.runners.dataflow.dataflow_runner: INFO: 2020-08-26T18:11:00.424Z: JOB_MESSAGE_DETAILED: Autoscaling: Raised the number of ****s to 8 based on the rate of progress in the currently running stage(s).
apache_beam.runners.dataflow.dataflow_runner: INFO: 2020-08-26T18:11:00.447Z: JOB_MESSAGE_DETAILED: Resized **** pool to 8, though goal was 10. This could be a quota issue.
apache_beam.runners.dataflow.dataflow_runner: INFO: 2020-08-26T18:11:10.850Z: JOB_MESSAGE_DETAILED: Autoscaling: Raised the number of ****s to 9 based on the rate of progress in the currently running stage(s).
apache_beam.runners.dataflow.dataflow_runner: INFO: 2020-08-26T18:11:10.884Z: JOB_MESSAGE_DETAILED: Resized **** pool to 9, though goal was 10. This could be a quota issue.
apache_beam.runners.dataflow.dataflow_runner: INFO: 2020-08-26T18:11:52.213Z: JOB_MESSAGE_DETAILED: Autoscaling: Raised the number of ****s to 10 based on the rate of progress in the currently running stage(s).
apache_beam.runners.dataflow.dataflow_runner: INFO: 2020-08-26T18:12:33.109Z: JOB_MESSAGE_DETAILED: Workers have started successfully.
apache_beam.runners.dataflow.dataflow_runner: INFO: 2020-08-26T18:12:33.138Z: JOB_MESSAGE_DETAILED: Workers have started successfully.
apache_beam.runners.dataflow.dataflow_runner: INFO: 2020-08-26T18:15:44.825Z: JOB_MESSAGE_BASIC: Finished operation Write/Write/WriteImpl/DoOnce/Read+Write/Write/WriteImpl/InitializeWrite
apache_beam.runners.dataflow.dataflow_runner: INFO: 2020-08-26T18:15:44.889Z: JOB_MESSAGE_DEBUG: Value "Write/Write/WriteImpl/DoOnce/Read.out" materialized.
apache_beam.runners.dataflow.dataflow_runner: INFO: 2020-08-26T18:15:44.920Z: JOB_MESSAGE_DEBUG: Value "Write/Write/WriteImpl/InitializeWrite.out" materialized.
apache_beam.runners.dataflow.dataflow_runner: INFO: 2020-08-26T18:15:44.988Z: JOB_MESSAGE_BASIC: Executing operation Write/Write/WriteImpl/WriteBundles/_UnpickledSideInput(InitializeWrite.out.0)
apache_beam.runners.dataflow.dataflow_runner: INFO: 2020-08-26T18:15:45.023Z: JOB_MESSAGE_BASIC: Executing operation Write/Write/WriteImpl/FinalizeWrite/_UnpickledSideInput(InitializeWrite.out.0)
apache_beam.runners.dataflow.dataflow_runner: INFO: 2020-08-26T18:15:45.039Z: JOB_MESSAGE_BASIC: Finished operation Write/Write/WriteImpl/WriteBundles/_UnpickledSideInput(InitializeWrite.out.0)
apache_beam.runners.dataflow.dataflow_runner: INFO: 2020-08-26T18:15:45.054Z: JOB_MESSAGE_BASIC: Executing operation Write/Write/WriteImpl/PreFinalize/_UnpickledSideInput(InitializeWrite.out.0)
apache_beam.runners.dataflow.dataflow_runner: INFO: 2020-08-26T18:15:45.096Z: JOB_MESSAGE_BASIC: Finished operation Write/Write/WriteImpl/FinalizeWrite/_UnpickledSideInput(InitializeWrite.out.0)
apache_beam.runners.dataflow.dataflow_runner: INFO: 2020-08-26T18:15:45.107Z: JOB_MESSAGE_DEBUG: Value "Write/Write/WriteImpl/WriteBundles/_UnpickledSideInput(InitializeWrite.out.0).output" materialized.
apache_beam.runners.dataflow.dataflow_runner: INFO: 2020-08-26T18:15:45.158Z: JOB_MESSAGE_DEBUG: Value "Write/Write/WriteImpl/FinalizeWrite/_UnpickledSideInput(InitializeWrite.out.0).output" materialized.
apache_beam.runners.dataflow.dataflow_runner: INFO: 2020-08-26T18:15:45.168Z: JOB_MESSAGE_BASIC: Finished operation Write/Write/WriteImpl/PreFinalize/_UnpickledSideInput(InitializeWrite.out.0)
apache_beam.runners.dataflow.dataflow_runner: INFO: 2020-08-26T18:15:45.228Z: JOB_MESSAGE_DEBUG: Value "Write/Write/WriteImpl/PreFinalize/_UnpickledSideInput(InitializeWrite.out.0).output" materialized.
apache_beam.runners.dataflow.dataflow_runner: INFO: 2020-08-26T18:18:29.926Z: JOB_MESSAGE_BASIC: Finished operation Read/Read+Split+PairWIthOne+GroupAndSum/GroupByKey+GroupAndSum/Combine/Partial+GroupAndSum/GroupByKey/Reify+GroupAndSum/GroupByKey/Write
apache_beam.runners.dataflow.dataflow_runner: INFO: 2020-08-26T18:18:30.005Z: JOB_MESSAGE_BASIC: Executing operation GroupAndSum/GroupByKey/Close
apache_beam.runners.dataflow.dataflow_runner: INFO: 2020-08-26T18:18:30.053Z: JOB_MESSAGE_BASIC: Finished operation GroupAndSum/GroupByKey/Close
apache_beam.runners.dataflow.dataflow_runner: INFO: 2020-08-26T18:18:30.139Z: JOB_MESSAGE_BASIC: Executing operation GroupAndSum/GroupByKey/Read+GroupAndSum/Combine+GroupAndSum/Combine/Extract+Format+Write/Write/WriteImpl/WindowInto(WindowIntoFn)+Write/Write/WriteImpl/WriteBundles/WriteBundles+Write/Write/WriteImpl/Pair+Write/Write/WriteImpl/GroupByKey/Reify+Write/Write/WriteImpl/GroupByKey/Write
apache_beam.runners.dataflow.dataflow_runner: INFO: 2020-08-26T18:21:49.160Z: JOB_MESSAGE_BASIC: Finished operation GroupAndSum/GroupByKey/Read+GroupAndSum/Combine+GroupAndSum/Combine/Extract+Format+Write/Write/WriteImpl/WindowInto(WindowIntoFn)+Write/Write/WriteImpl/WriteBundles/WriteBundles+Write/Write/WriteImpl/Pair+Write/Write/WriteImpl/GroupByKey/Reify+Write/Write/WriteImpl/GroupByKey/Write
apache_beam.runners.dataflow.dataflow_runner: INFO: 2020-08-26T18:21:49.245Z: JOB_MESSAGE_BASIC: Executing operation Write/Write/WriteImpl/GroupByKey/Close
apache_beam.runners.dataflow.dataflow_runner: INFO: 2020-08-26T18:21:49.299Z: JOB_MESSAGE_BASIC: Finished operation Write/Write/WriteImpl/GroupByKey/Close
apache_beam.runners.dataflow.dataflow_runner: INFO: 2020-08-26T18:21:49.381Z: JOB_MESSAGE_BASIC: Executing operation Write/Write/WriteImpl/GroupByKey/Read+Write/Write/WriteImpl/GroupByKey/GroupByWindow+Write/Write/WriteImpl/Extract
apache_beam.runners.dataflow.dataflow_runner: INFO: 2020-08-26T18:21:51.926Z: JOB_MESSAGE_BASIC: Finished operation Write/Write/WriteImpl/GroupByKey/Read+Write/Write/WriteImpl/GroupByKey/GroupByWindow+Write/Write/WriteImpl/Extract
apache_beam.runners.dataflow.dataflow_runner: INFO: 2020-08-26T18:21:52.018Z: JOB_MESSAGE_DEBUG: Value "Write/Write/WriteImpl/Extract.out" materialized.
apache_beam.runners.dataflow.dataflow_runner: INFO: 2020-08-26T18:21:52.088Z: JOB_MESSAGE_BASIC: Executing operation Write/Write/WriteImpl/FinalizeWrite/_UnpickledSideInput(Extract.out.0)
apache_beam.runners.dataflow.dataflow_runner: INFO: 2020-08-26T18:21:52.127Z: JOB_MESSAGE_BASIC: Executing operation Write/Write/WriteImpl/PreFinalize/_UnpickledSideInput(Extract.out.0)
apache_beam.runners.dataflow.dataflow_runner: INFO: 2020-08-26T18:21:52.130Z: JOB_MESSAGE_BASIC: Finished operation Write/Write/WriteImpl/FinalizeWrite/_UnpickledSideInput(Extract.out.0)
apache_beam.runners.dataflow.dataflow_runner: INFO: 2020-08-26T18:21:52.175Z: JOB_MESSAGE_BASIC: Finished operation Write/Write/WriteImpl/PreFinalize/_UnpickledSideInput(Extract.out.0)
apache_beam.runners.dataflow.dataflow_runner: INFO: 2020-08-26T18:21:52.192Z: JOB_MESSAGE_DEBUG: Value "Write/Write/WriteImpl/FinalizeWrite/_UnpickledSideInput(Extract.out.0).output" materialized.
apache_beam.runners.dataflow.dataflow_runner: INFO: 2020-08-26T18:21:52.240Z: JOB_MESSAGE_DEBUG: Value "Write/Write/WriteImpl/PreFinalize/_UnpickledSideInput(Extract.out.0).output" materialized.
apache_beam.runners.dataflow.dataflow_runner: INFO: 2020-08-26T18:21:52.305Z: JOB_MESSAGE_BASIC: Executing operation Write/Write/WriteImpl/PreFinalize/PreFinalize
apache_beam.runners.dataflow.dataflow_runner: INFO: 2020-08-26T18:21:54.685Z: JOB_MESSAGE_BASIC: Finished operation Write/Write/WriteImpl/PreFinalize/PreFinalize
apache_beam.runners.dataflow.dataflow_runner: INFO: 2020-08-26T18:21:54.744Z: JOB_MESSAGE_DEBUG: Value "Write/Write/WriteImpl/PreFinalize.out" materialized.
apache_beam.runners.dataflow.dataflow_runner: INFO: 2020-08-26T18:21:54.818Z: JOB_MESSAGE_BASIC: Executing operation Write/Write/WriteImpl/FinalizeWrite/_UnpickledSideInput(PreFinalize.out.0)
apache_beam.runners.dataflow.dataflow_runner: INFO: 2020-08-26T18:21:54.875Z: JOB_MESSAGE_BASIC: Finished operation Write/Write/WriteImpl/FinalizeWrite/_UnpickledSideInput(PreFinalize.out.0)
apache_beam.runners.dataflow.dataflow_runner: INFO: 2020-08-26T18:21:54.939Z: JOB_MESSAGE_DEBUG: Value "Write/Write/WriteImpl/FinalizeWrite/_UnpickledSideInput(PreFinalize.out.0).output" materialized.
apache_beam.runners.dataflow.dataflow_runner: INFO: 2020-08-26T18:21:55.030Z: JOB_MESSAGE_BASIC: Executing operation Write/Write/WriteImpl/FinalizeWrite/FinalizeWrite
apache_beam.runners.dataflow.dataflow_runner: INFO: 2020-08-26T18:21:57.587Z: JOB_MESSAGE_BASIC: Finished operation Write/Write/WriteImpl/FinalizeWrite/FinalizeWrite
apache_beam.runners.dataflow.dataflow_runner: INFO: 2020-08-26T18:21:57.651Z: JOB_MESSAGE_DEBUG: Executing success step success33
apache_beam.runners.dataflow.dataflow_runner: INFO: 2020-08-26T18:21:57.734Z: JOB_MESSAGE_DETAILED: Cleaning up.
apache_beam.runners.dataflow.dataflow_runner: INFO: 2020-08-26T18:21:57.860Z: JOB_MESSAGE_DEBUG: Starting **** pool teardown.
apache_beam.runners.dataflow.dataflow_runner: INFO: 2020-08-26T18:21:57.901Z: JOB_MESSAGE_BASIC: Stopping **** pool...
apache_beam.runners.dataflow.dataflow_runner: INFO: 2020-08-26T18:22:51.387Z: JOB_MESSAGE_DETAILED: Autoscaling: Resized **** pool from 10 to 0.
apache_beam.runners.dataflow.dataflow_runner: INFO: 2020-08-26T18:22:51.428Z: JOB_MESSAGE_BASIC: Worker pool stopped.
apache_beam.runners.dataflow.dataflow_runner: INFO: 2020-08-26T18:22:51.466Z: JOB_MESSAGE_DEBUG: Tearing down pending resources...
apache_beam.runners.dataflow.dataflow_runner: INFO: Job 2020-08-26_11_10_25-13956320774075308504 is in state JOB_STATE_DONE
apache_beam.io.filesystem: DEBUG: Listing files in 'gs://temp-storage-for-end-to-end-tests/py-it-cloud/output/1598465420813/results'
apache_beam.io.filesystem: DEBUG: translate_pattern: 'gs://temp-storage-for-end-to-end-tests/py-it-cloud/output/1598465420813/results*-of-*' -> 'gs\\:\\/\\/temp\\-storage\\-for\\-end\\-to\\-end\\-tests\\/py\\-it\\-cloud\\/output\\/1598465420813\\/results[^/\\\\]*\\-of\\-[^/\\\\]*'
apache_beam.io.gcp.gcsio: INFO: Starting the size estimation of the input
apache_beam.io.gcp.gcsio: INFO: Finished listing 31 files in 0.127225875854 seconds.
apache_beam.testing.pipeline_verifiers: INFO: Find 31 files in gs://temp-storage-for-end-to-end-tests/py-it-cloud/output/1598465420813/results*-of-*:
gs://temp-storage-for-end-to-end-tests/py-it-cloud/output/1598465420813/results-00009-of-00031
gs://temp-storage-for-end-to-end-tests/py-it-cloud/output/1598465420813/results-00018-of-00031
gs://temp-storage-for-end-to-end-tests/py-it-cloud/output/1598465420813/results-00002-of-00031
gs://temp-storage-for-end-to-end-tests/py-it-cloud/output/1598465420813/results-00021-of-00031
gs://temp-storage-for-end-to-end-tests/py-it-cloud/output/1598465420813/results-00027-of-00031
gs://temp-storage-for-end-to-end-tests/py-it-cloud/output/1598465420813/results-00022-of-00031
gs://temp-storage-for-end-to-end-tests/py-it-cloud/output/1598465420813/results-00028-of-00031
gs://temp-storage-for-end-to-end-tests/py-it-cloud/output/1598465420813/results-00026-of-00031
gs://temp-storage-for-end-to-end-tests/py-it-cloud/output/1598465420813/results-00010-of-00031
gs://temp-storage-for-end-to-end-tests/py-it-cloud/output/1598465420813/results-00015-of-00031
gs://temp-storage-for-end-to-end-tests/py-it-cloud/output/1598465420813/results-00005-of-00031
gs://temp-storage-for-end-to-end-tests/py-it-cloud/output/1598465420813/results-00000-of-00031
gs://temp-storage-for-end-to-end-tests/py-it-cloud/output/1598465420813/results-00014-of-00031
gs://temp-storage-for-end-to-end-tests/py-it-cloud/output/1598465420813/results-00004-of-00031
gs://temp-storage-for-end-to-end-tests/py-it-cloud/output/1598465420813/results-00029-of-00031
gs://temp-storage-for-end-to-end-tests/py-it-cloud/output/1598465420813/results-00030-of-00031
gs://temp-storage-for-end-to-end-tests/py-it-cloud/output/1598465420813/results-00001-of-00031
gs://temp-storage-for-end-to-end-tests/py-it-cloud/output/1598465420813/results-00008-of-00031
gs://temp-storage-for-end-to-end-tests/py-it-cloud/output/1598465420813/results-00011-of-00031
gs://temp-storage-for-end-to-end-tests/py-it-cloud/output/1598465420813/results-00019-of-00031
gs://temp-storage-for-end-to-end-tests/py-it-cloud/output/1598465420813/results-00023-of-00031
gs://temp-storage-for-end-to-end-tests/py-it-cloud/output/1598465420813/results-00024-of-00031
gs://temp-storage-for-end-to-end-tests/py-it-cloud/output/1598465420813/results-00025-of-00031
gs://temp-storage-for-end-to-end-tests/py-it-cloud/output/1598465420813/results-00003-of-00031
gs://temp-storage-for-end-to-end-tests/py-it-cloud/output/1598465420813/results-00006-of-00031
gs://temp-storage-for-end-to-end-tests/py-it-cloud/output/1598465420813/results-00016-of-00031
gs://temp-storage-for-end-to-end-tests/py-it-cloud/output/1598465420813/results-00013-of-00031
gs://temp-storage-for-end-to-end-tests/py-it-cloud/output/1598465420813/results-00007-of-00031
gs://temp-storage-for-end-to-end-tests/py-it-cloud/output/1598465420813/results-00020-of-00031
gs://temp-storage-for-end-to-end-tests/py-it-cloud/output/1598465420813/results-00017-of-00031
gs://temp-storage-for-end-to-end-tests/py-it-cloud/output/1598465420813/results-00012-of-00031
apache_beam.testing.pipeline_verifiers: INFO: Read from given path gs://temp-storage-for-end-to-end-tests/py-it-cloud/output/1598465420813/results*-of-*, 26186927 lines, checksum: ea0ca2e5ee4ea5f218790f28d0b9fe7d09d8d710.
google.auth._default: DEBUG: Checking None for explicit credentials as part of auth process...
google.auth._default: DEBUG: Checking Cloud SDK credentials as part of auth process...
google.auth._default: DEBUG: Cloud SDK credentials not found on disk; not using them
google.auth._default: DEBUG: Checking for App Engine runtime as part of auth process...
google.auth._default: DEBUG: No App Engine library was found so cannot authentication via App Engine Identity Credentials.
google.auth.transport._http_client: DEBUG: Making request: GET http://169.254.169.254
google.auth.transport._http_client: DEBUG: Making request: GET http://metadata.google.internal/computeMetadata/v1/project/project-id
urllib3.util.retry: DEBUG: Converted retries value: 3 -> Retry(total=3, connect=None, read=None, redirect=None, status=None)
google.auth.transport.requests: DEBUG: Making request: GET http://metadata.google.internal/computeMetadata/v1/instance/service-accounts/default/?recursive=true
urllib3.connectionpool: DEBUG: Starting new HTTP connection (1): metadata.google.internal:80
urllib3.connectionpool: DEBUG: http://metadata.google.internal:80 "GET /computeMetadata/v1/instance/service-accounts/default/?recursive=true HTTP/1.1" 200 144
google.auth.transport.requests: DEBUG: Making request: GET http://metadata.google.internal/computeMetadata/v1/instance/service-accounts/844138762903-compute@developer.gserviceaccount.com/token
urllib3.connectionpool: DEBUG: http://metadata.google.internal:80 "GET /computeMetadata/v1/instance/service-accounts/844138762903-compute@developer.gserviceaccount.com/token HTTP/1.1" 200 221
urllib3.connectionpool: DEBUG: Starting new HTTPS connection (1): bigquery.googleapis.com:443
urllib3.connectionpool: DEBUG: https://bigquery.googleapis.com:443 "GET /bigquery/v2/projects/apache-beam-testing/datasets/beam_performance HTTP/1.1" 200 None
urllib3.connectionpool: DEBUG: https://bigquery.googleapis.com:443 "GET /bigquery/v2/projects/apache-beam-testing/datasets/beam_performance/tables/wordcount_py27_pkb_results HTTP/1.1" 200 None
apache_beam.testing.load_tests.load_test_metrics_utils: INFO: Load test results for test: 56cfaabfa7474795a993dd1b7a2a2217 and timestamp: 1598466560.6:
apache_beam.testing.load_tests.load_test_metrics_utils: INFO: Metric: runtime Value: 1139
urllib3.connectionpool: DEBUG: https://bigquery.googleapis.com:443 "POST /bigquery/v2/projects/apache-beam-testing/datasets/beam_performance/tables/wordcount_py27_pkb_results/insertAll HTTP/1.1" 200 None
apache_beam.testing.load_tests.load_test_metrics_utils: ERROR: no such field.
--------------------- >> end captured logging << ---------------------
----------------------------------------------------------------------
XML: nosetests-runPerformanceTest-df-py27.xml
----------------------------------------------------------------------
XML: <https://ci-beam.apache.org/job/beam_PerformanceTests_WordCountIT_Py27/ws/src/sdks/python/nosetests.xml>
----------------------------------------------------------------------
Ran 1 test in 1140.485s
FAILED (errors=1)
> Task :sdks:python:test-suites:dataflow:py2:runPerformanceTest FAILED
:sdks:python:test-suites:dataflow:py2:runPerformanceTest (Thread[Execution **** for ':' Thread 3,5,main]) completed. Took 19 mins 4.334 secs.
FAILURE: Build failed with an exception.
* What went wrong:
Execution failed for task ':sdks:python:test-suites:dataflow:py2:runPerformanceTest'.
> Process 'command 'sh'' finished with non-zero exit value 1
* Try:
Run with --stacktrace option to get the stack trace. Run with --debug option to get more log output. Run with --scan to get full insights.
* Get more help at https://help.gradle.org
Deprecated Gradle features were used in this build, making it incompatible with Gradle 6.0.
Use '--warning-mode all' to show the individual deprecation warnings.
See https://docs.gradle.org/5.2.1/userguide/command_line_interface.html#sec:command_line_warnings
BUILD FAILED in 20m 58s
5 actionable tasks: 5 executed
Publishing build scan...
https://gradle.com/s/tokx4f4cyc24o
Build step 'Invoke Gradle script' changed build result to FAILURE
Build step 'Invoke Gradle script' marked build as failure
---------------------------------------------------------------------
To unsubscribe, e-mail: builds-unsubscribe@beam.apache.org
For additional commands, e-mail: builds-help@beam.apache.org