You are viewing a plain text version of this content. The canonical link for it is here.
Posted to notifications@maven.apache.org by Apache Jenkins Server <je...@builds.apache.org> on 2019/03/17 11:09:03 UTC

Build failed in Jenkins: Maven TLP » maven-release » stabilize #5

See https://builds.apache.org/job/maven-box/job/maven-release/job/stabilize/5/

Changes:

* Default Jenkins config
* Default Jenkins config
* Default Jenkins config
* Default Jenkins config
* Default Jenkins config
* Default Jenkins config

All tests passed

Build log:
[...truncated 19828 lines...]
    at sun.reflect.NativeMethodAccessorImpl.invoke (NativeMethodAccessorImpl.java:62)
    at sun.reflect.DelegatingMethodAccessorImpl.invoke (DelegatingMethodAccessorImpl.java:43)
    at java.lang.reflect.Method.invoke (Method.java:498)
    at org.codehaus.plexus.classworlds.launcher.Launcher.launchEnhanced (Launcher.java:289)
    at org.codehaus.plexus.classworlds.launcher.Launcher.launch (Launcher.java:229)
    at org.codehaus.plexus.classworlds.launcher.Launcher.mainWithExitCode (Launcher.java:415)
    at org.codehaus.plexus.classworlds.launcher.Launcher.main (Launcher.java:356)
[ERROR] 
[ERROR] Re-run Maven using the -X switch to enable full debug logging.
[ERROR] 
[ERROR] For more information about the errors and possible solutions, please read the following articles:
[ERROR] [Help 1] http://cwiki.apache.org/confluence/display/MAVEN/MojoFailureException
[ERROR] 
[ERROR] After correcting the problems, you can resume the build with the command
[ERROR]   mvn <goals> -rf :maven-release-plugin
Picked up JAVA_TOOL_OPTIONS: -Dmaven.ext.class.path="f:\jenkins\jenkins-slave\workspace\aven-box_maven-release_stabilize@2@2@tmp\withMaven133fe560\pipeline-maven-spy.jar" -Dorg.jenkinsci.plugins.pipeline.maven.reportsFolder="f:\jenkins\jenkins-slave\workspace\aven-box_maven-release_stabilize@2@2@tmp\withMaven133fe560" 
[Pipeline] }
None of the test reports contained any result
[withMaven] junitPublisher - Archive test results for Maven artifact org.apache.maven.release:maven-release-manager:jar:3.0.0-SNAPSHOT generated by maven-surefire-plugin:test (default-test): windows-jdk7-m3.2.x_build\maven-release-manager\target\surefire-reports\*.xml
Recording test results
[Pipeline] // dir
[Pipeline] }
[withMaven] junitPublisher - Archive test results for Maven artifact org.apache.maven.plugins:maven-release-plugin:maven-plugin:3.0.0-SNAPSHOT generated by maven-surefire-plugin:test (default-test): windows-jdk7-m3.2.x_build\maven-release-plugin\target\surefire-reports\*.xml
Recording test results
[withMaven] artifactsPublisher - Archive artifact windows-jdk8-m3.5.x_build\pom.xml under org\apache\maven\release\maven-release\3.0.0-SNAPSHOT\maven-release-3.0.0-SNAPSHOT.pom
[withMaven] artifactsPublisher - Archive artifact windows-jdk8-m3.5.x_build\target\maven-release-3.0.0-SNAPSHOT-site.xml under org\apache\maven\release\maven-release\3.0.0-SNAPSHOT\maven-release-3.0.0-SNAPSHOT-site.xml
[withMaven] artifactsPublisher - Archive artifact windows-jdk8-m3.5.x_build\maven-release-api\pom.xml under org\apache\maven\release\maven-release-api\3.0.0-SNAPSHOT\maven-release-api-3.0.0-SNAPSHOT.pom
[withMaven] artifactsPublisher - Archive artifact windows-jdk8-m3.5.x_build\maven-release-api\target\maven-release-api-3.0.0-SNAPSHOT.jar under org\apache\maven\release\maven-release-api\3.0.0-SNAPSHOT\maven-release-api-3.0.0-SNAPSHOT.jar
[withMaven] artifactsPublisher - Archive artifact windows-jdk8-m3.5.x_build\maven-release-manager\pom.xml under org\apache\maven\release\maven-release-manager\3.0.0-SNAPSHOT\maven-release-manager-3.0.0-SNAPSHOT.pom
[withMaven] artifactsPublisher - Archive artifact windows-jdk8-m3.5.x_build\maven-release-manager\target\maven-release-manager-3.0.0-SNAPSHOT.jar under org\apache\maven\release\maven-release-manager\3.0.0-SNAPSHOT\maven-release-manager-3.0.0-SNAPSHOT.jar
[INFO] run post-build script verify.groovy
[INFO]           projects\prepare-with-pom\finalname-multimodule\pom.xml SUCCESS (14.7 s)
[INFO] Building: projects\prepare-with-pom\MRELEASE-808\pom.xml
[withMaven] junitPublisher - Archive test results for Maven artifact org.apache.maven.release:maven-release-api:jar:3.0.0-SNAPSHOT generated by maven-surefire-plugin:test (default-test): windows-jdk8-m3.5.x_build\maven-release-api\target\surefire-reports\*.xml
Recording test results
[withMaven] junitPublisher - Archive test results for Maven artifact org.apache.maven.release:maven-release-oddeven-policy:jar:3.0.0-SNAPSHOT generated by maven-surefire-plugin:test (default-test): windows-jdk7-m3.2.x_build\maven-release-policies\maven-release-oddeven-policy\target\surefire-reports\*.xml
Recording test results
None of the test reports contained any result
[withMaven] junitPublisher - Archive test results for Maven artifact org.apache.maven.release:maven-release-manager:jar:3.0.0-SNAPSHOT generated by maven-surefire-plugin:test (default-test): windows-jdk8-m3.5.x_build\maven-release-manager\target\surefire-reports\*.xml
Recording test results
[withMaven] junitPublisher - Archive test results for Maven artifact org.apache.maven.release:maven-release-semver-policy:jar:3.0.0-SNAPSHOT generated by maven-surefire-plugin:test (default-test): windows-jdk7-m3.2.x_build\maven-release-policies\maven-release-semver-policy\target\surefire-reports\*.xml
Recording test results
[withMaven] junitPublisher - Archive test results for Maven artifact org.apache.maven.plugins:maven-release-plugin:maven-plugin:3.0.0-SNAPSHOT generated by maven-surefire-plugin:test (default-test): windows-jdk8-m3.5.x_build\maven-release-plugin\target\surefire-reports\*.xml
Recording test results
[withMaven] junitPublisher - Archive test results for Maven artifact org.apache.maven.release:maven-release-manager:jar:3.0.0-SNAPSHOT generated by maven-failsafe-plugin:integration-test (default): windows-jdk7-m3.2.x_build\maven-release-manager\target\failsafe-reports\*.xml
Recording test results
[withMaven] junitPublisher - Archive test results for Maven artifact org.apache.maven.release:maven-release-manager:jar:3.0.0-SNAPSHOT generated by maven-failsafe-plugin:integration-test (default): windows-jdk8-m3.5.x_build\maven-release-manager\target\failsafe-reports\*.xml
Recording test results
[withMaven] openTasksPublisher - Scan Tasks for Maven artifact org.apache.maven.release:maven-release-api:jar:3.0.0-SNAPSHOT in source directory windows-jdk7-m3.2.x_build\maven-release-api\src\main\java
[withMaven] openTasksPublisher - Scan Tasks for Maven artifact org.apache.maven.release:maven-release-manager:jar:3.0.0-SNAPSHOT in source directory windows-jdk7-m3.2.x_build\maven-release-manager\src\main\java
[withMaven] openTasksPublisher - Scan Tasks for Maven artifact org.apache.maven.plugins:maven-release-plugin:maven-plugin:3.0.0-SNAPSHOT in source directory windows-jdk7-m3.2.x_build\maven-release-plugin\src\main\java
[withMaven] openTasksPublisher - Scan Tasks for Maven artifact org.apache.maven.release:maven-release-oddeven-policy:jar:3.0.0-SNAPSHOT in source directory windows-jdk7-m3.2.x_build\maven-release-policies\maven-release-oddeven-policy\src\main\java
[withMaven] openTasksPublisher - Scan Tasks for Maven artifact org.apache.maven.release:maven-release-semver-policy:jar:3.0.0-SNAPSHOT in source directory windows-jdk7-m3.2.x_build\maven-release-policies\maven-release-semver-policy\src\main\java
[TASKS] Scanning folder 'f:\jenkins\jenkins-slave\workspace\aven-box_maven-release_stabilize@3' for files matching the pattern 'windows-jdk7-m3.2.x_build\maven-release-api\src\main\java\**\*,windows-jdk7-m3.2.x_build\maven-release-manager\src\main\java\**\*,windows-jdk7-m3.2.x_build\maven-release-plugin\src\main\java\**\*,windows-jdk7-m3.2.x_build\maven-release-policies\maven-release-oddeven-policy\src\main\java\**\*,windows-jdk7-m3.2.x_build\maven-release-policies\maven-release-semver-policy\src\main\java\**\*' - excludes: null
[TASKS] Found 130 files to scan for tasks
[TASKS] Found 21 open tasks.
Skipping warnings blame since pipelines do not have an SCM link.%n
[withMaven] openTasksPublisher - Scan Tasks for Maven artifact org.apache.maven.release:maven-release-api:jar:3.0.0-SNAPSHOT in source directory windows-jdk8-m3.5.x_build\maven-release-api\src\main\java
[withMaven] openTasksPublisher - Scan Tasks for Maven artifact org.apache.maven.release:maven-release-manager:jar:3.0.0-SNAPSHOT in source directory windows-jdk8-m3.5.x_build\maven-release-manager\src\main\java
[TASKS] Computing warning deltas based on reference build #1
[withMaven] openTasksPublisher - Scan Tasks for Maven artifact org.apache.maven.plugins:maven-release-plugin:maven-plugin:3.0.0-SNAPSHOT in source directory windows-jdk8-m3.5.x_build\maven-release-plugin\src\main\java
[TASKS] Scanning folder 'f:\jenkins\jenkins-slave\workspace\aven-box_maven-release_stabilize@2@2' for files matching the pattern 'windows-jdk8-m3.5.x_build\maven-release-api\src\main\java\**\*,windows-jdk8-m3.5.x_build\maven-release-manager\src\main\java\**\*,windows-jdk8-m3.5.x_build\maven-release-plugin\src\main\java\**\*' - excludes: null
[TASKS] Found 127 files to scan for tasks
[TASKS] Found 21 open tasks.
Skipping warnings blame since pipelines do not have an SCM link.%n
[TASKS] Computing warning deltas based on reference build #1
[withMaven] invokerPublisher - Archive invoker results for Maven artifact MavenArtifact{org.apache.maven.plugins:maven-release-plugin:maven-plugin:3.0.0-SNAPSHOT(version: 3.0.0-SNAPSHOT, snapshot:false) } generated by PluginInvocation{org.apache.maven.plugins:maven-invoker-plugin:3.2.0@run  integration-test-prepare}: windows-jdk7-m3.2.x_build\maven-release-plugin\target\invoker-reports\*.xml
[withMaven] invokerPublisher - Archive invoker results for Maven artifact MavenArtifact{org.apache.maven.plugins:maven-release-plugin:maven-plugin:3.0.0-SNAPSHOT(version: 3.0.0-SNAPSHOT, snapshot:false) } generated by PluginInvocation{org.apache.maven.plugins:maven-invoker-plugin:3.2.0@run  integration-test-prepare}: windows-jdk8-m3.5.x_build\maven-release-plugin\target\invoker-reports\*.xml
[INFO] run post-build script verify.groovy
[INFO]           projects\prepare-with-pom\MRELEASE-808\pom.xml ... SUCCESS (14.1 s)
[INFO] Building: projects\update-versions\MRELEASE-555\pom.xml
[INFO] run post-build script verify.groovy
[INFO]           projects\update-versions\MRELEASE-555\pom.xml .... SUCCESS (6.6 s)
[INFO] Building: projects\update-versions\MRELEASE-611\pom.xml
[withMaven] Publishers: Generated Artifacts Publisher: 679 ms, Junit Publisher: 7837 ms, Open Task Scanner Publisher: 579 ms, Dependencies Fingerprint Publisher: 160 ms, Invoker Publisher: 16573 ms, Pipeline Graph Publisher: 24 ms
[Pipeline] // withMaven
[Pipeline] cleanWs
[WS-CLEANUP] Deleting project workspace...
[WS-CLEANUP] Deferred wipeout is used...
[WS-CLEANUP] done
[Pipeline] }
[Pipeline] // stage
[Pipeline] }
[Pipeline] // ws
[Pipeline] }
[Pipeline] // node
[Pipeline] }
[withMaven] Publishers: Generated Artifacts Publisher: 2853 ms, Junit Publisher: 4902 ms, Open Task Scanner Publisher: 485 ms, Dependencies Fingerprint Publisher: 100 ms, Invoker Publisher: 17079 ms, Pipeline Graph Publisher: 2 ms
[Pipeline] // withMaven
[Pipeline] cleanWs
[WS-CLEANUP] Deleting project workspace...
[WS-CLEANUP] Deferred wipeout is used...
[WS-CLEANUP] done
[Pipeline] cleanWs
[WS-CLEANUP] Deleting project workspace...
[WS-CLEANUP] Deferred wipeout is used...
[WS-CLEANUP] done
[Pipeline] }
[Pipeline] // stage
[Pipeline] }
[Pipeline] // ws
[Pipeline] }
[Pipeline] // node
[Pipeline] }
Failed in branch windows-jdk8-m3.5.x_build
[INFO] run post-build script verify.groovy
[INFO]           projects\update-versions\MRELEASE-611\pom.xml .... SUCCESS (7.3 s)
[INFO] Building: projects\update-versions\MRELEASE-783\pom.xml
[INFO]           projects\update-versions\MRELEASE-783\pom.xml .... SUCCESS (6.4 s)
[INFO] Building: projects\update-versions\MRELEASE-976\pom.xml
[INFO] run post-build script verify.groovy
[INFO]           projects\update-versions\MRELEASE-976\pom.xml .... SUCCESS (6.6 s)
[INFO] -------------------------------------------------
[INFO] Build Summary:
[INFO]   Passed: 30, Failed: 4, Errors: 0, Skipped: 0
[INFO] -------------------------------------------------
[ERROR] The following builds failed:
[ERROR] *  projects\prepare\flat-multi-module\parent-project\pom.xml
[ERROR] *  projects\prepare\MRELEASE-161\pom.xml
[ERROR] *  projects\prepare\MRELEASE-161-dependencyManagement\pom.xml
[ERROR] *  projects\prepare\regular-multi-module\pom.xml
[INFO] -------------------------------------------------
[INFO] ------------------------------------------------------------------------
[INFO] Reactor Summary:
[INFO] 
[INFO] Maven Release ...................................... SUCCESS [  8.112 s]
[INFO] Maven Release APIs ................................. SUCCESS [  7.815 s]
[INFO] Maven Release Manager .............................. SUCCESS [02:35 min]
[INFO] Maven Release Plugin ............................... FAILURE [08:35 min]
[INFO] Maven Release Odd-Even Policy ...................... SKIPPED
[INFO] Maven Release SemVer Policy ........................ SKIPPED
[INFO] ------------------------------------------------------------------------
[INFO] BUILD FAILURE
[INFO] ------------------------------------------------------------------------
[INFO] Total time: 11:27 min
[INFO] Finished at: 2019-03-17T04:08:29-07:00
[INFO] Final Memory: 57M/1108M
[INFO] ------------------------------------------------------------------------
[INFO] [jenkins-event-spy] Generated F:\jenkins\jenkins-slave\workspace\aven-box_maven-release_stabilize@3@tmp\withMaven7b71b43e\maven-spy-20190317-035701-319075028211869231217.log
[ERROR] Failed to execute goal org.apache.maven.plugins:maven-invoker-plugin:3.2.0:run (integration-test-prepare) on project maven-release-plugin: 4 builds failed. See console output above for details. -> [Help 1]
org.apache.maven.lifecycle.LifecycleExecutionException: Failed to execute goal org.apache.maven.plugins:maven-invoker-plugin:3.2.0:run (integration-test-prepare) on project maven-release-plugin: 4 builds failed. See console output above for details.
    at org.apache.maven.lifecycle.internal.MojoExecutor.execute (MojoExecutor.java:213)
    at org.apache.maven.lifecycle.internal.MojoExecutor.execute (MojoExecutor.java:154)
    at org.apache.maven.lifecycle.internal.MojoExecutor.execute (MojoExecutor.java:146)
    at org.apache.maven.lifecycle.internal.LifecycleModuleBuilder.buildProject (LifecycleModuleBuilder.java:117)
    at org.apache.maven.lifecycle.internal.LifecycleModuleBuilder.buildProject (LifecycleModuleBuilder.java:81)
    at org.apache.maven.lifecycle.internal.builder.singlethreaded.SingleThreadedBuilder.build (SingleThreadedBuilder.java:51)
    at org.apache.maven.lifecycle.internal.LifecycleStarter.execute (LifecycleStarter.java:128)
    at org.apache.maven.DefaultMaven.doExecute (DefaultMaven.java:309)
    at org.apache.maven.DefaultMaven.doExecute (DefaultMaven.java:194)
    at org.apache.maven.DefaultMaven.execute (DefaultMaven.java:107)
    at org.apache.maven.cli.MavenCli.execute (MavenCli.java:955)
    at org.apache.maven.cli.MavenCli.doMain (MavenCli.java:290)
    at org.apache.maven.cli.MavenCli.main (MavenCli.java:194)
    at sun.reflect.NativeMethodAccessorImpl.invoke0 (Native Method)
    at sun.reflect.NativeMethodAccessorImpl.invoke (NativeMethodAccessorImpl.java:57)
    at sun.reflect.DelegatingMethodAccessorImpl.invoke (DelegatingMethodAccessorImpl.java:43)
    at java.lang.reflect.Method.invoke (Method.java:606)
    at org.codehaus.plexus.classworlds.launcher.Launcher.launchEnhanced (Launcher.java:289)
    at org.codehaus.plexus.classworlds.launcher.Launcher.launch (Launcher.java:229)
    at org.codehaus.plexus.classworlds.launcher.Launcher.mainWithExitCode (Launcher.java:415)
    at org.codehaus.plexus.classworlds.launcher.Launcher.main (Launcher.java:356)
Caused by: org.apache.maven.plugin.MojoFailureException: 4 builds failed. See console output above for details.
    at org.apache.maven.plugins.invoker.InvokerSession.handleFailures (InvokerSession.java:260)
    at org.apache.maven.plugins.invoker.InvokerMojo.processResults (InvokerMojo.java:68)
    at org.apache.maven.plugins.invoker.AbstractInvokerMojo.execute (AbstractInvokerMojo.java:772)
    at org.apache.maven.plugin.DefaultBuildPluginManager.executeMojo (DefaultBuildPluginManager.java:134)
    at org.apache.maven.lifecycle.internal.MojoExecutor.execute (MojoExecutor.java:208)
    at org.apache.maven.lifecycle.internal.MojoExecutor.execute (MojoExecutor.java:154)
    at org.apache.maven.lifecycle.internal.MojoExecutor.execute (MojoExecutor.java:146)
    at org.apache.maven.lifecycle.internal.LifecycleModuleBuilder.buildProject (LifecycleModuleBuilder.java:117)
    at org.apache.maven.lifecycle.internal.LifecycleModuleBuilder.buildProject (LifecycleModuleBuilder.java:81)
    at org.apache.maven.lifecycle.internal.builder.singlethreaded.SingleThreadedBuilder.build (SingleThreadedBuilder.java:51)
    at org.apache.maven.lifecycle.internal.LifecycleStarter.execute (LifecycleStarter.java:128)
    at org.apache.maven.DefaultMaven.doExecute (DefaultMaven.java:309)
    at org.apache.maven.DefaultMaven.doExecute (DefaultMaven.java:194)
    at org.apache.maven.DefaultMaven.execute (DefaultMaven.java:107)
    at org.apache.maven.cli.MavenCli.execute (MavenCli.java:955)
    at org.apache.maven.cli.MavenCli.doMain (MavenCli.java:290)
    at org.apache.maven.cli.MavenCli.main (MavenCli.java:194)
    at sun.reflect.NativeMethodAccessorImpl.invoke0 (Native Method)
    at sun.reflect.NativeMethodAccessorImpl.invoke (NativeMethodAccessorImpl.java:57)
    at sun.reflect.DelegatingMethodAccessorImpl.invoke (DelegatingMethodAccessorImpl.java:43)
    at java.lang.reflect.Method.invoke (Method.java:606)
    at org.codehaus.plexus.classworlds.launcher.Launcher.launchEnhanced (Launcher.java:289)
    at org.codehaus.plexus.classworlds.launcher.Launcher.launch (Launcher.java:229)
    at org.codehaus.plexus.classworlds.launcher.Launcher.mainWithExitCode (Launcher.java:415)
    at org.codehaus.plexus.classworlds.launcher.Launcher.main (Launcher.java:356)
[ERROR] 
[ERROR] Re-run Maven using the -X switch to enable full debug logging.
[ERROR] 
[ERROR] For more information about the errors and possible solutions, please read the following articles:
[ERROR] [Help 1] http://cwiki.apache.org/confluence/display/MAVEN/MojoFailureException
[ERROR] 
[ERROR] After correcting the problems, you can resume the build with the command
[ERROR]   mvn <goals> -rf :maven-release-plugin
Picked up JAVA_TOOL_OPTIONS: -Dmaven.ext.class.path="f:\jenkins\jenkins-slave\workspace\aven-box_maven-release_stabilize@3@tmp\withMaven7b71b43e\pipeline-maven-spy.jar" -Dorg.jenkinsci.plugins.pipeline.maven.reportsFolder="f:\jenkins\jenkins-slave\workspace\aven-box_maven-release_stabilize@3@tmp\withMaven7b71b43e" 
[Pipeline] }
[Pipeline] // dir
[Pipeline] }
[withMaven] artifactsPublisher - Archive artifact windows-jdk7-m3.5.x_build\pom.xml under org\apache\maven\release\maven-release\3.0.0-SNAPSHOT\maven-release-3.0.0-SNAPSHOT.pom
[withMaven] artifactsPublisher - Archive artifact windows-jdk7-m3.5.x_build\target\maven-release-3.0.0-SNAPSHOT-site.xml under org\apache\maven\release\maven-release\3.0.0-SNAPSHOT\maven-release-3.0.0-SNAPSHOT-site.xml
[withMaven] artifactsPublisher - Archive artifact windows-jdk7-m3.5.x_build\maven-release-api\pom.xml under org\apache\maven\release\maven-release-api\3.0.0-SNAPSHOT\maven-release-api-3.0.0-SNAPSHOT.pom
[withMaven] artifactsPublisher - Archive artifact windows-jdk7-m3.5.x_build\maven-release-api\target\maven-release-api-3.0.0-SNAPSHOT.jar under org\apache\maven\release\maven-release-api\3.0.0-SNAPSHOT\maven-release-api-3.0.0-SNAPSHOT.jar
[withMaven] artifactsPublisher - Archive artifact windows-jdk7-m3.5.x_build\maven-release-manager\pom.xml under org\apache\maven\release\maven-release-manager\3.0.0-SNAPSHOT\maven-release-manager-3.0.0-SNAPSHOT.pom
[withMaven] artifactsPublisher - Archive artifact windows-jdk7-m3.5.x_build\maven-release-manager\target\maven-release-manager-3.0.0-SNAPSHOT.jar under org\apache\maven\release\maven-release-manager\3.0.0-SNAPSHOT\maven-release-manager-3.0.0-SNAPSHOT.jar
[withMaven] junitPublisher - Archive test results for Maven artifact org.apache.maven.release:maven-release-api:jar:3.0.0-SNAPSHOT generated by maven-surefire-plugin:test (default-test): windows-jdk7-m3.5.x_build\maven-release-api\target\surefire-reports\*.xml
Recording test results
None of the test reports contained any result
[withMaven] junitPublisher - Archive test results for Maven artifact org.apache.maven.release:maven-release-manager:jar:3.0.0-SNAPSHOT generated by maven-surefire-plugin:test (default-test): windows-jdk7-m3.5.x_build\maven-release-manager\target\surefire-reports\*.xml
Recording test results
[withMaven] junitPublisher - Archive test results for Maven artifact org.apache.maven.plugins:maven-release-plugin:maven-plugin:3.0.0-SNAPSHOT generated by maven-surefire-plugin:test (default-test): windows-jdk7-m3.5.x_build\maven-release-plugin\target\surefire-reports\*.xml
Recording test results
[withMaven] junitPublisher - Archive test results for Maven artifact org.apache.maven.release:maven-release-manager:jar:3.0.0-SNAPSHOT generated by maven-failsafe-plugin:integration-test (default): windows-jdk7-m3.5.x_build\maven-release-manager\target\failsafe-reports\*.xml
Recording test results
[withMaven] openTasksPublisher - Scan Tasks for Maven artifact org.apache.maven.release:maven-release-api:jar:3.0.0-SNAPSHOT in source directory windows-jdk7-m3.5.x_build\maven-release-api\src\main\java
[withMaven] openTasksPublisher - Scan Tasks for Maven artifact org.apache.maven.release:maven-release-manager:jar:3.0.0-SNAPSHOT in source directory windows-jdk7-m3.5.x_build\maven-release-manager\src\main\java
[withMaven] openTasksPublisher - Scan Tasks for Maven artifact org.apache.maven.plugins:maven-release-plugin:maven-plugin:3.0.0-SNAPSHOT in source directory windows-jdk7-m3.5.x_build\maven-release-plugin\src\main\java
[TASKS] Scanning folder 'f:\jenkins\jenkins-slave\workspace\aven-box_maven-release_stabilize@3' for files matching the pattern 'windows-jdk7-m3.5.x_build\maven-release-api\src\main\java\**\*,windows-jdk7-m3.5.x_build\maven-release-manager\src\main\java\**\*,windows-jdk7-m3.5.x_build\maven-release-plugin\src\main\java\**\*' - excludes: null
[TASKS] Found 127 files to scan for tasks
[TASKS] Found 21 open tasks.
Skipping warnings blame since pipelines do not have an SCM link.%n
[TASKS] Computing warning deltas based on reference build #1
[withMaven] invokerPublisher - Archive invoker results for Maven artifact MavenArtifact{org.apache.maven.plugins:maven-release-plugin:maven-plugin:3.0.0-SNAPSHOT(version: 3.0.0-SNAPSHOT, snapshot:false) } generated by PluginInvocation{org.apache.maven.plugins:maven-invoker-plugin:3.2.0@run  integration-test-prepare}: windows-jdk7-m3.5.x_build\maven-release-plugin\target\invoker-reports\*.xml
[withMaven] Publishers: Generated Artifacts Publisher: 364 ms, Junit Publisher: 12928 ms, Open Task Scanner Publisher: 471 ms, Dependencies Fingerprint Publisher: 128 ms, Invoker Publisher: 18234 ms, Pipeline Graph Publisher: 2 ms
[Pipeline] // withMaven
[Pipeline] cleanWs
[WS-CLEANUP] Deleting project workspace...
[WS-CLEANUP] Deferred wipeout is used...
[WS-CLEANUP] done
[Pipeline] cleanWs
[WS-CLEANUP] Deleting project workspace...
[WS-CLEANUP] Deferred wipeout is used...
[WS-CLEANUP] done
[Pipeline] }
[Pipeline] // stage
[Pipeline] }
[Pipeline] // ws
[Pipeline] }
[Pipeline] // node
[Pipeline] }
Failed in branch windows-jdk7-m3.5.x_build
[Pipeline] // parallel
[Pipeline] stage
[Pipeline] { (Notifications)
[Pipeline] echo
Build result: FAILURE
[Pipeline] jiraIssueSelector
[Pipeline] emailext

Build succeeded in Jenkins: Maven TLP » maven-release » stabilize #6

Posted by Apache Jenkins Server <je...@builds.apache.org>.
See https://builds.apache.org/job/maven-box/job/maven-release/job/stabilize/6/

Changes:

* Lock version of maven-release-plugin
* Lock version of maven-release-plugin
* Lock version of maven-release-plugin
* Lock version of maven-release-plugin
* Lock version of maven-release-plugin
* Lock version of maven-release-plugin

All tests passed