You are viewing a plain text version of this content. The canonical link for it is here.
Posted to builds@cassandra.apache.org by Apache Jenkins Server <je...@builds.apache.org> on 2021/05/12 02:30:25 UTC
Build complete: Cassandra-4.0 #38 [UNSTABLE]
8a6dc6a723778374f6db626fa07d242c6dca59e8
-------------------------------------------------------------------------------
Build Cassandra-4.0 #38 Still unstable
URL: https://ci-cassandra.apache.org/job/Cassandra-4.0/38/
-------------------------------------------------------------------------------
Changes:
No changes
-------------------------------------------------------------------------------
Failed Tests:
8 tests failed.
FAILED: dtest-novnode.transient_replication_ring_test.TestTransientReplicationRing.test_move_forwards_and_cleanup
FAILED: dtest-offheap.bootstrap_test.TestBootstrap.test_failed_bootstrap_wiped_node_can_join
FAILED: dtest-offheap.repair_tests.incremental_repair_test.TestIncRepair.test_multiple_repair
FAILED: org.apache.cassandra.db.compaction.LongLeveledCompactionStrategyCQLTest.stressTestCompactionStrategyManager
FAILED: org.apache.cassandra.utils.memory.LongBufferPoolTest.testPoolAllocateWithRecyclePartially
FAILED: dtest-upgrade.upgrade_tests.cql_tests.TestCQLNodes2RF1_Upgrade_current_4_0_x_To_indev_4_0_x.test_counters
FAILED: cqlshlib.python3.jdk8.no_cython.test.test_unicode.TestCqlshUnicode.test_multiline_input
FAILED: cqlshlib.python3.jdk8.cython.test.test_unicode.TestCqlshUnicode.test_multiline_input
-------------------------------------------------------------------------------
For complete test report and logs see https://nightlies.apache.org/cassandra/Cassandra-4.0/38/