You are viewing a plain text version of this content. The canonical link for it is here.
Posted to notifications@maven.apache.org by Hudson <Hu...@sonatype.org> on 2008/10/11 19:01:55 UTC
Build failed in Hudson: maven-core-integration-testing #7
See http://ci.sonatype.org/job/maven-core-integration-testing/7/changes
Changes:
[Benjamin Bentmann] o Added new IT plugin to check class/resource loading in mojos
------------------------------------------
started
Updating https://svn.apache.org/repos/asf/maven/core-integration-testing/trunk
A core-it-support/core-it-plugins/maven-it-plugin-class-loader
A core-it-support/core-it-plugins/maven-it-plugin-class-loader/maven-it-plugin-class-loader
A core-it-support/core-it-plugins/maven-it-plugin-class-loader/maven-it-plugin-class-loader/src
A core-it-support/core-it-plugins/maven-it-plugin-class-loader/maven-it-plugin-class-loader/src/main
A core-it-support/core-it-plugins/maven-it-plugin-class-loader/maven-it-plugin-class-loader/src/main/java
A core-it-support/core-it-plugins/maven-it-plugin-class-loader/maven-it-plugin-class-loader/src/main/java/org
A core-it-support/core-it-plugins/maven-it-plugin-class-loader/maven-it-plugin-class-loader/src/main/java/org/apache
A core-it-support/core-it-plugins/maven-it-plugin-class-loader/maven-it-plugin-class-loader/src/main/java/org/apache/maven
A core-it-support/core-it-plugins/maven-it-plugin-class-loader/maven-it-plugin-class-loader/src/main/java/org/apache/maven/plugin
A core-it-support/core-it-plugins/maven-it-plugin-class-loader/maven-it-plugin-class-loader/src/main/java/org/apache/maven/plugin/coreit
AU core-it-support/core-it-plugins/maven-it-plugin-class-loader/maven-it-plugin-class-loader/src/main/java/org/apache/maven/plugin/coreit/LoadMojo.java
AU core-it-support/core-it-plugins/maven-it-plugin-class-loader/maven-it-plugin-class-loader/pom.xml
A core-it-support/core-it-plugins/maven-it-plugin-class-loader/dep-a
A core-it-support/core-it-plugins/maven-it-plugin-class-loader/dep-a/src
A core-it-support/core-it-plugins/maven-it-plugin-class-loader/dep-a/src/main
A core-it-support/core-it-plugins/maven-it-plugin-class-loader/dep-a/src/main/java
A core-it-support/core-it-plugins/maven-it-plugin-class-loader/dep-a/src/main/java/org
A core-it-support/core-it-plugins/maven-it-plugin-class-loader/dep-a/src/main/java/org/apache
A core-it-support/core-it-plugins/maven-it-plugin-class-loader/dep-a/src/main/java/org/apache/maven
A core-it-support/core-it-plugins/maven-it-plugin-class-loader/dep-a/src/main/java/org/apache/maven/plugin
A core-it-support/core-it-plugins/maven-it-plugin-class-loader/dep-a/src/main/java/org/apache/maven/plugin/coreit
AU core-it-support/core-it-plugins/maven-it-plugin-class-loader/dep-a/src/main/java/org/apache/maven/plugin/coreit/ClassA.java
AU core-it-support/core-it-plugins/maven-it-plugin-class-loader/dep-a/src/main/java/org/apache/maven/plugin/coreit/SomeClass.java
A core-it-support/core-it-plugins/maven-it-plugin-class-loader/dep-a/src/main/resources
A core-it-support/core-it-plugins/maven-it-plugin-class-loader/dep-a/src/main/resources/org
A core-it-support/core-it-plugins/maven-it-plugin-class-loader/dep-a/src/main/resources/org/apache
A core-it-support/core-it-plugins/maven-it-plugin-class-loader/dep-a/src/main/resources/org/apache/maven
A core-it-support/core-it-plugins/maven-it-plugin-class-loader/dep-a/src/main/resources/org/apache/maven/plugin
A core-it-support/core-it-plugins/maven-it-plugin-class-loader/dep-a/src/main/resources/org/apache/maven/plugin/coreit
AU core-it-support/core-it-plugins/maven-it-plugin-class-loader/dep-a/src/main/resources/org/apache/maven/plugin/coreit/it.properties
AU core-it-support/core-it-plugins/maven-it-plugin-class-loader/dep-a/src/main/resources/org/apache/maven/plugin/coreit/a.properties
AU core-it-support/core-it-plugins/maven-it-plugin-class-loader/dep-a/pom.xml
A core-it-support/core-it-plugins/maven-it-plugin-class-loader/dep-b
A core-it-support/core-it-plugins/maven-it-plugin-class-loader/dep-b/src
A core-it-support/core-it-plugins/maven-it-plugin-class-loader/dep-b/src/main
A core-it-support/core-it-plugins/maven-it-plugin-class-loader/dep-b/src/main/java
A core-it-support/core-it-plugins/maven-it-plugin-class-loader/dep-b/src/main/java/org
A core-it-support/core-it-plugins/maven-it-plugin-class-loader/dep-b/src/main/java/org/apache
A core-it-support/core-it-plugins/maven-it-plugin-class-loader/dep-b/src/main/java/org/apache/maven
A core-it-support/core-it-plugins/maven-it-plugin-class-loader/dep-b/src/main/java/org/apache/maven/plugin
A core-it-support/core-it-plugins/maven-it-plugin-class-loader/dep-b/src/main/java/org/apache/maven/plugin/coreit
AU core-it-support/core-it-plugins/maven-it-plugin-class-loader/dep-b/src/main/java/org/apache/maven/plugin/coreit/ClassB.java
AU core-it-support/core-it-plugins/maven-it-plugin-class-loader/dep-b/src/main/java/org/apache/maven/plugin/coreit/SomeClass.java
A core-it-support/core-it-plugins/maven-it-plugin-class-loader/dep-b/src/main/resources
A core-it-support/core-it-plugins/maven-it-plugin-class-loader/dep-b/src/main/resources/org
A core-it-support/core-it-plugins/maven-it-plugin-class-loader/dep-b/src/main/resources/org/apache
A core-it-support/core-it-plugins/maven-it-plugin-class-loader/dep-b/src/main/resources/org/apache/maven
A core-it-support/core-it-plugins/maven-it-plugin-class-loader/dep-b/src/main/resources/org/apache/maven/plugin
A core-it-support/core-it-plugins/maven-it-plugin-class-loader/dep-b/src/main/resources/org/apache/maven/plugin/coreit
AU core-it-support/core-it-plugins/maven-it-plugin-class-loader/dep-b/src/main/resources/org/apache/maven/plugin/coreit/it.properties
AU core-it-support/core-it-plugins/maven-it-plugin-class-loader/dep-b/src/main/resources/org/apache/maven/plugin/coreit/b.properties
AU core-it-support/core-it-plugins/maven-it-plugin-class-loader/dep-b/pom.xml
AU core-it-support/core-it-plugins/maven-it-plugin-class-loader/pom.xml
U core-it-support/core-it-plugins/pom.xml
At revision 703683
[maven-its] $ mvn clean deploy -B -U -e -Dmaven.repo.local=/home/hudson/repos/core-its
FATAL: command execution failed
java.io.IOException: Cannot run program "mvn" (in directory "http://ci.sonatype.org/job/maven-core-integration-testing/ws/maven-its") : java.io.IOException: error=2, No such file or directory
at java.lang.ProcessBuilder.start(ProcessBuilder.java:459)
at hudson.Proc$LocalProc.<init>(Proc.java:104)
at hudson.Proc$LocalProc.<init>(Proc.java:82)
at hudson.Launcher$LocalLauncher.createLocalProc(Launcher.java:311)
at hudson.Launcher$LocalLauncher.launch(Launcher.java:302)
at hudson.Launcher.launch(Launcher.java:140)
at hudson.Launcher.launch(Launcher.java:92)
at hudson.tasks.Maven.perform(Maven.java:184)
at hudson.model.Build$RunnerImpl.build(Build.java:138)
at hudson.model.Build$RunnerImpl.doRun(Build.java:113)
at hudson.model.AbstractBuild$AbstractRunner.run(AbstractBuild.java:240)
at hudson.model.Run.run(Run.java:793)
at hudson.model.Build.run(Build.java:88)
at hudson.model.ResourceController.execute(ResourceController.java:70)
at hudson.model.Executor.run(Executor.java:88)
Caused by: java.io.IOException: java.io.IOException: error=2, No such file or directory
at java.lang.UNIXProcess.<init>(UNIXProcess.java:148)
at java.lang.ProcessImpl.start(ProcessImpl.java:65)
at java.lang.ProcessBuilder.start(ProcessBuilder.java:452)
... 14 more
Build failed in Hudson: maven-core-integration-testing #11
Posted by Hudson <Hu...@sonatype.org>.
See http://ci.sonatype.org/job/maven-core-integration-testing/11/changes
Changes:
[Benjamin Bentmann] o Rewrote it0114 to use pre-packaged extension and IT support plugin, thereby eliminating dependency on production plugins and accelerating test by almost 10x
[Benjamin Bentmann] o Deleted it0111 which is superseded by it0114
------------------------------------------
started
Updating https://svn.apache.org/repos/asf/maven/core-integration-testing/trunk
D core-it-suite/src/test/java/org/apache/maven/it/MavenIT0114ExtensionThatProvidesResources.java
D core-it-suite/src/test/java/org/apache/maven/it/MavenIT0111PluginsThatRequireAResourceFromAnExtensionTest.java
U core-it-suite/src/test/java/org/apache/maven/it/IntegrationTestSuite.java
AU core-it-suite/src/test/java/org/apache/maven/it/MavenITmng2749Test.java
D core-it-suite/src/test/resources/it0111-pluginThatRequiresResourceFromAnExtension
D core-it-suite/src/test/resources/it0114-extensionThatProvidesResources
A core-it-suite/src/test/resources/mng-2749
A core-it-suite/src/test/resources/mng-2749/repo
A core-it-suite/src/test/resources/mng-2749/repo/org
A core-it-suite/src/test/resources/mng-2749/repo/org/apache
A core-it-suite/src/test/resources/mng-2749/repo/org/apache/maven
A core-it-suite/src/test/resources/mng-2749/repo/org/apache/maven/its
A core-it-suite/src/test/resources/mng-2749/repo/org/apache/maven/its/mng2749
A core-it-suite/src/test/resources/mng-2749/repo/org/apache/maven/its/mng2749/extension
AU core-it-suite/src/test/resources/mng-2749/repo/org/apache/maven/its/mng2749/extension/maven-metadata.xml
A core-it-suite/src/test/resources/mng-2749/repo/org/apache/maven/its/mng2749/extension/0.1
A core-it-suite/src/test/resources/mng-2749/repo/org/apache/maven/its/mng2749/extension/0.1/extension-0.1.pom
AU core-it-suite/src/test/resources/mng-2749/repo/org/apache/maven/its/mng2749/extension/0.1/extension-0.1.jar
AU core-it-suite/src/test/resources/mng-2749/pom.xml
At revision 703874
[maven-its] $ mvn clean deploy -B -U -e -Dmaven.repo.local=/home/hudson/repos/core-its
FATAL: command execution failed
java.io.IOException: Cannot run program "mvn" (in directory "http://ci.sonatype.org/job/maven-core-integration-testing/ws/maven-its") : java.io.IOException: error=2, No such file or directory
at java.lang.ProcessBuilder.start(ProcessBuilder.java:459)
at hudson.Proc$LocalProc.<init>(Proc.java:104)
at hudson.Proc$LocalProc.<init>(Proc.java:82)
at hudson.Launcher$LocalLauncher.createLocalProc(Launcher.java:311)
at hudson.Launcher$LocalLauncher.launch(Launcher.java:302)
at hudson.Launcher.launch(Launcher.java:140)
at hudson.Launcher.launch(Launcher.java:92)
at hudson.tasks.Maven.perform(Maven.java:184)
at hudson.model.Build$RunnerImpl.build(Build.java:138)
at hudson.model.Build$RunnerImpl.doRun(Build.java:113)
at hudson.model.AbstractBuild$AbstractRunner.run(AbstractBuild.java:240)
at hudson.model.Run.run(Run.java:793)
at hudson.model.Build.run(Build.java:88)
at hudson.model.ResourceController.execute(ResourceController.java:70)
at hudson.model.Executor.run(Executor.java:88)
Caused by: java.io.IOException: java.io.IOException: error=2, No such file or directory
at java.lang.UNIXProcess.<init>(UNIXProcess.java:148)
at java.lang.ProcessImpl.start(ProcessImpl.java:65)
at java.lang.ProcessBuilder.start(ProcessBuilder.java:452)
... 14 more
Build failed in Hudson: maven-core-integration-testing #10
Posted by Hudson <Hu...@sonatype.org>.
See http://ci.sonatype.org/job/maven-core-integration-testing/10/changes
Changes:
[Benjamin Bentmann] o Added IT for MNG-3271
[Benjamin Bentmann] o Added IT for MNG-1999
[Benjamin Bentmann] o Added new IT plugin to check ${reports} handling
------------------------------------------
started
Updating https://svn.apache.org/repos/asf/maven/core-integration-testing/trunk
AU core-it-suite/src/test/java/org/apache/maven/it/MavenITmng3271Test.java
U core-it-suite/src/test/java/org/apache/maven/it/IntegrationTestSuite.java
AU core-it-suite/src/test/java/org/apache/maven/it/MavenITmng1999Test.java
U core-it-suite/src/test/resources/bootstrap/pom.xml
A core-it-suite/src/test/resources/mng-3271
AU core-it-suite/src/test/resources/mng-3271/pom.xml
A core-it-suite/src/test/resources/mng-1999
A core-it-suite/src/test/resources/mng-1999/child
AU core-it-suite/src/test/resources/mng-1999/child/pom.xml
AU core-it-suite/src/test/resources/mng-1999/pom.xml
U core-it-support/core-it-plugins/pom.xml
A core-it-support/core-it-plugins/maven-it-plugin-site
A core-it-support/core-it-plugins/maven-it-plugin-site/src
A core-it-support/core-it-plugins/maven-it-plugin-site/src/main
A core-it-support/core-it-plugins/maven-it-plugin-site/src/main/java
A core-it-support/core-it-plugins/maven-it-plugin-site/src/main/java/org
A core-it-support/core-it-plugins/maven-it-plugin-site/src/main/java/org/apache
A core-it-support/core-it-plugins/maven-it-plugin-site/src/main/java/org/apache/maven
A core-it-support/core-it-plugins/maven-it-plugin-site/src/main/java/org/apache/maven/plugin
A core-it-support/core-it-plugins/maven-it-plugin-site/src/main/java/org/apache/maven/plugin/coreit
AU core-it-support/core-it-plugins/maven-it-plugin-site/src/main/java/org/apache/maven/plugin/coreit/ListMojo.java
AU core-it-support/core-it-plugins/maven-it-plugin-site/pom.xml
At revision 703846
[maven-its] $ mvn clean deploy -B -U -e -Dmaven.repo.local=/home/hudson/repos/core-its
FATAL: command execution failed
java.io.IOException: Cannot run program "mvn" (in directory "http://ci.sonatype.org/job/maven-core-integration-testing/ws/maven-its") : java.io.IOException: error=2, No such file or directory
at java.lang.ProcessBuilder.start(ProcessBuilder.java:459)
at hudson.Proc$LocalProc.<init>(Proc.java:104)
at hudson.Proc$LocalProc.<init>(Proc.java:82)
at hudson.Launcher$LocalLauncher.createLocalProc(Launcher.java:311)
at hudson.Launcher$LocalLauncher.launch(Launcher.java:302)
at hudson.Launcher.launch(Launcher.java:140)
at hudson.Launcher.launch(Launcher.java:92)
at hudson.tasks.Maven.perform(Maven.java:184)
at hudson.model.Build$RunnerImpl.build(Build.java:138)
at hudson.model.Build$RunnerImpl.doRun(Build.java:113)
at hudson.model.AbstractBuild$AbstractRunner.run(AbstractBuild.java:240)
at hudson.model.Run.run(Run.java:793)
at hudson.model.Build.run(Build.java:88)
at hudson.model.ResourceController.execute(ResourceController.java:70)
at hudson.model.Executor.run(Executor.java:88)
Caused by: java.io.IOException: java.io.IOException: error=2, No such file or directory
at java.lang.UNIXProcess.<init>(UNIXProcess.java:148)
at java.lang.ProcessImpl.start(ProcessImpl.java:65)
at java.lang.ProcessBuilder.start(ProcessBuilder.java:452)
... 14 more
Build failed in Hudson: maven-core-integration-testing #9
Posted by Hudson <Hu...@sonatype.org>.
See http://ci.sonatype.org/job/maven-core-integration-testing/9/changes
Changes:
[Benjamin Bentmann] o Fixed stream handling
[Benjamin Bentmann] o Printed elapsed test time to highlight long running tests
------------------------------------------
started
Updating https://svn.apache.org/repos/asf/maven/core-integration-testing/trunk
U core-it-suite/src/test/java/org/apache/maven/it/MavenITmng3473PluginReportCrash.java
U core-it-support/maven-it-helper/src/main/java/org/apache/maven/it/AbstractMavenIntegrationTestCase.java
At revision 703813
[maven-its] $ mvn clean deploy -B -U -e -Dmaven.repo.local=/home/hudson/repos/core-its
FATAL: command execution failed
java.io.IOException: Cannot run program "mvn" (in directory "http://ci.sonatype.org/job/maven-core-integration-testing/ws/maven-its") : java.io.IOException: error=2, No such file or directory
at java.lang.ProcessBuilder.start(ProcessBuilder.java:459)
at hudson.Proc$LocalProc.<init>(Proc.java:104)
at hudson.Proc$LocalProc.<init>(Proc.java:82)
at hudson.Launcher$LocalLauncher.createLocalProc(Launcher.java:311)
at hudson.Launcher$LocalLauncher.launch(Launcher.java:302)
at hudson.Launcher.launch(Launcher.java:140)
at hudson.Launcher.launch(Launcher.java:92)
at hudson.tasks.Maven.perform(Maven.java:184)
at hudson.model.Build$RunnerImpl.build(Build.java:138)
at hudson.model.Build$RunnerImpl.doRun(Build.java:113)
at hudson.model.AbstractBuild$AbstractRunner.run(AbstractBuild.java:240)
at hudson.model.Run.run(Run.java:793)
at hudson.model.Build.run(Build.java:88)
at hudson.model.ResourceController.execute(ResourceController.java:70)
at hudson.model.Executor.run(Executor.java:88)
Caused by: java.io.IOException: java.io.IOException: error=2, No such file or directory
at java.lang.UNIXProcess.<init>(UNIXProcess.java:148)
at java.lang.ProcessImpl.start(ProcessImpl.java:65)
at java.lang.ProcessBuilder.start(ProcessBuilder.java:452)
... 14 more
Build failed in Hudson: maven-core-integration-testing #8
Posted by Hudson <Hu...@sonatype.org>.
See http://ci.sonatype.org/job/maven-core-integration-testing/8/changes
Changes:
[Benjamin Bentmann] o Cured "Skipping (version ${maven.version} not in range (2.0.8,))" when using -Dtest=
[Benjamin Bentmann] o Added IT for MNG-2892
[Benjamin Bentmann] o Added IT for MNG-1703
[Benjamin Bentmann] o Deleted it0089 which duplicates the intention of it0086
(Checkstyle's PackageNamesLoader.loadModuleFactory() merely boils down to ClassLoader.getResource())
[Benjamin Bentmann] o Decoupled it0087 from production dependency
[Benjamin Bentmann] o Decoupled it0086 from production dependency
------------------------------------------
started
Updating https://svn.apache.org/repos/asf/maven/core-integration-testing/trunk
D core-it-suite/src/test/java/org/apache/maven/it/MavenIT0089Test.java
U core-it-suite/src/test/java/org/apache/maven/it/IntegrationTestSuite.java
AU core-it-suite/src/test/java/org/apache/maven/it/MavenITmng1703Test.java
AU core-it-suite/src/test/java/org/apache/maven/it/MavenITmng2892Test.java
U core-it-suite/src/test/java/org/apache/maven/it/MavenIT0086Test.java
U core-it-suite/src/test/java/org/apache/maven/it/MavenIT0087Test.java
D core-it-suite/src/test/resources/it0089
A core-it-suite/src/test/resources/mng-1703
A core-it-suite/src/test/resources/mng-1703/child
A core-it-suite/src/test/resources/mng-1703/child/repo
A core-it-suite/src/test/resources/mng-1703/child/repo/org
A core-it-suite/src/test/resources/mng-1703/child/repo/org/apache
A core-it-suite/src/test/resources/mng-1703/child/repo/org/apache/maven
A core-it-suite/src/test/resources/mng-1703/child/repo/org/apache/maven/its
A core-it-suite/src/test/resources/mng-1703/child/repo/org/apache/maven/its/mng1703
A core-it-suite/src/test/resources/mng-1703/child/repo/org/apache/maven/its/mng1703/dep
AU core-it-suite/src/test/resources/mng-1703/child/repo/org/apache/maven/its/mng1703/dep/maven-metadata.xml
A core-it-suite/src/test/resources/mng-1703/child/repo/org/apache/maven/its/mng1703/dep/0.1
AU core-it-suite/src/test/resources/mng-1703/child/repo/org/apache/maven/its/mng1703/dep/0.1/dep-0.1.jar
A core-it-suite/src/test/resources/mng-1703/child/repo/org/apache/maven/its/mng1703/dep/0.1/dep-0.1.pom
AU core-it-suite/src/test/resources/mng-1703/child/pom.xml
AU core-it-suite/src/test/resources/mng-1703/pom.xml
U core-it-suite/src/test/resources/it0086/pom.xml
A core-it-suite/src/test/resources/it0087/repo
A core-it-suite/src/test/resources/it0087/repo/org
A core-it-suite/src/test/resources/it0087/repo/org/apache
A core-it-suite/src/test/resources/it0087/repo/org/apache/maven
A core-it-suite/src/test/resources/it0087/repo/org/apache/maven/its
A core-it-suite/src/test/resources/it0087/repo/org/apache/maven/its/it0087
A core-it-suite/src/test/resources/it0087/repo/org/apache/maven/its/it0087/dep
A core-it-suite/src/test/resources/it0087/repo/org/apache/maven/its/it0087/dep/1.3
A core-it-suite/src/test/resources/it0087/repo/org/apache/maven/its/it0087/dep/1.3/dep-1.3.pom
AU core-it-suite/src/test/resources/it0087/repo/org/apache/maven/its/it0087/dep/1.3/dep-1.3.jar
AU core-it-suite/src/test/resources/it0087/repo/org/apache/maven/its/it0087/dep/maven-metadata.xml
U core-it-suite/src/test/resources/it0087/pom.xml
U core-it-suite/src/test/resources/bootstrap/pom.xml
A core-it-suite/src/test/resources/mng-2892
A core-it-suite/src/test/resources/mng-2892/repo
A core-it-suite/src/test/resources/mng-2892/repo/org
A core-it-suite/src/test/resources/mng-2892/repo/org/codehaus
A core-it-suite/src/test/resources/mng-2892/repo/org/codehaus/plexus
A core-it-suite/src/test/resources/mng-2892/repo/org/codehaus/plexus/plexus-utils
AU core-it-suite/src/test/resources/mng-2892/repo/org/codehaus/plexus/plexus-utils/maven-metadata.xml
A core-it-suite/src/test/resources/mng-2892/repo/org/codehaus/plexus/plexus-utils/0.1-stub
A core-it-suite/src/test/resources/mng-2892/repo/org/codehaus/plexus/plexus-utils/0.1-stub/plexus-utils-0.1-stub.pom
AU core-it-suite/src/test/resources/mng-2892/repo/org/codehaus/plexus/plexus-utils/0.1-stub/plexus-utils-0.1-stub.jar
AU core-it-suite/src/test/resources/mng-2892/pom.xml
U core-it-support/maven-it-helper/src/main/java/org/apache/maven/it/AbstractMavenIntegrationTestCase.java
At revision 703731
[maven-its] $ mvn clean deploy -B -U -e -Dmaven.repo.local=/home/hudson/repos/core-its
FATAL: command execution failed
java.io.IOException: Cannot run program "mvn" (in directory "http://ci.sonatype.org/job/maven-core-integration-testing/ws/maven-its") : java.io.IOException: error=2, No such file or directory
at java.lang.ProcessBuilder.start(ProcessBuilder.java:459)
at hudson.Proc$LocalProc.<init>(Proc.java:104)
at hudson.Proc$LocalProc.<init>(Proc.java:82)
at hudson.Launcher$LocalLauncher.createLocalProc(Launcher.java:311)
at hudson.Launcher$LocalLauncher.launch(Launcher.java:302)
at hudson.Launcher.launch(Launcher.java:140)
at hudson.Launcher.launch(Launcher.java:92)
at hudson.tasks.Maven.perform(Maven.java:184)
at hudson.model.Build$RunnerImpl.build(Build.java:138)
at hudson.model.Build$RunnerImpl.doRun(Build.java:113)
at hudson.model.AbstractBuild$AbstractRunner.run(AbstractBuild.java:240)
at hudson.model.Run.run(Run.java:793)
at hudson.model.Build.run(Build.java:88)
at hudson.model.ResourceController.execute(ResourceController.java:70)
at hudson.model.Executor.run(Executor.java:88)
Caused by: java.io.IOException: java.io.IOException: error=2, No such file or directory
at java.lang.UNIXProcess.<init>(UNIXProcess.java:148)
at java.lang.ProcessImpl.start(ProcessImpl.java:65)
at java.lang.ProcessBuilder.start(ProcessBuilder.java:452)
... 14 more