You are viewing a plain text version of this content. The canonical link for it is here.
Posted to builds@beam.apache.org by Apache Jenkins Server <je...@builds.apache.org> on 2023/11/12 04:48:43 UTC

Build failed in Jenkins: beam_PostCommit_Python311 #872

See <https://ci-beam.apache.org/job/beam_PostCommit_Python311/872/display/redirect>

Changes:


------------------------------------------
Started by timer
Running as SYSTEM
[EnvInject] - Loading node environment variables.
Building remotely on apache-beam-jenkins-10 (beam) in workspace <https://ci-beam.apache.org/job/beam_PostCommit_Python311/ws/>
The recommended git tool is: NONE
No credentials specified
Wiping out workspace first.
Cloning the remote Git repository
Using shallow clone with depth 1
Avoid fetching tags
Cloning repository https://github.com/apache/beam.git
 > git init <https://ci-beam.apache.org/job/beam_PostCommit_Python311/ws/src> # timeout=10
Fetching upstream changes from https://github.com/apache/beam.git
 > git --version # timeout=10
 > git --version # 'git version 2.25.1'
 > git fetch --no-tags --force --progress --depth=1 -- https://github.com/apache/beam.git +refs/heads/*:refs/remotes/origin/* # timeout=10
 > git config remote.origin.url https://github.com/apache/beam.git # timeout=10
 > git config --add remote.origin.fetch +refs/heads/*:refs/remotes/origin/* # timeout=10
 > git config remote.origin.url https://github.com/apache/beam.git # timeout=10
Using shallow fetch with depth 1
Fetching upstream changes from https://github.com/apache/beam.git
 > git fetch --no-tags --force --progress --depth=1 -- https://github.com/apache/beam.git +refs/heads/*:refs/remotes/origin/* +refs/pull/${ghprbPullId}/*:refs/remotes/origin/pr/${ghprbPullId}/* # timeout=10
 > git rev-parse origin/master^{commit} # timeout=10
Checking out Revision 2ad459113134dfffd3caeeb15e821bb644e08663 (origin/master)
 > git config core.sparsecheckout # timeout=10
 > git checkout -f 2ad459113134dfffd3caeeb15e821bb644e08663 # timeout=10
Commit message: "[YAML] - Kafka Read and Write proto (#29368)"
 > git rev-list --no-walk 39986e60ea367566da1f4a49d34a53f7ba75cf98 # timeout=10
First time build. Skipping changelog.
No emails were triggered.
[EnvInject] - Executing scripts and injecting environment variables after the SCM step.
[EnvInject] - Injecting as environment variables the properties content 
SETUPTOOLS_USE_DISTUTILS=stdlib
SPARK_LOCAL_IP=127.0.0.1

[EnvInject] - Variables injected successfully.
[Gradle] - Launching build.
[src] $ <https://ci-beam.apache.org/job/beam_PostCommit_Python311/ws/src/gradlew> --continue --max-workers=8 -Dorg.gradle.jvmargs=-Xms2g -Dorg.gradle.jvmargs=-Xmx6g -Dorg.gradle.vfs.watch=false -Pdocker-pull-licenses -PuseWheelDistribution :python311PostCommit
To honour the JVM settings for this build a single-use Daemon process will be forked. For more on this, please refer to https://docs.gradle.org/8.4/userguide/gradle_daemon.html#sec:disabling_the_daemon in the Gradle documentation.
Daemon will be stopped at the end of the build 
Configuration on demand is an incubating feature.
Gradle Enterprise plugins resolution: https://plugins.gradle.org/m2
Enforcing Gradle Enterprise: https://ge.apache.org, allowUntrustedServer: false
> Task :buildSrc:compileJava NO-SOURCE
> Task :buildSrc:compileGroovy FROM-CACHE
> Task :buildSrc:pluginDescriptors
> Task :buildSrc:processResources
> Task :buildSrc:classes
> Task :buildSrc:jar

> Configure project :sdks:java:container:java8
docker-pull-licenses set, creating go-licenses

> Configure project :sdks:java:container:java11
docker-pull-licenses set, creating go-licenses
System Go installation: /snap/bin/go is go version go1.16.15 linux/amd64; Preparing to use /home/jenkins/go/bin/go1.21.4
/home/jenkins/go/pkg/mod/golang.org/dl@v0.0.0-20231107201224-8165dcd93058/go1.21.4/main.go:20:8: //go:build comment without // +build comment

FAILURE: Build failed with an exception.

* What went wrong:
Could not determine the dependencies of task ':sdks:python:container:goBuild'.
> Could not create task ':sdks:python:container:goPrepare'.
   > Process 'command 'sh'' finished with non-zero exit value 1

* Try:
> Run with --stacktrace option to get the stack trace.
> Run with --info or --debug option to get more log output.
> Get more help at https://help.gradle.org.

Deprecated Gradle features were used in this build, making it incompatible with Gradle 9.0.

You can use '--warning-mode all' to show the individual deprecation warnings and determine if they come from your own scripts or plugins.

For more on this, please refer to https://docs.gradle.org/8.4/userguide/command_line_interface.html#sec:command_line_warnings in the Gradle documentation.

BUILD FAILED in 19s
4 actionable tasks: 3 executed, 1 from cache

Publishing build scan...
https://ge.apache.org/s/6s7i3tzuwdply

Build step 'Invoke Gradle script' changed build result to FAILURE
Build step 'Invoke Gradle script' marked build as failure

---------------------------------------------------------------------
To unsubscribe, e-mail: builds-unsubscribe@beam.apache.org
For additional commands, e-mail: builds-help@beam.apache.org


Jenkins build is back to normal : beam_PostCommit_Python311 #879

Posted by Apache Jenkins Server <je...@builds.apache.org>.
See <https://ci-beam.apache.org/job/beam_PostCommit_Python311/879/display/redirect>


---------------------------------------------------------------------
To unsubscribe, e-mail: builds-unsubscribe@beam.apache.org
For additional commands, e-mail: builds-help@beam.apache.org


Build failed in Jenkins: beam_PostCommit_Python311 #878

Posted by Apache Jenkins Server <je...@builds.apache.org>.
See <https://ci-beam.apache.org/job/beam_PostCommit_Python311/878/display/redirect>

Changes:


------------------------------------------
[...truncated 1.08 MB...]
apache_beam/io/gcp/bigquery_json_it_test.py::BigQueryJsonIT::test_query_read 
[gw1] PASSED apache_beam/io/parquetio_it_test.py::TestParquetIT::test_parquetio_it 
apache_beam/io/gcp/bigquery_file_loads_test.py::BigQueryFileLoadsIT::test_bqfl_streaming 
[gw1] SKIPPED apache_beam/io/gcp/bigquery_file_loads_test.py::BigQueryFileLoadsIT::test_bqfl_streaming 
apache_beam/io/gcp/bigquery_file_loads_test.py::BigQueryFileLoadsIT::test_bqfl_streaming_with_copy_jobs 
[gw1] SKIPPED apache_beam/io/gcp/bigquery_file_loads_test.py::BigQueryFileLoadsIT::test_bqfl_streaming_with_copy_jobs 
apache_beam/io/gcp/bigquery_file_loads_test.py::BigQueryFileLoadsIT::test_bqfl_streaming_with_dynamic_destinations 
[gw1] SKIPPED apache_beam/io/gcp/bigquery_file_loads_test.py::BigQueryFileLoadsIT::test_bqfl_streaming_with_dynamic_destinations 
apache_beam/io/gcp/bigquery_file_loads_test.py::BigQueryFileLoadsIT::test_multiple_destinations_transform 
[gw7] PASSED apache_beam/io/gcp/big_query_query_to_table_it_test.py::BigQueryQueryToTableIT::test_big_query_legacy_sql 
apache_beam/io/gcp/big_query_query_to_table_it_test.py::BigQueryQueryToTableIT::test_big_query_new_types 
[gw6] PASSED apache_beam/examples/dataframe/taxiride_it_test.py::TaxirideIT::test_aggregation 
apache_beam/examples/dataframe/taxiride_it_test.py::TaxirideIT::test_enrich 
[gw3] PASSED apache_beam/examples/complete/game/leader_board_it_test.py::LeaderBoardIT::test_leader_board_it 
apache_beam/io/gcp/bigquery_io_read_it_test.py::BigqueryIOReadIT::test_bigquery_read_1M_python 
[gw2] PASSED apache_beam/io/gcp/bigquery_read_it_test.py::ReadTests::test_iobase_source 
apache_beam/io/gcp/bigquery_read_it_test.py::ReadTests::test_native_source 
[gw5] PASSED apache_beam/io/gcp/bigquery_write_it_test.py::BigQueryWriteIntegrationTests::test_big_query_write 
apache_beam/io/gcp/bigquery_write_it_test.py::BigQueryWriteIntegrationTests::test_big_query_write_insert_errors_reporting 
[gw0] PASSED apache_beam/dataframe/io_it_test.py::ReadUsingReadGbqTests::test_ReadGbq_with_computation 
apache_beam/io/gcp/gcsfilesystem_integration_test.py::GcsFileSystemIntegrationTest::test_copy 
[gw0] PASSED apache_beam/io/gcp/gcsfilesystem_integration_test.py::GcsFileSystemIntegrationTest::test_copy 
apache_beam/io/gcp/gcsfilesystem_integration_test.py::GcsFileSystemIntegrationTest::test_rename 
[gw0] PASSED apache_beam/io/gcp/gcsfilesystem_integration_test.py::GcsFileSystemIntegrationTest::test_rename 
apache_beam/io/gcp/gcsfilesystem_integration_test.py::GcsFileSystemIntegrationTest::test_rename_error 
[gw0] PASSED apache_beam/io/gcp/gcsfilesystem_integration_test.py::GcsFileSystemIntegrationTest::test_rename_error 
apache_beam/io/gcp/healthcare/dicomio_integration_test.py::DICOMIoIntegrationTest::test_dicom_search_instances 
[gw4] PASSED apache_beam/io/gcp/bigquery_json_it_test.py::BigQueryJsonIT::test_query_read 
apache_beam/io/gcp/bigquery_json_it_test.py::BigQueryJsonIT::test_streaming_inserts 
[gw7] PASSED apache_beam/io/gcp/big_query_query_to_table_it_test.py::BigQueryQueryToTableIT::test_big_query_new_types 
apache_beam/io/gcp/big_query_query_to_table_it_test.py::BigQueryQueryToTableIT::test_big_query_new_types_avro 
[gw1] PASSED apache_beam/io/gcp/bigquery_file_loads_test.py::BigQueryFileLoadsIT::test_multiple_destinations_transform 
apache_beam/io/gcp/bigquery_file_loads_test.py::BigQueryFileLoadsIT::test_one_job_fails_all_jobs_fail 
[gw3] PASSED apache_beam/io/gcp/bigquery_io_read_it_test.py::BigqueryIOReadIT::test_bigquery_read_1M_python 
apache_beam/io/gcp/bigquery_io_read_it_test.py::BigqueryIOReadIT::test_bigquery_read_custom_1M_python 
[gw2] PASSED apache_beam/io/gcp/bigquery_read_it_test.py::ReadTests::test_native_source 
apache_beam/io/gcp/bigquery_read_it_test.py::ReadTests::test_table_schema_retrieve 
[gw5] PASSED apache_beam/io/gcp/bigquery_write_it_test.py::BigQueryWriteIntegrationTests::test_big_query_write_insert_errors_reporting 
apache_beam/io/gcp/bigquery_write_it_test.py::BigQueryWriteIntegrationTests::test_big_query_write_insert_non_transient_api_call_error 
[gw0] PASSED apache_beam/io/gcp/healthcare/dicomio_integration_test.py::DICOMIoIntegrationTest::test_dicom_search_instances 
apache_beam/io/gcp/healthcare/dicomio_integration_test.py::DICOMIoIntegrationTest::test_dicom_store_instance_from_gcs 
[gw7] PASSED apache_beam/io/gcp/big_query_query_to_table_it_test.py::BigQueryQueryToTableIT::test_big_query_new_types_avro 
apache_beam/io/gcp/big_query_query_to_table_it_test.py::BigQueryQueryToTableIT::test_big_query_standard_sql 
[gw1] PASSED apache_beam/io/gcp/bigquery_file_loads_test.py::BigQueryFileLoadsIT::test_one_job_fails_all_jobs_fail 
apache_beam/io/gcp/pubsub_integration_test.py::PubSubIntegrationTest::test_streaming_data_only 
[gw3] PASSED apache_beam/io/gcp/bigquery_io_read_it_test.py::BigqueryIOReadIT::test_bigquery_read_custom_1M_python 
apache_beam/io/gcp/datastore/v1new/datastore_write_it_test.py::DatastoreWriteIT::test_datastore_write_limit 
[gw2] PASSED apache_beam/io/gcp/bigquery_read_it_test.py::ReadTests::test_table_schema_retrieve 
apache_beam/io/gcp/bigquery_read_it_test.py::ReadTests::test_table_schema_retrieve_specifying_only_table 
[gw5] PASSED apache_beam/io/gcp/bigquery_write_it_test.py::BigQueryWriteIntegrationTests::test_big_query_write_insert_non_transient_api_call_error 
apache_beam/io/gcp/bigquery_write_it_test.py::BigQueryWriteIntegrationTests::test_big_query_write_new_types 
[gw0] PASSED apache_beam/io/gcp/healthcare/dicomio_integration_test.py::DICOMIoIntegrationTest::test_dicom_store_instance_from_gcs 
apache_beam/ml/gcp/cloud_dlp_it_test.py::CloudDLPIT::test_deidentification 
[gw4] PASSED apache_beam/io/gcp/bigquery_json_it_test.py::BigQueryJsonIT::test_streaming_inserts 
apache_beam/io/gcp/gcsio_integration_test.py::GcsIOIntegrationTest::test_copy 
[gw4] PASSED apache_beam/io/gcp/gcsio_integration_test.py::GcsIOIntegrationTest::test_copy 
apache_beam/io/gcp/gcsio_integration_test.py::GcsIOIntegrationTest::test_copy_batch 
[gw4] PASSED apache_beam/io/gcp/gcsio_integration_test.py::GcsIOIntegrationTest::test_copy_batch 
apache_beam/io/gcp/gcsio_integration_test.py::GcsIOIntegrationTest::test_copy_batch_kms 
[gw4] PASSED apache_beam/io/gcp/gcsio_integration_test.py::GcsIOIntegrationTest::test_copy_batch_kms 
apache_beam/io/gcp/gcsio_integration_test.py::GcsIOIntegrationTest::test_copy_batch_rewrite_token 
[gw4] PASSED apache_beam/io/gcp/gcsio_integration_test.py::GcsIOIntegrationTest::test_copy_batch_rewrite_token 
apache_beam/io/gcp/gcsio_integration_test.py::GcsIOIntegrationTest::test_copy_kms 
[gw4] PASSED apache_beam/io/gcp/gcsio_integration_test.py::GcsIOIntegrationTest::test_copy_kms 
apache_beam/io/gcp/gcsio_integration_test.py::GcsIOIntegrationTest::test_copy_rewrite_token 
[gw4] PASSED apache_beam/io/gcp/gcsio_integration_test.py::GcsIOIntegrationTest::test_copy_rewrite_token 
apache_beam/ml/inference/onnx_inference_it_test.py::OnnxInference::test_onnx_run_inference_roberta_sentiment_classification 
[gw4] SKIPPED apache_beam/ml/inference/onnx_inference_it_test.py::OnnxInference::test_onnx_run_inference_roberta_sentiment_classification 
apache_beam/ml/inference/pytorch_inference_it_test.py::PyTorchInference::test_torch_run_inference_bert_for_masked_lm 
[gw4] SKIPPED apache_beam/ml/inference/pytorch_inference_it_test.py::PyTorchInference::test_torch_run_inference_bert_for_masked_lm 
apache_beam/ml/inference/pytorch_inference_it_test.py::PyTorchInference::test_torch_run_inference_bert_for_masked_lm_large_model 
[gw4] SKIPPED apache_beam/ml/inference/pytorch_inference_it_test.py::PyTorchInference::test_torch_run_inference_bert_for_masked_lm_large_model 
apache_beam/ml/inference/pytorch_inference_it_test.py::PyTorchInference::test_torch_run_inference_coco_maskrcnn_resnet50_fpn 
[gw4] SKIPPED apache_beam/ml/inference/pytorch_inference_it_test.py::PyTorchInference::test_torch_run_inference_coco_maskrcnn_resnet50_fpn 
apache_beam/ml/inference/pytorch_inference_it_test.py::PyTorchInference::test_torch_run_inference_coco_maskrcnn_resnet50_fpn_v1_and_v2 
[gw4] SKIPPED apache_beam/ml/inference/pytorch_inference_it_test.py::PyTorchInference::test_torch_run_inference_coco_maskrcnn_resnet50_fpn_v1_and_v2 
apache_beam/ml/inference/pytorch_inference_it_test.py::PyTorchInference::test_torch_run_inference_imagenet_mobilenetv2 
[gw4] SKIPPED apache_beam/ml/inference/pytorch_inference_it_test.py::PyTorchInference::test_torch_run_inference_imagenet_mobilenetv2 
apache_beam/ml/inference/sklearn_inference_it_test.py::SklearnInference::test_sklearn_mnist_classification 
[gw7] PASSED apache_beam/io/gcp/big_query_query_to_table_it_test.py::BigQueryQueryToTableIT::test_big_query_standard_sql 
apache_beam/ml/gcp/naturallanguageml_test_it.py::NaturalLanguageMlTestIT::test_analyzing_syntax 
[gw7] SKIPPED apache_beam/ml/gcp/naturallanguageml_test_it.py::NaturalLanguageMlTestIT::test_analyzing_syntax 
apache_beam/ml/gcp/videointelligenceml_test_it.py::VideoIntelligenceMlTestIT::test_label_detection_with_video_context 
[gw7] SKIPPED apache_beam/ml/gcp/videointelligenceml_test_it.py::VideoIntelligenceMlTestIT::test_label_detection_with_video_context 
apache_beam/ml/inference/tensorflow_inference_it_test.py::TensorflowInference::test_tf_imagenet_image_segmentation 
[gw7] SKIPPED apache_beam/ml/inference/tensorflow_inference_it_test.py::TensorflowInference::test_tf_imagenet_image_segmentation 
apache_beam/ml/inference/tensorflow_inference_it_test.py::TensorflowInference::test_tf_mnist_classification 
[gw7] SKIPPED apache_beam/ml/inference/tensorflow_inference_it_test.py::TensorflowInference::test_tf_mnist_classification 
apache_beam/ml/inference/tensorflow_inference_it_test.py::TensorflowInference::test_tf_mnist_classification_large_model 
[gw7] SKIPPED apache_beam/ml/inference/tensorflow_inference_it_test.py::TensorflowInference::test_tf_mnist_classification_large_model 
apache_beam/ml/inference/tensorflow_inference_it_test.py::TensorflowInference::test_tf_mnist_with_weights_classification 
[gw7] SKIPPED apache_beam/ml/inference/tensorflow_inference_it_test.py::TensorflowInference::test_tf_mnist_with_weights_classification 
apache_beam/ml/inference/xgboost_inference_it_test.py::XGBoostInference::test_iris_classification_datatable_multi_batch 
[gw7] SKIPPED apache_beam/ml/inference/xgboost_inference_it_test.py::XGBoostInference::test_iris_classification_datatable_multi_batch 
apache_beam/ml/inference/xgboost_inference_it_test.py::XGBoostInference::test_iris_classification_datatable_single_batch 
[gw7] SKIPPED apache_beam/ml/inference/xgboost_inference_it_test.py::XGBoostInference::test_iris_classification_datatable_single_batch 
apache_beam/ml/inference/xgboost_inference_it_test.py::XGBoostInference::test_iris_classification_numpy_multi_batch 
[gw7] SKIPPED apache_beam/ml/inference/xgboost_inference_it_test.py::XGBoostInference::test_iris_classification_numpy_multi_batch 
apache_beam/ml/inference/xgboost_inference_it_test.py::XGBoostInference::test_iris_classification_numpy_single_batch 
[gw7] SKIPPED apache_beam/ml/inference/xgboost_inference_it_test.py::XGBoostInference::test_iris_classification_numpy_single_batch 
apache_beam/ml/inference/xgboost_inference_it_test.py::XGBoostInference::test_iris_classification_numpy_single_batch_large_model 
[gw7] SKIPPED apache_beam/ml/inference/xgboost_inference_it_test.py::XGBoostInference::test_iris_classification_numpy_single_batch_large_model 
apache_beam/ml/inference/xgboost_inference_it_test.py::XGBoostInference::test_iris_classification_pandas_multi_batch 
[gw7] SKIPPED apache_beam/ml/inference/xgboost_inference_it_test.py::XGBoostInference::test_iris_classification_pandas_multi_batch 
apache_beam/ml/inference/xgboost_inference_it_test.py::XGBoostInference::test_iris_classification_pandas_single_batch 
[gw7] SKIPPED apache_beam/ml/inference/xgboost_inference_it_test.py::XGBoostInference::test_iris_classification_pandas_single_batch 
apache_beam/ml/inference/xgboost_inference_it_test.py::XGBoostInference::test_iris_classification_scipy_multi_batch 
[gw7] SKIPPED apache_beam/ml/inference/xgboost_inference_it_test.py::XGBoostInference::test_iris_classification_scipy_multi_batch 
apache_beam/ml/inference/xgboost_inference_it_test.py::XGBoostInference::test_iris_classification_scipy_single_batch 
[gw7] SKIPPED apache_beam/ml/inference/xgboost_inference_it_test.py::XGBoostInference::test_iris_classification_scipy_single_batch 
apache_beam/runners/dataflow/dataflow_exercise_metrics_pipeline_test.py::ExerciseMetricsPipelineTest::test_metrics_it 
[gw7] SKIPPED apache_beam/runners/dataflow/dataflow_exercise_metrics_pipeline_test.py::ExerciseMetricsPipelineTest::test_metrics_it 
apache_beam/testing/test_stream_it_test.py::TestStreamIntegrationTests::test_basic_execution 
[gw7] SKIPPED apache_beam/testing/test_stream_it_test.py::TestStreamIntegrationTests::test_basic_execution 
apache_beam/testing/test_stream_it_test.py::TestStreamIntegrationTests::test_multiple_outputs 
[gw7] SKIPPED apache_beam/testing/test_stream_it_test.py::TestStreamIntegrationTests::test_multiple_outputs 
apache_beam/testing/test_stream_it_test.py::TestStreamIntegrationTests::test_multiple_outputs_with_watermark_advancement 
[gw7] SKIPPED apache_beam/testing/test_stream_it_test.py::TestStreamIntegrationTests::test_multiple_outputs_with_watermark_advancement 
apache_beam/transforms/external_it_test.py::ExternalTransformIT::test_job_python_from_python_it 
[gw2] PASSED apache_beam/io/gcp/bigquery_read_it_test.py::ReadTests::test_table_schema_retrieve_specifying_only_table 
apache_beam/io/gcp/bigquery_read_it_test.py::ReadTests::test_table_schema_retrieve_with_direct_read 
[gw5] PASSED apache_beam/io/gcp/bigquery_write_it_test.py::BigQueryWriteIntegrationTests::test_big_query_write_new_types 
apache_beam/io/gcp/bigquery_write_it_test.py::BigQueryWriteIntegrationTests::test_big_query_write_schema_autodetect 
[gw5] SKIPPED apache_beam/io/gcp/bigquery_write_it_test.py::BigQueryWriteIntegrationTests::test_big_query_write_schema_autodetect 
apache_beam/io/gcp/bigquery_write_it_test.py::BigQueryWriteIntegrationTests::test_big_query_write_without_schema 
[gw0] PASSED apache_beam/ml/gcp/cloud_dlp_it_test.py::CloudDLPIT::test_deidentification 
apache_beam/ml/gcp/cloud_dlp_it_test.py::CloudDLPIT::test_inspection 
[gw6] PASSED apache_beam/examples/dataframe/taxiride_it_test.py::TaxirideIT::test_enrich 
apache_beam/io/gcp/bigquery_test.py::BigQueryStreamingInsertTransformIntegrationTests::test_multiple_destinations_transform 
[gw4] PASSED apache_beam/ml/inference/sklearn_inference_it_test.py::SklearnInference::test_sklearn_mnist_classification 
apache_beam/ml/inference/sklearn_inference_it_test.py::SklearnInference::test_sklearn_mnist_classification_large_model 
[gw7] PASSED apache_beam/transforms/external_it_test.py::ExternalTransformIT::test_job_python_from_python_it 
apache_beam/transforms/periodicsequence_it_test.py::PeriodicSequenceIT::test_periodicsequence_outputs_valid_watermarks_it 
[gw7] SKIPPED apache_beam/transforms/periodicsequence_it_test.py::PeriodicSequenceIT::test_periodicsequence_outputs_valid_watermarks_it 
[gw2] PASSED apache_beam/io/gcp/bigquery_read_it_test.py::ReadTests::test_table_schema_retrieve_with_direct_read 
apache_beam/io/gcp/bigquery_read_it_test.py::ReadUsingStorageApiTests::test_iobase_source 
[gw1] PASSED apache_beam/io/gcp/pubsub_integration_test.py::PubSubIntegrationTest::test_streaming_data_only 
apache_beam/io/gcp/pubsub_integration_test.py::PubSubIntegrationTest::test_streaming_with_attributes 
[gw0] PASSED apache_beam/ml/gcp/cloud_dlp_it_test.py::CloudDLPIT::test_inspection 
apache_beam/ml/inference/base_test.py::RunInferenceBaseTest::test_run_inference_with_side_inputin_streaming 
[gw0] SKIPPED apache_beam/ml/inference/base_test.py::RunInferenceBaseTest::test_run_inference_with_side_inputin_streaming 
[gw5] PASSED apache_beam/io/gcp/bigquery_write_it_test.py::BigQueryWriteIntegrationTests::test_big_query_write_without_schema 
[gw6] PASSED apache_beam/io/gcp/bigquery_test.py::BigQueryStreamingInsertTransformIntegrationTests::test_multiple_destinations_transform 
apache_beam/io/gcp/bigquery_test.py::BigQueryStreamingInsertTransformIntegrationTests::test_value_provider_transform 
[gw4] PASSED apache_beam/ml/inference/sklearn_inference_it_test.py::SklearnInference::test_sklearn_mnist_classification_large_model 
apache_beam/ml/inference/sklearn_inference_it_test.py::SklearnInference::test_sklearn_regression 
[gw4] SKIPPED apache_beam/ml/inference/sklearn_inference_it_test.py::SklearnInference::test_sklearn_regression 
[gw2] PASSED apache_beam/io/gcp/bigquery_read_it_test.py::ReadUsingStorageApiTests::test_iobase_source 
apache_beam/io/gcp/bigquery_read_it_test.py::ReadUsingStorageApiTests::test_iobase_source_with_column_selection 
[gw6] PASSED apache_beam/io/gcp/bigquery_test.py::BigQueryStreamingInsertTransformIntegrationTests::test_value_provider_transform 
apache_beam/io/gcp/bigquery_test.py::PubSubBigQueryIT::test_file_loads 
[gw2] PASSED apache_beam/io/gcp/bigquery_read_it_test.py::ReadUsingStorageApiTests::test_iobase_source_with_column_selection 
apache_beam/io/gcp/bigquery_read_it_test.py::ReadUsingStorageApiTests::test_iobase_source_with_column_selection_and_row_restriction 
[gw1] PASSED apache_beam/io/gcp/pubsub_integration_test.py::PubSubIntegrationTest::test_streaming_with_attributes 
apache_beam/ml/gcp/visionml_test_it.py::VisionMlTestIT::test_text_detection_with_language_hint 
[gw3] PASSED apache_beam/io/gcp/datastore/v1new/datastore_write_it_test.py::DatastoreWriteIT::test_datastore_write_limit 
apache_beam/ml/gcp/recommendations_ai_test_it.py::RecommendationAIIT::test_create_catalog_item 
[gw2] PASSED apache_beam/io/gcp/bigquery_read_it_test.py::ReadUsingStorageApiTests::test_iobase_source_with_column_selection_and_row_restriction 
apache_beam/io/gcp/bigquery_read_it_test.py::ReadUsingStorageApiTests::test_iobase_source_with_column_selection_and_row_restriction_rows 
[gw1] PASSED apache_beam/ml/gcp/visionml_test_it.py::VisionMlTestIT::test_text_detection_with_language_hint 
[gw3] PASSED apache_beam/ml/gcp/recommendations_ai_test_it.py::RecommendationAIIT::test_create_catalog_item 
apache_beam/ml/gcp/recommendations_ai_test_it.py::RecommendationAIIT::test_create_user_event 
[gw2] PASSED apache_beam/io/gcp/bigquery_read_it_test.py::ReadUsingStorageApiTests::test_iobase_source_with_column_selection_and_row_restriction_rows 
apache_beam/io/gcp/bigquery_read_it_test.py::ReadUsingStorageApiTests::test_iobase_source_with_native_datetime 
[gw3] PASSED apache_beam/ml/gcp/recommendations_ai_test_it.py::RecommendationAIIT::test_create_user_event 
apache_beam/ml/gcp/recommendations_ai_test_it.py::RecommendationAIIT::test_predict 
[gw6] PASSED apache_beam/io/gcp/bigquery_test.py::PubSubBigQueryIT::test_file_loads 
apache_beam/io/gcp/bigquery_test.py::PubSubBigQueryIT::test_streaming_inserts 
[gw2] PASSED apache_beam/io/gcp/bigquery_read_it_test.py::ReadUsingStorageApiTests::test_iobase_source_with_native_datetime 
apache_beam/io/gcp/bigquery_read_it_test.py::ReadUsingStorageApiTests::test_iobase_source_with_query 
[gw3] PASSED apache_beam/ml/gcp/recommendations_ai_test_it.py::RecommendationAIIT::test_predict 
[gw2] PASSED apache_beam/io/gcp/bigquery_read_it_test.py::ReadUsingStorageApiTests::test_iobase_source_with_query 
apache_beam/io/gcp/bigquery_read_it_test.py::ReadUsingStorageApiTests::test_iobase_source_with_query_and_filters 
[gw2] PASSED apache_beam/io/gcp/bigquery_read_it_test.py::ReadUsingStorageApiTests::test_iobase_source_with_query_and_filters 
apache_beam/io/gcp/bigquery_read_it_test.py::ReadUsingStorageApiTests::test_iobase_source_with_row_restriction 
[gw6] PASSED apache_beam/io/gcp/bigquery_test.py::PubSubBigQueryIT::test_streaming_inserts 
apache_beam/io/gcp/bigquery_test.py::BigQueryFileLoadsIntegrationTests::test_avro_file_load 
[gw2] PASSED apache_beam/io/gcp/bigquery_read_it_test.py::ReadUsingStorageApiTests::test_iobase_source_with_row_restriction 
apache_beam/io/gcp/bigquery_read_it_test.py::ReadUsingStorageApiTests::test_iobase_source_with_very_selective_filters 
[gw6] PASSED apache_beam/io/gcp/bigquery_test.py::BigQueryFileLoadsIntegrationTests::test_avro_file_load 
[gw2] PASSED apache_beam/io/gcp/bigquery_read_it_test.py::ReadUsingStorageApiTests::test_iobase_source_with_very_selective_filters 
apache_beam/io/gcp/bigquery_read_it_test.py::ReadNewTypesTests::test_iobase_source 
[gw2] PASSED apache_beam/io/gcp/bigquery_read_it_test.py::ReadNewTypesTests::test_iobase_source 
apache_beam/io/gcp/bigquery_read_it_test.py::ReadNewTypesTests::test_native_source 
[gw2] PASSED apache_beam/io/gcp/bigquery_read_it_test.py::ReadNewTypesTests::test_native_source 
apache_beam/io/gcp/bigquery_read_it_test.py::ReadAllBQTests::test_read_queries 
[gw2] PASSED apache_beam/io/gcp/bigquery_read_it_test.py::ReadAllBQTests::test_read_queries 
apache_beam/io/gcp/bigquery_read_it_test.py::ReadInteractiveRunnerTests::test_read_in_interactive_runner 
[gw2] PASSED apache_beam/io/gcp/bigquery_read_it_test.py::ReadInteractiveRunnerTests::test_read_in_interactive_runner 

=============================== warnings summary ===============================
apache_beam/examples/complete/game/hourly_team_score_it_test.py::HourlyTeamScoreIT::test_hourly_team_score_it
apache_beam/examples/complete/game/game_stats_it_test.py::GameStatsIT::test_game_stats_it
apache_beam/examples/complete/game/leader_board_it_test.py::LeaderBoardIT::test_leader_board_it
apache_beam/io/gcp/bigquery_test.py::PubSubBigQueryIT::test_file_loads
apache_beam/io/gcp/bigquery_test.py::PubSubBigQueryIT::test_streaming_inserts
  <https://ci-beam.apache.org/job/beam_PostCommit_Python311/ws/src/sdks/python/apache_beam/io/gcp/tests/utils.py>:63: PendingDeprecationWarning: Client.dataset is deprecated and will be removed in a future version. Use a string like 'my_project.my_dataset' or a cloud.google.bigquery.DatasetReference object, instead.
    dataset_ref = client.dataset(unique_dataset_name, project=project)

apache_beam/examples/cookbook/bigquery_tornadoes_it_test.py::BigqueryTornadoesIT::test_bigquery_tornadoes_it
  <https://ci-beam.apache.org/job/beam_PostCommit_Python311/ws/src/sdks/python/apache_beam/io/gcp/tests/utils.py>:100: PendingDeprecationWarning: Client.dataset is deprecated and will be removed in a future version. Use a string like 'my_project.my_dataset' or a cloud.google.bigquery.DatasetReference object, instead.
    table_ref = client.dataset(dataset_id).table(table_id)

apache_beam/examples/dataframe/flight_delays_it_test.py::FlightDelaysTest::test_flight_delays
  <https://ci-beam.apache.org/job/beam_PostCommit_Python311/ws/src/sdks/python/apache_beam/examples/dataframe/flight_delays.py>:47: FutureWarning: The default value of numeric_only in DataFrame.mean is deprecated. In a future version, it will default to False. In addition, specifying 'numeric_only=None' is deprecated. Select only valid columns or specify the value of numeric_only to silence this warning.
    return airline_df[at_top_airports].mean()

apache_beam/io/gcp/bigquery_read_it_test.py::ReadTests::test_native_source
  <https://ci-beam.apache.org/job/beam_PostCommit_Python311/ws/src/sdks/python/apache_beam/io/gcp/bigquery_read_it_test.py>:170: BeamDeprecationWarning: BigQuerySource is deprecated since 2.25.0. Use ReadFromBigQuery instead.
    beam.io.BigQuerySource(query=self.query, use_standard_sql=True)))

apache_beam/io/gcp/bigquery_read_it_test.py::ReadNewTypesTests::test_native_source
  <https://ci-beam.apache.org/job/beam_PostCommit_Python311/ws/src/sdks/python/apache_beam/io/gcp/bigquery_read_it_test.py>:706: BeamDeprecationWarning: BigQuerySource is deprecated since 2.25.0. Use ReadFromBigQuery instead.
    beam.io.BigQuerySource(query=self.query, use_standard_sql=True)))

-- Docs: https://docs.pytest.org/en/stable/how-to/capture-warnings.html
- generated xml file: <https://ci-beam.apache.org/job/beam_PostCommit_Python311/ws/src/sdks/python/pytest_postCommitIT-df-py311.xml> -
=========== 86 passed, 51 skipped, 9 warnings in 7162.92s (1:59:22) ============

FAILURE: Build failed with an exception.

* What went wrong:
Execution failed for task ':runners:flink:1.16:job-server:shadowJar'.
> Failed to store cache entry 785786882b305c902cee26c59d249abb for task ':runners:flink:1.16:job-server:shadowJar': Timeout waiting to lock Build cache (/home/jenkins/.gradle/caches/build-cache-1). It is currently in use by another Gradle instance.
  Owner PID: 612237
  Our PID: 637219
  Owner Operation: 
  Our operation: 
  Lock file: /home/jenkins/.gradle/caches/build-cache-1/build-cache-1.lock

* Try:
> Run with --stacktrace option to get the stack trace.
> Run with --info or --debug option to get more log output.
> Get more help at https://help.gradle.org.

Deprecated Gradle features were used in this build, making it incompatible with Gradle 9.0.

You can use '--warning-mode all' to show the individual deprecation warnings and determine if they come from your own scripts or plugins.

For more on this, please refer to https://docs.gradle.org/8.4/userguide/command_line_interface.html#sec:command_line_warnings in the Gradle documentation.

BUILD FAILED in 2h 16m 41s
213 actionable tasks: 155 executed, 54 from cache, 4 up-to-date

Publishing build scan...
https://ge.apache.org/s/4xnandfb2edlc

Build step 'Invoke Gradle script' changed build result to FAILURE
Build step 'Invoke Gradle script' marked build as failure

---------------------------------------------------------------------
To unsubscribe, e-mail: builds-unsubscribe@beam.apache.org
For additional commands, e-mail: builds-help@beam.apache.org


Build failed in Jenkins: beam_PostCommit_Python311 #877

Posted by Apache Jenkins Server <je...@builds.apache.org>.
See <https://ci-beam.apache.org/job/beam_PostCommit_Python311/877/display/redirect?page=changes>

Changes:

[noreply] Add getters to CheckResult in IT framework (#29411)


------------------------------------------
Started by timer
Running as SYSTEM
[EnvInject] - Loading node environment variables.
Building remotely on apache-beam-jenkins-10 (beam) in workspace <https://ci-beam.apache.org/job/beam_PostCommit_Python311/ws/>
The recommended git tool is: NONE
No credentials specified
Wiping out workspace first.
Cloning the remote Git repository
Using shallow clone with depth 1
Avoid fetching tags
Cloning repository https://github.com/apache/beam.git
 > git init <https://ci-beam.apache.org/job/beam_PostCommit_Python311/ws/src> # timeout=10
Fetching upstream changes from https://github.com/apache/beam.git
 > git --version # timeout=10
 > git --version # 'git version 2.25.1'
 > git fetch --no-tags --force --progress --depth=1 -- https://github.com/apache/beam.git +refs/heads/*:refs/remotes/origin/* # timeout=10
 > git config remote.origin.url https://github.com/apache/beam.git # timeout=10
 > git config --add remote.origin.fetch +refs/heads/*:refs/remotes/origin/* # timeout=10
 > git config remote.origin.url https://github.com/apache/beam.git # timeout=10
Using shallow fetch with depth 1
Fetching upstream changes from https://github.com/apache/beam.git
 > git fetch --no-tags --force --progress --depth=1 -- https://github.com/apache/beam.git +refs/heads/*:refs/remotes/origin/* +refs/pull/${ghprbPullId}/*:refs/remotes/origin/pr/${ghprbPullId}/* # timeout=10
 > git rev-parse origin/master^{commit} # timeout=10
Checking out Revision 8fa5b19f5468c716e16c688994b538cc2abd3811 (origin/master)
 > git config core.sparsecheckout # timeout=10
 > git checkout -f 8fa5b19f5468c716e16c688994b538cc2abd3811 # timeout=10
Commit message: "Add getters to CheckResult in IT framework (#29411)"
 > git rev-list --no-walk 2ad459113134dfffd3caeeb15e821bb644e08663 # timeout=10
No emails were triggered.
[EnvInject] - Executing scripts and injecting environment variables after the SCM step.
[EnvInject] - Injecting as environment variables the properties content 
SETUPTOOLS_USE_DISTUTILS=stdlib
SPARK_LOCAL_IP=127.0.0.1

[EnvInject] - Variables injected successfully.
[Gradle] - Launching build.
[src] $ <https://ci-beam.apache.org/job/beam_PostCommit_Python311/ws/src/gradlew> --continue --max-workers=8 -Dorg.gradle.jvmargs=-Xms2g -Dorg.gradle.jvmargs=-Xmx6g -Dorg.gradle.vfs.watch=false -Pdocker-pull-licenses -PuseWheelDistribution :python311PostCommit
To honour the JVM settings for this build a single-use Daemon process will be forked. For more on this, please refer to https://docs.gradle.org/8.4/userguide/gradle_daemon.html#sec:disabling_the_daemon in the Gradle documentation.
Daemon will be stopped at the end of the build 
Configuration on demand is an incubating feature.
Gradle Enterprise plugins resolution: https://plugins.gradle.org/m2
Enforcing Gradle Enterprise: https://ge.apache.org, allowUntrustedServer: false
> Task :buildSrc:compileJava NO-SOURCE
> Task :buildSrc:compileGroovy FROM-CACHE
> Task :buildSrc:pluginDescriptors
> Task :buildSrc:processResources
> Task :buildSrc:classes
> Task :buildSrc:jar

> Configure project :sdks:java:container:java8
docker-pull-licenses set, creating go-licenses

> Configure project :sdks:java:container:java11
docker-pull-licenses set, creating go-licenses
System Go installation: /snap/bin/go is go version go1.16.15 linux/amd64; Preparing to use /home/jenkins/go/bin/go1.21.4
/home/jenkins/go/pkg/mod/golang.org/dl@v0.0.0-20231107201224-8165dcd93058/go1.21.4/main.go:20:8: //go:build comment without // +build comment

FAILURE: Build failed with an exception.

* What went wrong:
Could not determine the dependencies of task ':sdks:python:container:goBuild'.
> Could not create task ':sdks:python:container:goPrepare'.
   > Process 'command 'sh'' finished with non-zero exit value 1

* Try:
> Run with --stacktrace option to get the stack trace.
> Run with --info or --debug option to get more log output.
> Get more help at https://help.gradle.org.

Deprecated Gradle features were used in this build, making it incompatible with Gradle 9.0.

You can use '--warning-mode all' to show the individual deprecation warnings and determine if they come from your own scripts or plugins.

For more on this, please refer to https://docs.gradle.org/8.4/userguide/command_line_interface.html#sec:command_line_warnings in the Gradle documentation.

BUILD FAILED in 20s
4 actionable tasks: 3 executed, 1 from cache

Publishing build scan...
https://ge.apache.org/s/rzc5fnb4hvkpm

Build step 'Invoke Gradle script' changed build result to FAILURE
Build step 'Invoke Gradle script' marked build as failure

---------------------------------------------------------------------
To unsubscribe, e-mail: builds-unsubscribe@beam.apache.org
For additional commands, e-mail: builds-help@beam.apache.org


Build failed in Jenkins: beam_PostCommit_Python311 #876

Posted by Apache Jenkins Server <je...@builds.apache.org>.
See <https://ci-beam.apache.org/job/beam_PostCommit_Python311/876/display/redirect>

Changes:


------------------------------------------
Started by timer
Running as SYSTEM
[EnvInject] - Loading node environment variables.
Building remotely on apache-beam-jenkins-10 (beam) in workspace <https://ci-beam.apache.org/job/beam_PostCommit_Python311/ws/>
The recommended git tool is: NONE
No credentials specified
Wiping out workspace first.
Cloning the remote Git repository
Using shallow clone with depth 1
Avoid fetching tags
Cloning repository https://github.com/apache/beam.git
 > git init <https://ci-beam.apache.org/job/beam_PostCommit_Python311/ws/src> # timeout=10
Fetching upstream changes from https://github.com/apache/beam.git
 > git --version # timeout=10
 > git --version # 'git version 2.25.1'
 > git fetch --no-tags --force --progress --depth=1 -- https://github.com/apache/beam.git +refs/heads/*:refs/remotes/origin/* # timeout=10
 > git config remote.origin.url https://github.com/apache/beam.git # timeout=10
 > git config --add remote.origin.fetch +refs/heads/*:refs/remotes/origin/* # timeout=10
 > git config remote.origin.url https://github.com/apache/beam.git # timeout=10
Using shallow fetch with depth 1
Fetching upstream changes from https://github.com/apache/beam.git
 > git fetch --no-tags --force --progress --depth=1 -- https://github.com/apache/beam.git +refs/heads/*:refs/remotes/origin/* +refs/pull/${ghprbPullId}/*:refs/remotes/origin/pr/${ghprbPullId}/* # timeout=10
 > git rev-parse origin/master^{commit} # timeout=10
Checking out Revision 2ad459113134dfffd3caeeb15e821bb644e08663 (origin/master)
 > git config core.sparsecheckout # timeout=10
 > git checkout -f 2ad459113134dfffd3caeeb15e821bb644e08663 # timeout=10
Commit message: "[YAML] - Kafka Read and Write proto (#29368)"
 > git rev-list --no-walk 2ad459113134dfffd3caeeb15e821bb644e08663 # timeout=10
No emails were triggered.
[EnvInject] - Executing scripts and injecting environment variables after the SCM step.
[EnvInject] - Injecting as environment variables the properties content 
SETUPTOOLS_USE_DISTUTILS=stdlib
SPARK_LOCAL_IP=127.0.0.1

[EnvInject] - Variables injected successfully.
[Gradle] - Launching build.
[src] $ <https://ci-beam.apache.org/job/beam_PostCommit_Python311/ws/src/gradlew> --continue --max-workers=8 -Dorg.gradle.jvmargs=-Xms2g -Dorg.gradle.jvmargs=-Xmx6g -Dorg.gradle.vfs.watch=false -Pdocker-pull-licenses -PuseWheelDistribution :python311PostCommit
To honour the JVM settings for this build a single-use Daemon process will be forked. For more on this, please refer to https://docs.gradle.org/8.4/userguide/gradle_daemon.html#sec:disabling_the_daemon in the Gradle documentation.
Daemon will be stopped at the end of the build 
Configuration on demand is an incubating feature.
Gradle Enterprise plugins resolution: https://plugins.gradle.org/m2
Enforcing Gradle Enterprise: https://ge.apache.org, allowUntrustedServer: false
> Task :buildSrc:compileJava NO-SOURCE
> Task :buildSrc:compileGroovy FROM-CACHE
> Task :buildSrc:pluginDescriptors
> Task :buildSrc:processResources
> Task :buildSrc:classes
> Task :buildSrc:jar

> Configure project :sdks:java:container:java8
docker-pull-licenses set, creating go-licenses

> Configure project :sdks:java:container:java11
docker-pull-licenses set, creating go-licenses
System Go installation: /snap/bin/go is go version go1.16.15 linux/amd64; Preparing to use /home/jenkins/go/bin/go1.21.4
/home/jenkins/go/pkg/mod/golang.org/dl@v0.0.0-20231107201224-8165dcd93058/go1.21.4/main.go:20:8: //go:build comment without // +build comment

FAILURE: Build failed with an exception.

* What went wrong:
Could not determine the dependencies of task ':sdks:python:container:goBuild'.
> Could not create task ':sdks:python:container:goPrepare'.
   > Process 'command 'sh'' finished with non-zero exit value 1

* Try:
> Run with --stacktrace option to get the stack trace.
> Run with --info or --debug option to get more log output.
> Get more help at https://help.gradle.org.

Deprecated Gradle features were used in this build, making it incompatible with Gradle 9.0.

You can use '--warning-mode all' to show the individual deprecation warnings and determine if they come from your own scripts or plugins.

For more on this, please refer to https://docs.gradle.org/8.4/userguide/command_line_interface.html#sec:command_line_warnings in the Gradle documentation.

BUILD FAILED in 25s
4 actionable tasks: 3 executed, 1 from cache

Publishing build scan...
https://ge.apache.org/s/sjcnwdbdaiwg4

Build step 'Invoke Gradle script' changed build result to FAILURE
Build step 'Invoke Gradle script' marked build as failure

---------------------------------------------------------------------
To unsubscribe, e-mail: builds-unsubscribe@beam.apache.org
For additional commands, e-mail: builds-help@beam.apache.org


Build failed in Jenkins: beam_PostCommit_Python311 #875

Posted by Apache Jenkins Server <je...@builds.apache.org>.
See <https://ci-beam.apache.org/job/beam_PostCommit_Python311/875/display/redirect>

Changes:


------------------------------------------
Started by timer
Running as SYSTEM
[EnvInject] - Loading node environment variables.
Building remotely on apache-beam-jenkins-10 (beam) in workspace <https://ci-beam.apache.org/job/beam_PostCommit_Python311/ws/>
The recommended git tool is: NONE
No credentials specified
Wiping out workspace first.
Cloning the remote Git repository
Using shallow clone with depth 1
Avoid fetching tags
Cloning repository https://github.com/apache/beam.git
 > git init <https://ci-beam.apache.org/job/beam_PostCommit_Python311/ws/src> # timeout=10
Fetching upstream changes from https://github.com/apache/beam.git
 > git --version # timeout=10
 > git --version # 'git version 2.25.1'
 > git fetch --no-tags --force --progress --depth=1 -- https://github.com/apache/beam.git +refs/heads/*:refs/remotes/origin/* # timeout=10
 > git config remote.origin.url https://github.com/apache/beam.git # timeout=10
 > git config --add remote.origin.fetch +refs/heads/*:refs/remotes/origin/* # timeout=10
 > git config remote.origin.url https://github.com/apache/beam.git # timeout=10
Using shallow fetch with depth 1
Fetching upstream changes from https://github.com/apache/beam.git
 > git fetch --no-tags --force --progress --depth=1 -- https://github.com/apache/beam.git +refs/heads/*:refs/remotes/origin/* +refs/pull/${ghprbPullId}/*:refs/remotes/origin/pr/${ghprbPullId}/* # timeout=10
 > git rev-parse origin/master^{commit} # timeout=10
Checking out Revision 2ad459113134dfffd3caeeb15e821bb644e08663 (origin/master)
 > git config core.sparsecheckout # timeout=10
 > git checkout -f 2ad459113134dfffd3caeeb15e821bb644e08663 # timeout=10
Commit message: "[YAML] - Kafka Read and Write proto (#29368)"
 > git rev-list --no-walk 2ad459113134dfffd3caeeb15e821bb644e08663 # timeout=10
No emails were triggered.
[EnvInject] - Executing scripts and injecting environment variables after the SCM step.
[EnvInject] - Injecting as environment variables the properties content 
SETUPTOOLS_USE_DISTUTILS=stdlib
SPARK_LOCAL_IP=127.0.0.1

[EnvInject] - Variables injected successfully.
[Gradle] - Launching build.
[src] $ <https://ci-beam.apache.org/job/beam_PostCommit_Python311/ws/src/gradlew> --continue --max-workers=8 -Dorg.gradle.jvmargs=-Xms2g -Dorg.gradle.jvmargs=-Xmx6g -Dorg.gradle.vfs.watch=false -Pdocker-pull-licenses -PuseWheelDistribution :python311PostCommit
To honour the JVM settings for this build a single-use Daemon process will be forked. For more on this, please refer to https://docs.gradle.org/8.4/userguide/gradle_daemon.html#sec:disabling_the_daemon in the Gradle documentation.
Daemon will be stopped at the end of the build 
Configuration on demand is an incubating feature.
Gradle Enterprise plugins resolution: https://plugins.gradle.org/m2
Enforcing Gradle Enterprise: https://ge.apache.org, allowUntrustedServer: false
> Task :buildSrc:compileJava NO-SOURCE
> Task :buildSrc:compileGroovy FROM-CACHE
> Task :buildSrc:pluginDescriptors
> Task :buildSrc:processResources
> Task :buildSrc:classes
> Task :buildSrc:jar

> Configure project :sdks:java:container:java8
docker-pull-licenses set, creating go-licenses

> Configure project :sdks:java:container:java11
docker-pull-licenses set, creating go-licenses
System Go installation: /snap/bin/go is go version go1.16.15 linux/amd64; Preparing to use /home/jenkins/go/bin/go1.21.4
/home/jenkins/go/pkg/mod/golang.org/dl@v0.0.0-20231107201224-8165dcd93058/go1.21.4/main.go:20:8: //go:build comment without // +build comment

FAILURE: Build failed with an exception.

* What went wrong:
Could not determine the dependencies of task ':sdks:python:container:goBuild'.
> Could not create task ':sdks:python:container:goPrepare'.
   > Process 'command 'sh'' finished with non-zero exit value 1

* Try:
> Run with --stacktrace option to get the stack trace.
> Run with --info or --debug option to get more log output.
> Get more help at https://help.gradle.org.

Deprecated Gradle features were used in this build, making it incompatible with Gradle 9.0.

You can use '--warning-mode all' to show the individual deprecation warnings and determine if they come from your own scripts or plugins.

For more on this, please refer to https://docs.gradle.org/8.4/userguide/command_line_interface.html#sec:command_line_warnings in the Gradle documentation.

BUILD FAILED in 23s
4 actionable tasks: 3 executed, 1 from cache

Publishing build scan...
https://ge.apache.org/s/73rqg6354fsg4

Build step 'Invoke Gradle script' changed build result to FAILURE
Build step 'Invoke Gradle script' marked build as failure

---------------------------------------------------------------------
To unsubscribe, e-mail: builds-unsubscribe@beam.apache.org
For additional commands, e-mail: builds-help@beam.apache.org


Build failed in Jenkins: beam_PostCommit_Python311 #874

Posted by Apache Jenkins Server <je...@builds.apache.org>.
See <https://ci-beam.apache.org/job/beam_PostCommit_Python311/874/display/redirect>

Changes:


------------------------------------------
Started by timer
Running as SYSTEM
[EnvInject] - Loading node environment variables.
Building remotely on apache-beam-jenkins-10 (beam) in workspace <https://ci-beam.apache.org/job/beam_PostCommit_Python311/ws/>
The recommended git tool is: NONE
No credentials specified
Wiping out workspace first.
Cloning the remote Git repository
Using shallow clone with depth 1
Avoid fetching tags
Cloning repository https://github.com/apache/beam.git
 > git init <https://ci-beam.apache.org/job/beam_PostCommit_Python311/ws/src> # timeout=10
Fetching upstream changes from https://github.com/apache/beam.git
 > git --version # timeout=10
 > git --version # 'git version 2.25.1'
 > git fetch --no-tags --force --progress --depth=1 -- https://github.com/apache/beam.git +refs/heads/*:refs/remotes/origin/* # timeout=10
 > git config remote.origin.url https://github.com/apache/beam.git # timeout=10
 > git config --add remote.origin.fetch +refs/heads/*:refs/remotes/origin/* # timeout=10
 > git config remote.origin.url https://github.com/apache/beam.git # timeout=10
Using shallow fetch with depth 1
Fetching upstream changes from https://github.com/apache/beam.git
 > git fetch --no-tags --force --progress --depth=1 -- https://github.com/apache/beam.git +refs/heads/*:refs/remotes/origin/* +refs/pull/${ghprbPullId}/*:refs/remotes/origin/pr/${ghprbPullId}/* # timeout=10
 > git rev-parse origin/master^{commit} # timeout=10
Checking out Revision 2ad459113134dfffd3caeeb15e821bb644e08663 (origin/master)
 > git config core.sparsecheckout # timeout=10
 > git checkout -f 2ad459113134dfffd3caeeb15e821bb644e08663 # timeout=10
Commit message: "[YAML] - Kafka Read and Write proto (#29368)"
 > git rev-list --no-walk 2ad459113134dfffd3caeeb15e821bb644e08663 # timeout=10
No emails were triggered.
[EnvInject] - Executing scripts and injecting environment variables after the SCM step.
[EnvInject] - Injecting as environment variables the properties content 
SETUPTOOLS_USE_DISTUTILS=stdlib
SPARK_LOCAL_IP=127.0.0.1

[EnvInject] - Variables injected successfully.
[Gradle] - Launching build.
[src] $ <https://ci-beam.apache.org/job/beam_PostCommit_Python311/ws/src/gradlew> --continue --max-workers=8 -Dorg.gradle.jvmargs=-Xms2g -Dorg.gradle.jvmargs=-Xmx6g -Dorg.gradle.vfs.watch=false -Pdocker-pull-licenses -PuseWheelDistribution :python311PostCommit
To honour the JVM settings for this build a single-use Daemon process will be forked. For more on this, please refer to https://docs.gradle.org/8.4/userguide/gradle_daemon.html#sec:disabling_the_daemon in the Gradle documentation.
Daemon will be stopped at the end of the build 
Configuration on demand is an incubating feature.
Gradle Enterprise plugins resolution: https://plugins.gradle.org/m2
Enforcing Gradle Enterprise: https://ge.apache.org, allowUntrustedServer: false
> Task :buildSrc:compileJava NO-SOURCE
> Task :buildSrc:compileGroovy FROM-CACHE
> Task :buildSrc:pluginDescriptors
> Task :buildSrc:processResources
> Task :buildSrc:classes
> Task :buildSrc:jar

> Configure project :sdks:java:container:java8
docker-pull-licenses set, creating go-licenses

> Configure project :sdks:java:container:java11
docker-pull-licenses set, creating go-licenses
System Go installation: /snap/bin/go is go version go1.16.15 linux/amd64; Preparing to use /home/jenkins/go/bin/go1.21.4
/home/jenkins/go/pkg/mod/golang.org/dl@v0.0.0-20231107201224-8165dcd93058/go1.21.4/main.go:20:8: //go:build comment without // +build comment

FAILURE: Build failed with an exception.

* What went wrong:
Could not determine the dependencies of task ':sdks:python:container:goBuild'.
> Could not create task ':sdks:python:container:goPrepare'.
   > Process 'command 'sh'' finished with non-zero exit value 1

* Try:
> Run with --stacktrace option to get the stack trace.
> Run with --info or --debug option to get more log output.
> Get more help at https://help.gradle.org.

Deprecated Gradle features were used in this build, making it incompatible with Gradle 9.0.

You can use '--warning-mode all' to show the individual deprecation warnings and determine if they come from your own scripts or plugins.

For more on this, please refer to https://docs.gradle.org/8.4/userguide/command_line_interface.html#sec:command_line_warnings in the Gradle documentation.

BUILD FAILED in 20s
4 actionable tasks: 3 executed, 1 from cache

Publishing build scan...
https://ge.apache.org/s/qw2crzaqzyb7c

Build step 'Invoke Gradle script' changed build result to FAILURE
Build step 'Invoke Gradle script' marked build as failure

---------------------------------------------------------------------
To unsubscribe, e-mail: builds-unsubscribe@beam.apache.org
For additional commands, e-mail: builds-help@beam.apache.org


Build failed in Jenkins: beam_PostCommit_Python311 #873

Posted by Apache Jenkins Server <je...@builds.apache.org>.
See <https://ci-beam.apache.org/job/beam_PostCommit_Python311/873/display/redirect>

Changes:


------------------------------------------
Started by timer
Running as SYSTEM
[EnvInject] - Loading node environment variables.
Building remotely on apache-beam-jenkins-10 (beam) in workspace <https://ci-beam.apache.org/job/beam_PostCommit_Python311/ws/>
The recommended git tool is: NONE
No credentials specified
Wiping out workspace first.
Cloning the remote Git repository
Using shallow clone with depth 1
Avoid fetching tags
Cloning repository https://github.com/apache/beam.git
 > git init <https://ci-beam.apache.org/job/beam_PostCommit_Python311/ws/src> # timeout=10
Fetching upstream changes from https://github.com/apache/beam.git
 > git --version # timeout=10
 > git --version # 'git version 2.25.1'
 > git fetch --no-tags --force --progress --depth=1 -- https://github.com/apache/beam.git +refs/heads/*:refs/remotes/origin/* # timeout=10
 > git config remote.origin.url https://github.com/apache/beam.git # timeout=10
 > git config --add remote.origin.fetch +refs/heads/*:refs/remotes/origin/* # timeout=10
 > git config remote.origin.url https://github.com/apache/beam.git # timeout=10
Using shallow fetch with depth 1
Fetching upstream changes from https://github.com/apache/beam.git
 > git fetch --no-tags --force --progress --depth=1 -- https://github.com/apache/beam.git +refs/heads/*:refs/remotes/origin/* +refs/pull/${ghprbPullId}/*:refs/remotes/origin/pr/${ghprbPullId}/* # timeout=10
 > git rev-parse origin/master^{commit} # timeout=10
Checking out Revision 2ad459113134dfffd3caeeb15e821bb644e08663 (origin/master)
 > git config core.sparsecheckout # timeout=10
 > git checkout -f 2ad459113134dfffd3caeeb15e821bb644e08663 # timeout=10
Commit message: "[YAML] - Kafka Read and Write proto (#29368)"
 > git rev-list --no-walk 2ad459113134dfffd3caeeb15e821bb644e08663 # timeout=10
No emails were triggered.
[EnvInject] - Executing scripts and injecting environment variables after the SCM step.
[EnvInject] - Injecting as environment variables the properties content 
SETUPTOOLS_USE_DISTUTILS=stdlib
SPARK_LOCAL_IP=127.0.0.1

[EnvInject] - Variables injected successfully.
[Gradle] - Launching build.
[src] $ <https://ci-beam.apache.org/job/beam_PostCommit_Python311/ws/src/gradlew> --continue --max-workers=8 -Dorg.gradle.jvmargs=-Xms2g -Dorg.gradle.jvmargs=-Xmx6g -Dorg.gradle.vfs.watch=false -Pdocker-pull-licenses -PuseWheelDistribution :python311PostCommit
To honour the JVM settings for this build a single-use Daemon process will be forked. For more on this, please refer to https://docs.gradle.org/8.4/userguide/gradle_daemon.html#sec:disabling_the_daemon in the Gradle documentation.
Daemon will be stopped at the end of the build 
Configuration on demand is an incubating feature.
Gradle Enterprise plugins resolution: https://plugins.gradle.org/m2
Enforcing Gradle Enterprise: https://ge.apache.org, allowUntrustedServer: false
> Task :buildSrc:compileJava NO-SOURCE
> Task :buildSrc:compileGroovy FROM-CACHE
> Task :buildSrc:pluginDescriptors
> Task :buildSrc:processResources
> Task :buildSrc:classes
> Task :buildSrc:jar

> Configure project :sdks:java:container:java8
docker-pull-licenses set, creating go-licenses

> Configure project :sdks:java:container:java11
docker-pull-licenses set, creating go-licenses
System Go installation: /snap/bin/go is go version go1.16.15 linux/amd64; Preparing to use /home/jenkins/go/bin/go1.21.4
/home/jenkins/go/pkg/mod/golang.org/dl@v0.0.0-20231107201224-8165dcd93058/go1.21.4/main.go:20:8: //go:build comment without // +build comment

FAILURE: Build failed with an exception.

* What went wrong:
Could not determine the dependencies of task ':sdks:python:container:goBuild'.
> Could not create task ':sdks:python:container:goPrepare'.
   > Process 'command 'sh'' finished with non-zero exit value 1

* Try:
> Run with --stacktrace option to get the stack trace.
> Run with --info or --debug option to get more log output.
> Get more help at https://help.gradle.org.

Deprecated Gradle features were used in this build, making it incompatible with Gradle 9.0.

You can use '--warning-mode all' to show the individual deprecation warnings and determine if they come from your own scripts or plugins.

For more on this, please refer to https://docs.gradle.org/8.4/userguide/command_line_interface.html#sec:command_line_warnings in the Gradle documentation.

BUILD FAILED in 20s
4 actionable tasks: 3 executed, 1 from cache

Publishing build scan...
https://ge.apache.org/s/5twa3pjsmej7s

Build step 'Invoke Gradle script' changed build result to FAILURE
Build step 'Invoke Gradle script' marked build as failure

---------------------------------------------------------------------
To unsubscribe, e-mail: builds-unsubscribe@beam.apache.org
For additional commands, e-mail: builds-help@beam.apache.org