You are viewing a plain text version of this content. The canonical link for it is here.
Posted to dev@lucene.apache.org by Apache Jenkins Server <je...@builds.apache.org> on 2019/04/16 22:03:30 UTC

[JENKINS] Lucene-Solr-BadApples-Tests-master - Build # 335 - Still Unstable

Build: https://builds.apache.org/job/Lucene-Solr-BadApples-Tests-master/335/

2 tests failed.
FAILED:  org.apache.solr.cloud.UnloadDistributedZkTest.test

Error Message:
Captured an uncaught exception in thread: Thread[id=5623, name=testExecutor-674-thread-6, state=RUNNABLE, group=TGRP-UnloadDistributedZkTest]

Stack Trace:
com.carrotsearch.randomizedtesting.UncaughtExceptionError: Captured an uncaught exception in thread: Thread[id=5623, name=testExecutor-674-thread-6, state=RUNNABLE, group=TGRP-UnloadDistributedZkTest]
Caused by: org.apache.solr.client.solrj.impl.HttpSolrClient$RemoteSolrException: Error from server at http://127.0.0.1:43657/xv_: ADDREPLICA failed to create replica
	at __randomizedtesting.SeedInfo.seed([C3BF86D591BE0B10]:0)
	at org.apache.solr.client.solrj.impl.HttpSolrClient.executeMethod(HttpSolrClient.java:649)
	at org.apache.solr.client.solrj.impl.HttpSolrClient.request(HttpSolrClient.java:255)
	at org.apache.solr.client.solrj.impl.HttpSolrClient.request(HttpSolrClient.java:244)
	at org.apache.solr.client.solrj.SolrRequest.process(SolrRequest.java:207)
	at org.apache.solr.client.solrj.SolrRequest.process(SolrRequest.java:224)
	at org.apache.solr.cloud.BasicDistributedZkTest.lambda$createCollectionInOneInstance$1(BasicDistributedZkTest.java:656)
	at org.apache.solr.common.util.ExecutorUtil$MDCAwareThreadPoolExecutor.lambda$execute$0(ExecutorUtil.java:209)
	at java.base/java.util.concurrent.ThreadPoolExecutor.runWorker(ThreadPoolExecutor.java:1128)
	at java.base/java.util.concurrent.ThreadPoolExecutor$Worker.run(ThreadPoolExecutor.java:628)
	at java.base/java.lang.Thread.run(Thread.java:834)


FAILED:  org.apache.solr.cloud.TestCloudRecovery2.test

Error Message:
Error from server at http://127.0.0.1:40516/solr: 100 Async exceptions during distributed update:  java.net.ConnectException: Connection refused java.net.ConnectException: Connection refused java.net.ConnectException: Connection refused java.net.ConnectException: Connection refused java.net.ConnectException: Connection refused java.net.ConnectException: Connection refused java.net.ConnectException: Connection refused java.net.ConnectException: Connection refused java.net.ConnectException: Connection refused java.net.ConnectException: Connection refused java.net.ConnectException: Connection refused java.net.ConnectException: Connection refused java.net.ConnectException: Connection refused java.net.ConnectException: Connection refused java.net.ConnectException: Connection refused java.net.ConnectException: Connection refused java.net.ConnectException: Connection refused java.net.ConnectException: Connection refused java.net.ConnectException: Connection refused java.net.ConnectException: Connection refused java.net.ConnectException: Connection refused java.net.ConnectException: Connection refused java.net.ConnectException: Connection refused java.net.ConnectException: Connection refused java.net.ConnectException: Connection refused java.net.ConnectException: Connection refused java.net.ConnectException: Connection refused java.net.ConnectException: Connection refused java.net.ConnectException: Connection refused java.net.ConnectException: Connection refused java.net.ConnectException: Connection refused java.net.ConnectException: Connection refused java.net.ConnectException: Connection refused java.net.ConnectException: Connection refused java.net.ConnectException: Connection refused java.net.ConnectException: Connection refused java.net.ConnectException: Connection refused java.net.ConnectException: Connection refused java.net.ConnectException: Connection refused java.net.ConnectException: Connection refused java.net.ConnectException: Connection refused java.net.ConnectException: Connection refused java.net.ConnectException: Connection refused java.net.ConnectException: Connection refused java.net.ConnectException: Connection refused java.net.ConnectException: Connection refused java.net.ConnectException: Connection refused java.net.ConnectException: Connection refused java.net.ConnectException: Connection refused java.net.ConnectException: Connection refused java.net.ConnectException: Connection refused java.net.ConnectException: Connection refused java.net.ConnectException: Connection refused java.net.ConnectException: Connection refused java.net.ConnectException: Connection refused java.net.ConnectException: Connection refused java.net.ConnectException: Connection refused java.net.ConnectException: Connection refused java.net.ConnectException: Connection refused java.net.ConnectException: Connection refused java.net.ConnectException: Connection refused java.net.ConnectException: Connection refused java.net.ConnectException: Connection refused java.net.ConnectException: Connection refused java.net.ConnectException: Connection refused java.net.ConnectException: Connection refused java.net.ConnectException: Connection refused java.net.ConnectException: Connection refused java.net.ConnectException: Connection refused java.net.ConnectException: Connection refused java.net.ConnectException: Connection refused java.net.ConnectException: Connection refused java.net.ConnectException: Connection refused java.net.ConnectException: Connection refused java.net.ConnectException: Connection refused java.net.ConnectException: Connection refused java.net.ConnectException: Connection refused java.net.ConnectException: Connection refused java.net.ConnectException: Connection refused java.net.ConnectException: Connection refused java.net.ConnectException: Connection refused java.net.ConnectException: Connection refused java.net.ConnectException: Connection refused java.net.ConnectException: Connection refused java.net.ConnectException: Connection refused java.net.ConnectException: Connection refused java.net.ConnectException: Connection refused java.net.ConnectException: Connection refused java.net.ConnectException: Connection refused java.net.ConnectException: Connection refused java.net.ConnectException: Connection refused java.net.ConnectException: Connection refused java.net.ConnectException: Connection refused java.net.ConnectException: Connection refused java.net.ConnectException: Connection refused java.net.ConnectException: Connection refused java.net.ConnectException: Connection refused java.net.ConnectException: Connection refused java.net.ConnectException: Connection refused java.net.ConnectException: Connection refused

Stack Trace:
org.apache.solr.client.solrj.impl.HttpSolrClient$RemoteSolrException: Error from server at http://127.0.0.1:40516/solr: 100 Async exceptions during distributed update: 
java.net.ConnectException: Connection refused
java.net.ConnectException: Connection refused
java.net.ConnectException: Connection refused
java.net.ConnectException: Connection refused
java.net.ConnectException: Connection refused
java.net.ConnectException: Connection refused
java.net.ConnectException: Connection refused
java.net.ConnectException: Connection refused
java.net.ConnectException: Connection refused
java.net.ConnectException: Connection refused
java.net.ConnectException: Connection refused
java.net.ConnectException: Connection refused
java.net.ConnectException: Connection refused
java.net.ConnectException: Connection refused
java.net.ConnectException: Connection refused
java.net.ConnectException: Connection refused
java.net.ConnectException: Connection refused
java.net.ConnectException: Connection refused
java.net.ConnectException: Connection refused
java.net.ConnectException: Connection refused
java.net.ConnectException: Connection refused
java.net.ConnectException: Connection refused
java.net.ConnectException: Connection refused
java.net.ConnectException: Connection refused
java.net.ConnectException: Connection refused
java.net.ConnectException: Connection refused
java.net.ConnectException: Connection refused
java.net.ConnectException: Connection refused
java.net.ConnectException: Connection refused
java.net.ConnectException: Connection refused
java.net.ConnectException: Connection refused
java.net.ConnectException: Connection refused
java.net.ConnectException: Connection refused
java.net.ConnectException: Connection refused
java.net.ConnectException: Connection refused
java.net.ConnectException: Connection refused
java.net.ConnectException: Connection refused
java.net.ConnectException: Connection refused
java.net.ConnectException: Connection refused
java.net.ConnectException: Connection refused
java.net.ConnectException: Connection refused
java.net.ConnectException: Connection refused
java.net.ConnectException: Connection refused
java.net.ConnectException: Connection refused
java.net.ConnectException: Connection refused
java.net.ConnectException: Connection refused
java.net.ConnectException: Connection refused
java.net.ConnectException: Connection refused
java.net.ConnectException: Connection refused
java.net.ConnectException: Connection refused
java.net.ConnectException: Connection refused
java.net.ConnectException: Connection refused
java.net.ConnectException: Connection refused
java.net.ConnectException: Connection refused
java.net.ConnectException: Connection refused
java.net.ConnectException: Connection refused
java.net.ConnectException: Connection refused
java.net.ConnectException: Connection refused
java.net.ConnectException: Connection refused
java.net.ConnectException: Connection refused
java.net.ConnectException: Connection refused
java.net.ConnectException: Connection refused
java.net.ConnectException: Connection refused
java.net.ConnectException: Connection refused
java.net.ConnectException: Connection refused
java.net.ConnectException: Connection refused
java.net.ConnectException: Connection refused
java.net.ConnectException: Connection refused
java.net.ConnectException: Connection refused
java.net.ConnectException: Connection refused
java.net.ConnectException: Connection refused
java.net.ConnectException: Connection refused
java.net.ConnectException: Connection refused
java.net.ConnectException: Connection refused
java.net.ConnectException: Connection refused
java.net.ConnectException: Connection refused
java.net.ConnectException: Connection refused
java.net.ConnectException: Connection refused
java.net.ConnectException: Connection refused
java.net.ConnectException: Connection refused
java.net.ConnectException: Connection refused
java.net.ConnectException: Connection refused
java.net.ConnectException: Connection refused
java.net.ConnectException: Connection refused
java.net.ConnectException: Connection refused
java.net.ConnectException: Connection refused
java.net.ConnectException: Connection refused
java.net.ConnectException: Connection refused
java.net.ConnectException: Connection refused
java.net.ConnectException: Connection refused
java.net.ConnectException: Connection refused
java.net.ConnectException: Connection refused
java.net.ConnectException: Connection refused
java.net.ConnectException: Connection refused
java.net.ConnectException: Connection refused
java.net.ConnectException: Connection refused
java.net.ConnectException: Connection refused
java.net.ConnectException: Connection refused
java.net.ConnectException: Connection refused
java.net.ConnectException: Connection refused
	at __randomizedtesting.SeedInfo.seed([C3BF86D591BE0B10:4BEBB90F3F4266E8]:0)
	at org.apache.solr.client.solrj.impl.HttpSolrClient.executeMethod(HttpSolrClient.java:649)
	at org.apache.solr.client.solrj.impl.HttpSolrClient.request(HttpSolrClient.java:255)
	at org.apache.solr.client.solrj.impl.HttpSolrClient.request(HttpSolrClient.java:244)
	at org.apache.solr.client.solrj.SolrRequest.process(SolrRequest.java:207)
	at org.apache.solr.client.solrj.request.UpdateRequest.commit(UpdateRequest.java:239)
	at org.apache.solr.cloud.TestCloudRecovery2.test(TestCloudRecovery2.java:67)
	at java.base/jdk.internal.reflect.NativeMethodAccessorImpl.invoke0(Native Method)
	at java.base/jdk.internal.reflect.NativeMethodAccessorImpl.invoke(NativeMethodAccessorImpl.java:62)
	at java.base/jdk.internal.reflect.DelegatingMethodAccessorImpl.invoke(DelegatingMethodAccessorImpl.java:43)
	at java.base/java.lang.reflect.Method.invoke(Method.java:566)
	at com.carrotsearch.randomizedtesting.RandomizedRunner.invoke(RandomizedRunner.java:1750)
	at com.carrotsearch.randomizedtesting.RandomizedRunner$8.evaluate(RandomizedRunner.java:938)
	at com.carrotsearch.randomizedtesting.RandomizedRunner$9.evaluate(RandomizedRunner.java:974)
	at com.carrotsearch.randomizedtesting.RandomizedRunner$10.evaluate(RandomizedRunner.java:988)
	at com.carrotsearch.randomizedtesting.rules.SystemPropertiesRestoreRule$1.evaluate(SystemPropertiesRestoreRule.java:57)
	at org.apache.lucene.util.TestRuleSetupTeardownChained$1.evaluate(TestRuleSetupTeardownChained.java:49)
	at org.apache.lucene.util.AbstractBeforeAfterRule$1.evaluate(AbstractBeforeAfterRule.java:45)
	at org.apache.lucene.util.TestRuleThreadAndTestName$1.evaluate(TestRuleThreadAndTestName.java:48)
	at org.apache.lucene.util.TestRuleIgnoreAfterMaxFailures$1.evaluate(TestRuleIgnoreAfterMaxFailures.java:64)
	at org.apache.lucene.util.TestRuleMarkFailure$1.evaluate(TestRuleMarkFailure.java:47)
	at com.carrotsearch.randomizedtesting.rules.StatementAdapter.evaluate(StatementAdapter.java:36)
	at com.carrotsearch.randomizedtesting.ThreadLeakControl$StatementRunner.run(ThreadLeakControl.java:368)
	at com.carrotsearch.randomizedtesting.ThreadLeakControl.forkTimeoutingTask(ThreadLeakControl.java:817)
	at com.carrotsearch.randomizedtesting.ThreadLeakControl$3.evaluate(ThreadLeakControl.java:468)
	at com.carrotsearch.randomizedtesting.RandomizedRunner.runSingleTest(RandomizedRunner.java:947)
	at com.carrotsearch.randomizedtesting.RandomizedRunner$5.evaluate(RandomizedRunner.java:832)
	at com.carrotsearch.randomizedtesting.RandomizedRunner$6.evaluate(RandomizedRunner.java:883)
	at com.carrotsearch.randomizedtesting.RandomizedRunner$7.evaluate(RandomizedRunner.java:894)
	at com.carrotsearch.randomizedtesting.rules.StatementAdapter.evaluate(StatementAdapter.java:36)
	at com.carrotsearch.randomizedtesting.rules.SystemPropertiesRestoreRule$1.evaluate(SystemPropertiesRestoreRule.java:57)
	at org.apache.lucene.util.AbstractBeforeAfterRule$1.evaluate(AbstractBeforeAfterRule.java:45)
	at com.carrotsearch.randomizedtesting.rules.StatementAdapter.evaluate(StatementAdapter.java:36)
	at org.apache.lucene.util.TestRuleStoreClassName$1.evaluate(TestRuleStoreClassName.java:41)
	at com.carrotsearch.randomizedtesting.rules.NoShadowingOrOverridesOnMethodsRule$1.evaluate(NoShadowingOrOverridesOnMethodsRule.java:40)
	at com.carrotsearch.randomizedtesting.rules.NoShadowingOrOverridesOnMethodsRule$1.evaluate(NoShadowingOrOverridesOnMethodsRule.java:40)
	at com.carrotsearch.randomizedtesting.rules.StatementAdapter.evaluate(StatementAdapter.java:36)
	at com.carrotsearch.randomizedtesting.rules.StatementAdapter.evaluate(StatementAdapter.java:36)
	at org.apache.lucene.util.TestRuleAssertionsRequired$1.evaluate(TestRuleAssertionsRequired.java:53)
	at org.apache.lucene.util.TestRuleMarkFailure$1.evaluate(TestRuleMarkFailure.java:47)
	at org.apache.lucene.util.TestRuleIgnoreAfterMaxFailures$1.evaluate(TestRuleIgnoreAfterMaxFailures.java:64)
	at org.apache.lucene.util.TestRuleIgnoreTestSuites$1.evaluate(TestRuleIgnoreTestSuites.java:54)
	at com.carrotsearch.randomizedtesting.rules.StatementAdapter.evaluate(StatementAdapter.java:36)
	at com.carrotsearch.randomizedtesting.ThreadLeakControl$StatementRunner.run(ThreadLeakControl.java:368)
	at java.base/java.lang.Thread.run(Thread.java:834)




Build Log:
[...truncated 12679 lines...]
   [junit4] Suite: org.apache.solr.cloud.UnloadDistributedZkTest
   [junit4]   2> 285120 INFO  (SUITE-UnloadDistributedZkTest-seed#[C3BF86D591BE0B10]-worker) [    ] o.a.s.SolrTestCaseJ4 SecureRandom sanity checks: test.solr.allowed.securerandom=null & java.security.egd=file:/dev/./urandom
   [junit4]   2> Creating dataDir: /home/jenkins/jenkins-slave/workspace/Lucene-Solr-BadApples-Tests-master/solr/build/solr-core/test/J0/temp/solr.cloud.UnloadDistributedZkTest_C3BF86D591BE0B10-001/init-core-data-001
   [junit4]   2> 285121 WARN  (SUITE-UnloadDistributedZkTest-seed#[C3BF86D591BE0B10]-worker) [    ] o.a.s.SolrTestCaseJ4 startTrackingSearchers: numOpens=24 numCloses=24
   [junit4]   2> 285121 INFO  (SUITE-UnloadDistributedZkTest-seed#[C3BF86D591BE0B10]-worker) [    ] o.a.s.SolrTestCaseJ4 Using PointFields (NUMERIC_POINTS_SYSPROP=true) w/NUMERIC_DOCVALUES_SYSPROP=true
   [junit4]   2> 285122 INFO  (SUITE-UnloadDistributedZkTest-seed#[C3BF86D591BE0B10]-worker) [    ] o.a.s.SolrTestCaseJ4 Randomized ssl (false) and clientAuth (false) via: @org.apache.solr.SolrTestCaseJ4$SuppressSSL(bugUrl="https://issues.apache.org/jira/browse/SOLR-5776")
   [junit4]   2> 285122 INFO  (SUITE-UnloadDistributedZkTest-seed#[C3BF86D591BE0B10]-worker) [    ] o.a.s.BaseDistributedSearchTestCase Setting hostContext system property: /xv_/
   [junit4]   2> 285129 INFO  (TEST-UnloadDistributedZkTest.test-seed#[C3BF86D591BE0B10]) [    ] o.a.s.c.ZkTestServer STARTING ZK TEST SERVER
   [junit4]   2> 285146 INFO  (ZkTestServer Run Thread) [    ] o.a.s.c.ZkTestServer client port:0.0.0.0/0.0.0.0:0
   [junit4]   2> 285146 INFO  (ZkTestServer Run Thread) [    ] o.a.s.c.ZkTestServer Starting server
   [junit4]   2> 285244 INFO  (TEST-UnloadDistributedZkTest.test-seed#[C3BF86D591BE0B10]) [    ] o.a.s.c.ZkTestServer start zk server on port:45366
   [junit4]   2> 285244 INFO  (TEST-UnloadDistributedZkTest.test-seed#[C3BF86D591BE0B10]) [    ] o.a.s.c.ZkTestServer parse host and port list: 127.0.0.1:45366
   [junit4]   2> 285244 INFO  (TEST-UnloadDistributedZkTest.test-seed#[C3BF86D591BE0B10]) [    ] o.a.s.c.ZkTestServer connecting to 127.0.0.1 45366
   [junit4]   2> 285285 INFO  (zkConnectionManagerCallback-2761-thread-1) [    ] o.a.s.c.c.ConnectionManager zkClient has connected
   [junit4]   2> 285308 INFO  (zkConnectionManagerCallback-2763-thread-1) [    ] o.a.s.c.c.ConnectionManager zkClient has connected
   [junit4]   2> 285313 INFO  (TEST-UnloadDistributedZkTest.test-seed#[C3BF86D591BE0B10]) [    ] o.a.s.c.ZkTestServer put /home/jenkins/jenkins-slave/workspace/Lucene-Solr-BadApples-Tests-master/solr/core/src/test-files/solr/collection1/conf/solrconfig-tlog.xml to /configs/conf1/solrconfig.xml
   [junit4]   2> 285327 INFO  (TEST-UnloadDistributedZkTest.test-seed#[C3BF86D591BE0B10]) [    ] o.a.s.c.ZkTestServer put /home/jenkins/jenkins-slave/workspace/Lucene-Solr-BadApples-Tests-master/solr/core/src/test-files/solr/collection1/conf/schema.xml to /configs/conf1/schema.xml
   [junit4]   2> 285329 INFO  (TEST-UnloadDistributedZkTest.test-seed#[C3BF86D591BE0B10]) [    ] o.a.s.c.ZkTestServer put /home/jenkins/jenkins-slave/workspace/Lucene-Solr-BadApples-Tests-master/solr/core/src/test-files/solr/collection1/conf/solrconfig.snippet.randomindexconfig.xml to /configs/conf1/solrconfig.snippet.randomindexconfig.xml
   [junit4]   2> 285336 INFO  (TEST-UnloadDistributedZkTest.test-seed#[C3BF86D591BE0B10]) [    ] o.a.s.c.ZkTestServer put /home/jenkins/jenkins-slave/workspace/Lucene-Solr-BadApples-Tests-master/solr/core/src/test-files/solr/collection1/conf/stopwords.txt to /configs/conf1/stopwords.txt
   [junit4]   2> 285337 INFO  (TEST-UnloadDistributedZkTest.test-seed#[C3BF86D591BE0B10]) [    ] o.a.s.c.ZkTestServer put /home/jenkins/jenkins-slave/workspace/Lucene-Solr-BadApples-Tests-master/solr/core/src/test-files/solr/collection1/conf/protwords.txt to /configs/conf1/protwords.txt
   [junit4]   2> 285338 INFO  (TEST-UnloadDistributedZkTest.test-seed#[C3BF86D591BE0B10]) [    ] o.a.s.c.ZkTestServer put /home/jenkins/jenkins-slave/workspace/Lucene-Solr-BadApples-Tests-master/solr/core/src/test-files/solr/collection1/conf/currency.xml to /configs/conf1/currency.xml
   [junit4]   2> 285340 INFO  (TEST-UnloadDistributedZkTest.test-seed#[C3BF86D591BE0B10]) [    ] o.a.s.c.ZkTestServer put /home/jenkins/jenkins-slave/workspace/Lucene-Solr-BadApples-Tests-master/solr/core/src/test-files/solr/collection1/conf/enumsConfig.xml to /configs/conf1/enumsConfig.xml
   [junit4]   2> 285341 INFO  (TEST-UnloadDistributedZkTest.test-seed#[C3BF86D591BE0B10]) [    ] o.a.s.c.ZkTestServer put /home/jenkins/jenkins-slave/workspace/Lucene-Solr-BadApples-Tests-master/solr/core/src/test-files/solr/collection1/conf/open-exchange-rates.json to /configs/conf1/open-exchange-rates.json
   [junit4]   2> 285342 INFO  (TEST-UnloadDistributedZkTest.test-seed#[C3BF86D591BE0B10]) [    ] o.a.s.c.ZkTestServer put /home/jenkins/jenkins-slave/workspace/Lucene-Solr-BadApples-Tests-master/solr/core/src/test-files/solr/collection1/conf/mapping-ISOLatin1Accent.txt to /configs/conf1/mapping-ISOLatin1Accent.txt
   [junit4]   2> 285343 INFO  (TEST-UnloadDistributedZkTest.test-seed#[C3BF86D591BE0B10]) [    ] o.a.s.c.ZkTestServer put /home/jenkins/jenkins-slave/workspace/Lucene-Solr-BadApples-Tests-master/solr/core/src/test-files/solr/collection1/conf/old_synonyms.txt to /configs/conf1/old_synonyms.txt
   [junit4]   2> 285348 INFO  (TEST-UnloadDistributedZkTest.test-seed#[C3BF86D591BE0B10]) [    ] o.a.s.c.ZkTestServer put /home/jenkins/jenkins-slave/workspace/Lucene-Solr-BadApples-Tests-master/solr/core/src/test-files/solr/collection1/conf/synonyms.txt to /configs/conf1/synonyms.txt
   [junit4]   2> 285350 INFO  (TEST-UnloadDistributedZkTest.test-seed#[C3BF86D591BE0B10]) [    ] o.a.s.c.AbstractFullDistribZkTestBase Will use NRT replicas unless explicitly asked otherwise
   [junit4]   2> 285666 WARN  (TEST-UnloadDistributedZkTest.test-seed#[C3BF86D591BE0B10]) [    ] o.e.j.s.AbstractConnector Ignoring deprecated socket close linger time
   [junit4]   2> 285667 INFO  (TEST-UnloadDistributedZkTest.test-seed#[C3BF86D591BE0B10]) [    ] o.a.s.c.s.e.JettySolrRunner Start Jetty (original configured port=0)
   [junit4]   2> 285667 INFO  (TEST-UnloadDistributedZkTest.test-seed#[C3BF86D591BE0B10]) [    ] o.a.s.c.s.e.JettySolrRunner Trying to start Jetty on port 0 try number 1 ...
   [junit4]   2> 285667 INFO  (TEST-UnloadDistributedZkTest.test-seed#[C3BF86D591BE0B10]) [    ] o.e.j.s.Server jetty-9.4.14.v20181114; built: 2018-11-14T21:20:31.478Z; git: c4550056e785fb5665914545889f21dc136ad9e6; jvm 11.0.1+13-LTS
   [junit4]   2> 285701 INFO  (TEST-UnloadDistributedZkTest.test-seed#[C3BF86D591BE0B10]) [    ] o.e.j.s.session DefaultSessionIdManager workerName=node0
   [junit4]   2> 285701 INFO  (TEST-UnloadDistributedZkTest.test-seed#[C3BF86D591BE0B10]) [    ] o.e.j.s.session No SessionScavenger set, using defaults
   [junit4]   2> 285701 INFO  (TEST-UnloadDistributedZkTest.test-seed#[C3BF86D591BE0B10]) [    ] o.e.j.s.session node0 Scavenging every 660000ms
   [junit4]   2> 285702 INFO  (TEST-UnloadDistributedZkTest.test-seed#[C3BF86D591BE0B10]) [    ] o.e.j.s.h.ContextHandler Started o.e.j.s.ServletContextHandler@2ab4dc06{/xv_,null,AVAILABLE}
   [junit4]   2> 285706 INFO  (TEST-UnloadDistributedZkTest.test-seed#[C3BF86D591BE0B10]) [    ] o.e.j.s.AbstractConnector Started ServerConnector@7d2f632b{HTTP/1.1,[http/1.1, h2c]}{127.0.0.1:43525}
   [junit4]   2> 285706 INFO  (TEST-UnloadDistributedZkTest.test-seed#[C3BF86D591BE0B10]) [    ] o.e.j.s.Server Started @285758ms
   [junit4]   2> 285707 INFO  (TEST-UnloadDistributedZkTest.test-seed#[C3BF86D591BE0B10]) [    ] o.a.s.c.s.e.JettySolrRunner Jetty properties: {hostContext=/xv_, solr.data.dir=/home/jenkins/jenkins-slave/workspace/Lucene-Solr-BadApples-Tests-master/solr/build/solr-core/test/J0/temp/solr.cloud.UnloadDistributedZkTest_C3BF86D591BE0B10-001/tempDir-001/control/data, hostPort=43525, coreRootDirectory=/home/jenkins/jenkins-slave/workspace/Lucene-Solr-BadApples-Tests-master/solr/build/solr-core/test/J0/temp/solr.cloud.UnloadDistributedZkTest_C3BF86D591BE0B10-001/control-001/cores}
   [junit4]   2> 285707 ERROR (TEST-UnloadDistributedZkTest.test-seed#[C3BF86D591BE0B10]) [    ] o.a.s.u.StartupLoggingUtils Missing Java Option solr.log.dir. Logging may be missing or incomplete.
   [junit4]   2> 285707 INFO  (TEST-UnloadDistributedZkTest.test-seed#[C3BF86D591BE0B10]) [    ] o.a.s.s.SolrDispatchFilter Using logger factory org.apache.logging.slf4j.Log4jLoggerFactory
   [junit4]   2> 285707 INFO  (TEST-UnloadDistributedZkTest.test-seed#[C3BF86D591BE0B10]) [    ] o.a.s.s.SolrDispatchFilter  ___      _       Welcome to Apache Solr? version 9.0.0
   [junit4]   2> 285707 INFO  (TEST-UnloadDistributedZkTest.test-seed#[C3BF86D591BE0B10]) [    ] o.a.s.s.SolrDispatchFilter / __| ___| |_ _   Starting in cloud mode on port null
   [junit4]   2> 285707 INFO  (TEST-UnloadDistributedZkTest.test-seed#[C3BF86D591BE0B10]) [    ] o.a.s.s.SolrDispatchFilter \__ \/ _ \ | '_|  Install dir: null
   [junit4]   2> 285707 INFO  (TEST-UnloadDistributedZkTest.test-seed#[C3BF86D591BE0B10]) [    ] o.a.s.s.SolrDispatchFilter |___/\___/_|_|    Start time: 2019-04-16T19:35:28.966603Z
   [junit4]   2> 285710 INFO  (zkConnectionManagerCallback-2765-thread-1) [    ] o.a.s.c.c.ConnectionManager zkClient has connected
   [junit4]   2> 285711 INFO  (TEST-UnloadDistributedZkTest.test-seed#[C3BF86D591BE0B10]) [    ] o.a.s.s.SolrDispatchFilter Loading solr.xml from SolrHome (not found in ZooKeeper)
   [junit4]   2> 285711 INFO  (TEST-UnloadDistributedZkTest.test-seed#[C3BF86D591BE0B10]) [    ] o.a.s.c.SolrXmlConfig Loading container configuration from /home/jenkins/jenkins-slave/workspace/Lucene-Solr-BadApples-Tests-master/solr/build/solr-core/test/J0/temp/solr.cloud.UnloadDistributedZkTest_C3BF86D591BE0B10-001/control-001/solr.xml
   [junit4]   2> 285714 INFO  (TEST-UnloadDistributedZkTest.test-seed#[C3BF86D591BE0B10]) [    ] o.a.s.c.SolrXmlConfig Configuration parameter autoReplicaFailoverWorkLoopDelay is ignored
   [junit4]   2> 285714 INFO  (TEST-UnloadDistributedZkTest.test-seed#[C3BF86D591BE0B10]) [    ] o.a.s.c.SolrXmlConfig Configuration parameter autoReplicaFailoverBadNodeExpiration is ignored
   [junit4]   2> 285721 INFO  (TEST-UnloadDistributedZkTest.test-seed#[C3BF86D591BE0B10]) [    ] o.a.s.c.SolrXmlConfig MBean server found: com.sun.jmx.mbeanserver.JmxMBeanServer@7ccb36e6, but no JMX reporters were configured - adding default JMX reporter.
   [junit4]   2> 285933 INFO  (TEST-UnloadDistributedZkTest.test-seed#[C3BF86D591BE0B10]) [    ] o.a.s.h.c.HttpShardHandlerFactory Host whitelist initialized: WhitelistHostChecker [whitelistHosts=null, whitelistHostCheckingEnabled=false]
   [junit4]   2> 285945 WARN  (TEST-UnloadDistributedZkTest.test-seed#[C3BF86D591BE0B10]) [    ] o.e.j.u.s.S.config No Client EndPointIdentificationAlgorithm configured for SslContextFactory@6f1b59ce[provider=null,keyStore=null,trustStore=null]
   [junit4]   2> 285969 WARN  (TEST-UnloadDistributedZkTest.test-seed#[C3BF86D591BE0B10]) [    ] o.e.j.u.s.S.config No Client EndPointIdentificationAlgorithm configured for SslContextFactory@6deee9f1[provider=null,keyStore=null,trustStore=null]
   [junit4]   2> 285970 INFO  (TEST-UnloadDistributedZkTest.test-seed#[C3BF86D591BE0B10]) [    ] o.a.s.c.ZkContainer Zookeeper client=127.0.0.1:45366/solr
   [junit4]   2> 285972 INFO  (zkConnectionManagerCallback-2772-thread-1) [    ] o.a.s.c.c.ConnectionManager zkClient has connected
   [junit4]   2> 285984 INFO  (zkConnectionManagerCallback-2774-thread-1) [    ] o.a.s.c.c.ConnectionManager zkClient has connected
   [junit4]   2> 286114 INFO  (TEST-UnloadDistributedZkTest.test-seed#[C3BF86D591BE0B10]) [n:127.0.0.1:43525_xv_    ] o.a.s.c.OverseerElectionContext I am going to be the leader 127.0.0.1:43525_xv_
   [junit4]   2> 286114 INFO  (TEST-UnloadDistributedZkTest.test-seed#[C3BF86D591BE0B10]) [n:127.0.0.1:43525_xv_    ] o.a.s.c.Overseer Overseer (id=74533591916806148-127.0.0.1:43525_xv_-n_0000000000) starting
   [junit4]   2> 286144 INFO  (zkConnectionManagerCallback-2781-thread-1) [    ] o.a.s.c.c.ConnectionManager zkClient has connected
   [junit4]   2> 286146 INFO  (TEST-UnloadDistributedZkTest.test-seed#[C3BF86D591BE0B10]) [n:127.0.0.1:43525_xv_    ] o.a.s.c.s.i.ZkClientClusterStateProvider Cluster at 127.0.0.1:45366/solr ready
   [junit4]   2> 286156 INFO  (OverseerStateUpdate-74533591916806148-127.0.0.1:43525_xv_-n_0000000000) [n:127.0.0.1:43525_xv_    ] o.a.s.c.Overseer Starting to work on the main queue : 127.0.0.1:43525_xv_
   [junit4]   2> 286188 INFO  (TEST-UnloadDistributedZkTest.test-seed#[C3BF86D591BE0B10]) [n:127.0.0.1:43525_xv_    ] o.a.s.c.ZkController Register node as live in ZooKeeper:/live_nodes/127.0.0.1:43525_xv_
   [junit4]   2> 286210 INFO  (zkCallback-2773-thread-1) [    ] o.a.s.c.c.ZkStateReader Updated live nodes from ZooKeeper... (0) -> (1)
   [junit4]   2> 286211 INFO  (zkCallback-2780-thread-1) [    ] o.a.s.c.c.ZkStateReader Updated live nodes from ZooKeeper... (0) -> (1)
   [junit4]   2> 286308 INFO  (TEST-UnloadDistributedZkTest.test-seed#[C3BF86D591BE0B10]) [n:127.0.0.1:43525_xv_    ] o.a.s.h.a.MetricsHistoryHandler No .system collection, keeping metrics history in memory.
   [junit4]   2> 286362 INFO  (TEST-UnloadDistributedZkTest.test-seed#[C3BF86D591BE0B10]) [n:127.0.0.1:43525_xv_    ] o.a.s.m.r.SolrJmxReporter JMX monitoring for 'solr.node' (registry 'solr.node') enabled at server: com.sun.jmx.mbeanserver.JmxMBeanServer@7ccb36e6
   [junit4]   2> 286371 INFO  (TEST-UnloadDistributedZkTest.test-seed#[C3BF86D591BE0B10]) [n:127.0.0.1:43525_xv_    ] o.a.s.m.r.SolrJmxReporter JMX monitoring for 'solr.jvm' (registry 'solr.jvm') enabled at server: com.sun.jmx.mbeanserver.JmxMBeanServer@7ccb36e6
   [junit4]   2> 286371 INFO  (TEST-UnloadDistributedZkTest.test-seed#[C3BF86D591BE0B10]) [n:127.0.0.1:43525_xv_    ] o.a.s.m.r.SolrJmxReporter JMX monitoring for 'solr.jetty' (registry 'solr.jetty') enabled at server: com.sun.jmx.mbeanserver.JmxMBeanServer@7ccb36e6
   [junit4]   2> 286372 INFO  (TEST-UnloadDistributedZkTest.test-seed#[C3BF86D591BE0B10]) [n:127.0.0.1:43525_xv_    ] o.a.s.c.CorePropertiesLocator Found 0 core definitions underneath /home/jenkins/jenkins-slave/workspace/Lucene-Solr-BadApples-Tests-master/solr/build/solr-core/test/J0/temp/solr.cloud.UnloadDistributedZkTest_C3BF86D591BE0B10-001/control-001/cores
   [junit4]   2> 286435 INFO  (zkConnectionManagerCallback-2787-thread-1) [    ] o.a.s.c.c.ConnectionManager zkClient has connected
   [junit4]   2> 286436 INFO  (TEST-UnloadDistributedZkTest.test-seed#[C3BF86D591BE0B10]) [    ] o.a.s.c.c.ZkStateReader Updated live nodes from ZooKeeper... (0) -> (1)
   [junit4]   2> 286437 INFO  (TEST-UnloadDistributedZkTest.test-seed#[C3BF86D591BE0B10]) [    ] o.a.s.c.s.i.ZkClientClusterStateProvider Cluster at 127.0.0.1:45366/solr ready
   [junit4]   2> 286451 INFO  (qtp1688054386-5303) [n:127.0.0.1:43525_xv_    ] o.a.s.h.a.CollectionsHandler Invoked Collection Action :create with params collection.configName=conf1&name=control_collection&nrtReplicas=1&action=CREATE&numShards=1&createNodeSet=127.0.0.1:43525_xv_&wt=javabin&version=2 and sendToOCPQueue=true
   [junit4]   2> 286463 INFO  (OverseerThreadFactory-581-thread-1-processing-n:127.0.0.1:43525_xv_) [n:127.0.0.1:43525_xv_    ] o.a.s.c.a.c.CreateCollectionCmd Create collection control_collection
   [junit4]   2> 286573 INFO  (qtp1688054386-5305) [n:127.0.0.1:43525_xv_    x:control_collection_shard1_replica_n1] o.a.s.h.a.CoreAdminOperation core create command qt=/admin/cores&collection.configName=conf1&newCollection=true&name=control_collection_shard1_replica_n1&action=CREATE&numShards=1&collection=control_collection&shard=shard1&wt=javabin&version=2&replicaType=NRT
   [junit4]   2> 286574 INFO  (qtp1688054386-5305) [n:127.0.0.1:43525_xv_    x:control_collection_shard1_replica_n1] o.a.s.c.TransientSolrCoreCacheDefault Allocating transient cache for 4 transient cores
   [junit4]   2> 287587 INFO  (qtp1688054386-5305) [n:127.0.0.1:43525_xv_ c:control_collection s:shard1  x:control_collection_shard1_replica_n1] o.a.s.c.SolrConfig Using Lucene MatchVersion: 9.0.0
   [junit4]   2> 287613 INFO  (qtp1688054386-5305) [n:127.0.0.1:43525_xv_ c:control_collection s:shard1  x:control_collection_shard1_replica_n1] o.a.s.s.IndexSchema [control_collection_shard1_replica_n1] Schema name=test
   [junit4]   2> 287852 INFO  (qtp1688054386-5305) [n:127.0.0.1:43525_xv_ c:control_collection s:shard1  x:control_collection_shard1_replica_n1] o.a.s.s.IndexSchema Loaded schema test/1.0 with uniqueid field id
   [junit4]   2> 287906 INFO  (qtp1688054386-5305) [n:127.0.0.1:43525_xv_ c:control_collection s:shard1  x:control_collection_shard1_replica_n1] o.a.s.c.CoreContainer Creating SolrCore 'control_collection_shard1_replica_n1' using configuration from collection control_collection, trusted=true
   [junit4]   2> 287907 INFO  (qtp1688054386-5305) [n:127.0.0.1:43525_xv_ c:control_collection s:shard1  x:control_collection_shard1_replica_n1] o.a.s.m.r.SolrJmxReporter JMX monitoring for 'solr.core.control_collection.shard1.replica_n1' (registry 'solr.core.control_collection.shard1.replica_n1') enabled at server: com.sun.jmx.mbeanserver.JmxMBeanServer@7ccb36e6
   [junit4]   2> 287907 INFO  (qtp1688054386-5305) [n:127.0.0.1:43525_xv_ c:control_collection s:shard1  x:control_collection_shard1_replica_n1] o.a.s.c.SolrCore [[control_collection_shard1_replica_n1] ] Opening new SolrCore at [/home/jenkins/jenkins-slave/workspace/Lucene-Solr-BadApples-Tests-master/solr/build/solr-core/test/J0/temp/solr.cloud.UnloadDistributedZkTest_C3BF86D591BE0B10-001/control-001/cores/control_collection_shard1_replica_n1], dataDir=[/home/jenkins/jenkins-slave/workspace/Lucene-Solr-BadApples-Tests-master/solr/build/solr-core/test/J0/temp/solr.cloud.UnloadDistributedZkTest_C3BF86D591BE0B10-001/control-001/cores/control_collection_shard1_replica_n1/data/]
   [junit4]   2> 287910 INFO  (qtp1688054386-5305) [n:127.0.0.1:43525_xv_ c:control_collection s:shard1  x:control_collection_shard1_replica_n1] o.a.s.u.RandomMergePolicy RandomMergePolicy wrapping class org.apache.lucene.index.TieredMergePolicy: [TieredMergePolicy: maxMergeAtOnce=22, maxMergeAtOnceExplicit=45, maxMergedSegmentMB=73.759765625, floorSegmentMB=1.76171875, forceMergeDeletesPctAllowed=26.90872171721398, segmentsPerTier=23.0, maxCFSSegmentSizeMB=8.796093022207999E12, noCFSRatio=1.0, deletesPctAllowed=42.141480919630695
   [junit4]   2> 287937 WARN  (qtp1688054386-5305) [n:127.0.0.1:43525_xv_ c:control_collection s:shard1  x:control_collection_shard1_replica_n1] o.a.s.c.RequestHandlers INVALID paramSet a in requestHandler {type = requestHandler,name = /dump,class = DumpRequestHandler,attributes = {initParams=a, name=/dump, class=DumpRequestHandler},args = {defaults={a=A,b=B}}}
   [junit4]   2> 288101 INFO  (qtp1688054386-5305) [n:127.0.0.1:43525_xv_ c:control_collection s:shard1  x:control_collection_shard1_replica_n1] o.a.s.u.UpdateHandler Using UpdateLog implementation: org.apache.solr.update.UpdateLog
   [junit4]   2> 288101 INFO  (qtp1688054386-5305) [n:127.0.0.1:43525_xv_ c:control_collection s:shard1  x:control_collection_shard1_replica_n1] o.a.s.u.UpdateLog Initializing UpdateLog: dataDir= defaultSyncLevel=FLUSH numRecordsToKeep=100 maxNumLogsToKeep=10 numVersionBuckets=65536
   [junit4]   2> 288103 INFO  (qtp1688054386-5305) [n:127.0.0.1:43525_xv_ c:control_collection s:shard1  x:control_collection_shard1_replica_n1] o.a.s.u.CommitTracker Hard AutoCommit: disabled
   [junit4]   2> 288103 INFO  (qtp1688054386-5305) [n:127.0.0.1:43525_xv_ c:control_collection s:shard1  x:control_collection_shard1_replica_n1] o.a.s.u.CommitTracker Soft AutoCommit: disabled
   [junit4]   2> 288104 INFO  (qtp1688054386-5305) [n:127.0.0.1:43525_xv_ c:control_collection s:shard1  x:control_collection_shard1_replica_n1] o.a.s.u.RandomMergePolicy RandomMergePolicy wrapping class org.apache.lucene.index.LogByteSizeMergePolicy: [LogByteSizeMergePolicy: minMergeSize=1677721, mergeFactor=34, maxMergeSize=2147483648, maxMergeSizeForForcedMerge=9223372036854775807, calibrateSizeByDeletes=false, maxMergeDocs=2147483647, maxCFSSegmentSizeMB=8.796093022207999E12, noCFSRatio=1.0]
   [junit4]   2> 288105 INFO  (qtp1688054386-5305) [n:127.0.0.1:43525_xv_ c:control_collection s:shard1  x:control_collection_shard1_replica_n1] o.a.s.s.SolrIndexSearcher Opening [Searcher@74e98953[control_collection_shard1_replica_n1] main]
   [junit4]   2> 288107 INFO  (qtp1688054386-5305) [n:127.0.0.1:43525_xv_ c:control_collection s:shard1  x:control_collection_shard1_replica_n1] o.a.s.r.ManagedResourceStorage Configured ZooKeeperStorageIO with znodeBase: /configs/conf1
   [junit4]   2> 288107 INFO  (qtp1688054386-5305) [n:127.0.0.1:43525_xv_ c:control_collection s:shard1  x:control_collection_shard1_replica_n1] o.a.s.r.ManagedResourceStorage Loaded null at path _rest_managed.json using ZooKeeperStorageIO:path=/configs/conf1
   [junit4]   2> 288108 INFO  (qtp1688054386-5305) [n:127.0.0.1:43525_xv_ c:control_collection s:shard1  x:control_collection_shard1_replica_n1] o.a.s.h.ReplicationHandler Commits will be reserved for 10000ms.
   [junit4]   2> 288108 INFO  (qtp1688054386-5305) [n:127.0.0.1:43525_xv_ c:control_collection s:shard1  x:control_collection_shard1_replica_n1] o.a.s.u.UpdateLog Could not find max version in index or recent updates, using new clock 1631000546631483392
   [junit4]   2> 288118 INFO  (searcherExecutor-586-thread-1-processing-n:127.0.0.1:43525_xv_ x:control_collection_shard1_replica_n1 c:control_collection s:shard1) [n:127.0.0.1:43525_xv_ c:control_collection s:shard1  x:control_collection_shard1_replica_n1] o.a.s.c.SolrCore [control_collection_shard1_replica_n1] Registered new searcher Searcher@74e98953[control_collection_shard1_replica_n1] main{ExitableDirectoryReader(UninvertingDirectoryReader())}
   [junit4]   2> 288129 INFO  (qtp1688054386-5305) [n:127.0.0.1:43525_xv_ c:control_collection s:shard1  x:control_collection_shard1_replica_n1] o.a.s.c.ZkShardTerms Successful update of terms at /collections/control_collection/terms/shard1 to Terms{values={core_node2=0}, version=0}
   [junit4]   2> 288129 INFO  (qtp1688054386-5305) [n:127.0.0.1:43525_xv_ c:control_collection s:shard1  x:control_collection_shard1_replica_n1] o.a.s.c.ShardLeaderElectionContextBase make sure parent is created /collections/control_collection/leaders/shard1
   [junit4]   2> 288133 INFO  (qtp1688054386-5305) [n:127.0.0.1:43525_xv_ c:control_collection s:shard1  x:control_collection_shard1_replica_n1] o.a.s.c.ShardLeaderElectionContext Enough replicas found to continue.
   [junit4]   2> 288133 INFO  (qtp1688054386-5305) [n:127.0.0.1:43525_xv_ c:control_collection s:shard1  x:control_collection_shard1_replica_n1] o.a.s.c.ShardLeaderElectionContext I may be the new leader - try and sync
   [junit4]   2> 288133 INFO  (qtp1688054386-5305) [n:127.0.0.1:43525_xv_ c:control_collection s:shard1  x:control_collection_shard1_replica_n1] o.a.s.c.SyncStrategy Sync replicas to http://127.0.0.1:43525/xv_/control_collection_shard1_replica_n1/
   [junit4]   2> 288133 INFO  (qtp1688054386-5305) [n:127.0.0.1:43525_xv_ c:control_collection s:shard1  x:control_collection_shard1_replica_n1] o.a.s.c.SyncStrategy Sync Success - now sync replicas to me
   [junit4]   2> 288133 INFO  (qtp1688054386-5305) [n:127.0.0.1:43525_xv_ c:control_collection s:shard1  x:control_collection_shard1_replica_n1] o.a.s.c.SyncStrategy http://127.0.0.1:43525/xv_/control_collection_shard1_replica_n1/ has no replicas
   [junit4]   2> 288133 INFO  (qtp1688054386-5305) [n:127.0.0.1:43525_xv_ c:control_collection s:shard1  x:control_collection_shard1_replica_n1] o.a.s.c.ShardLeaderElectionContextBase Creating leader registration node /collections/control_collection/leaders/shard1/leader after winning as /collections/control_collection/leader_elect/shard1/election/74533591916806148-core_node2-n_0000000000
   [junit4]   2> 288141 INFO  (qtp1688054386-5305) [n:127.0.0.1:43525_xv_ c:control_collection s:shard1  x:control_collection_shard1_replica_n1] o.a.s.c.ShardLeaderElectionContext I am the new leader: http://127.0.0.1:43525/xv_/control_collection_shard1_replica_n1/ shard1
   [junit4]   2> 288250 INFO  (zkCallback-2773-thread-1) [    ] o.a.s.c.c.ZkStateReader A cluster state change: [WatchedEvent state:SyncConnected type:NodeDataChanged path:/collections/control_collection/state.json] for collection [control_collection] has occurred - updating... (live nodes size: [1])
   [junit4]   2> 288251 INFO  (qtp1688054386-5305) [n:127.0.0.1:43525_xv_ c:control_collection s:shard1  x:control_collection_shard1_replica_n1] o.a.s.c.ZkController I am the leader, no recovery necessary
   [junit4]   2> 288255 INFO  (qtp1688054386-5305) [n:127.0.0.1:43525_xv_ c:control_collection s:shard1  x:control_collection_shard1_replica_n1] o.a.s.s.HttpSolrCall [admin] webapp=null path=/admin/cores params={qt=/admin/cores&collection.configName=conf1&newCollection=true&name=control_collection_shard1_replica_n1&action=CREATE&numShards=1&collection=control_collection&shard=shard1&wt=javabin&version=2&replicaType=NRT} status=0 QTime=1682
   [junit4]   2> 288264 INFO  (zkCallback-2773-thread-2) [    ] o.a.s.c.c.ZkStateReader A cluster state change: [WatchedEvent state:SyncConnected type:NodeDataChanged path:/collections/control_collection/state.json] for collection [control_collection] has occurred - updating... (live nodes size: [1])
   [junit4]   2> 288276 INFO  (qtp1688054386-5303) [n:127.0.0.1:43525_xv_    ] o.a.s.h.a.CollectionsHandler Wait for new collection to be active for at most 45 seconds. Check all shard replicas
   [junit4]   2> 288367 INFO  (zkCallback-2773-thread-1) [    ] o.a.s.c.c.ZkStateReader A cluster state change: [WatchedEvent state:SyncConnected type:NodeDataChanged path:/collections/control_collection/state.json] for collection [control_collection] has occurred - updating... (live nodes size: [1])
   [junit4]   2> 288367 INFO  (zkCallback-2773-thread-2) [    ] o.a.s.c.c.ZkStateReader A cluster state change: [WatchedEvent state:SyncConnected type:NodeDataChanged path:/collections/control_collection/state.json] for collection [control_collection] has occurred - updating... (live nodes size: [1])
   [junit4]   2> 288368 INFO  (qtp1688054386-5303) [n:127.0.0.1:43525_xv_    ] o.a.s.s.HttpSolrCall [admin] webapp=null path=/admin/collections params={collection.configName=conf1&name=control_collection&nrtReplicas=1&action=CREATE&numShards=1&createNodeSet=127.0.0.1:43525_xv_&wt=javabin&version=2} status=0 QTime=1917
   [junit4]   2> 288380 INFO  (zkCallback-2773-thread-3) [    ] o.a.s.c.c.ZkStateReader A cluster state change: [WatchedEvent state:SyncConnected type:NodeDataChanged path:/collections/control_collection/state.json] for collection [control_collection] has occurred - updating... (live nodes size: [1])
   [junit4]   2> 288428 INFO  (zkConnectionManagerCallback-2793-thread-1) [    ] o.a.s.c.c.ConnectionManager zkClient has connected
   [junit4]   2> 288429 INFO  (TEST-UnloadDistributedZkTest.test-seed#[C3BF86D591BE0B10]) [    ] o.a.s.c.c.ZkStateReader Updated live nodes from ZooKeeper... (0) -> (1)
   [junit4]   2> 288430 INFO  (TEST-UnloadDistributedZkTest.test-seed#[C3BF86D591BE0B10]) [    ] o.a.s.c.s.i.ZkClientClusterStateProvider Cluster at 127.0.0.1:45366/solr ready
   [junit4]   2> 288432 INFO  (TEST-UnloadDistributedZkTest.test-seed#[C3BF86D591BE0B10]) [    ] o.a.s.c.ChaosMonkey monkey: init - expire sessions:false cause connection loss:false
   [junit4]   2> 288434 INFO  (qtp1688054386-5305) [n:127.0.0.1:43525_xv_    ] o.a.s.h.a.CollectionsHandler Invoked Collection Action :create with params collection.configName=conf1&name=collection1&nrtReplicas=1&action=CREATE&numShards=2&createNodeSet=&stateFormat=1&wt=javabin&version=2 and sendToOCPQueue=true
   [junit4]   2> 288437 INFO  (OverseerCollectionConfigSetProcessor-74533591916806148-127.0.0.1:43525_xv_-n_0000000000) [n:127.0.0.1:43525_xv_    ] o.a.s.c.OverseerTaskQueue Response ZK path: /overseer/collection-queue-work/qnr-0000000000 doesn't exist.  Requestor may have disconnected from ZooKeeper
   [junit4]   2> 288438 INFO  (OverseerThreadFactory-581-thread-2-processing-n:127.0.0.1:43525_xv_) [n:127.0.0.1:43525_xv_    ] o.a.s.c.a.c.CreateCollectionCmd Create collection collection1
   [junit4]   2> 288643 WARN  (OverseerThreadFactory-581-thread-2-processing-n:127.0.0.1:43525_xv_) [n:127.0.0.1:43525_xv_    ] o.a.s.c.a.c.CreateCollectionCmd It is unusual to create a collection (collection1) without cores.
   [junit4]   2> 288645 INFO  (qtp1688054386-5305) [n:127.0.0.1:43525_xv_    ] o.a.s.h.a.CollectionsHandler Wait for new collection to be active for at most 45 seconds. Check all shard replicas
   [junit4]   2> 288646 INFO  (qtp1688054386-5305) [n:127.0.0.1:43525_xv_    ] o.a.s.s.HttpSolrCall [admin] webapp=null path=/admin/collections params={collection.configName=conf1&name=collection1&nrtReplicas=1&action=CREATE&numShards=2&createNodeSet=&stateFormat=1&wt=javabin&version=2} status=0 QTime=211
   [junit4]   2> 288653 INFO  (OverseerCollectionConfigSetProcessor-74533591916806148-127.0.0.1:43525_xv_-n_0000000000) [n:127.0.0.1:43525_xv_    ] o.a.s.c.OverseerTaskQueue Response ZK path: /overseer/collection-queue-work/qnr-0000000002 doesn't exist.  Requestor may have disconnected from ZooKeeper
   [junit4]   2> 288668 INFO  (TEST-UnloadDistributedZkTest.test-seed#[C3BF86D591BE0B10]) [    ] o.a.s.c.AbstractFullDistribZkTestBase Creating jetty instances pullReplicaCount=0 numOtherReplicas=4
   [junit4]   2> 288932 INFO  (TEST-UnloadDistributedZkTest.test-seed#[C3BF86D591BE0B10]) [    ] o.a.s.c.AbstractFullDistribZkTestBase create jetty 1 in directory /home/jenkins/jenkins-slave/workspace/Lucene-Solr-BadApples-Tests-master/solr/build/solr-core/test/J0/temp/solr.cloud.UnloadDistributedZkTest_C3BF86D591BE0B10-001/shard-1-001 of type NRT
   [junit4]   2> 288947 WARN  (closeThreadPool-2794-thread-1) [    ] o.e.j.s.AbstractConnector Ignoring deprecated socket close linger time
   [junit4]   2> 288947 INFO  (closeThreadPool-2794-thread-1) [    ] o.a.s.c.s.e.JettySolrRunner Start Jetty (original configured port=0)
   [junit4]   2> 288947 INFO  (closeThreadPool-2794-thread-1) [    ] o.a.s.c.s.e.JettySolrRunner Trying to start Jetty on port 0 try number 1 ...
   [junit4]   2> 288947 INFO  (closeThreadPool-2794-thread-1) [    ] o.e.j.s.Server jetty-9.4.14.v20181114; built: 2018-11-14T21:20:31.478Z; git: c4550056e785fb5665914545889f21dc136ad9e6; jvm 11.0.1+13-LTS
   [junit4]   2> 289036 INFO  (closeThreadPool-2794-thread-1) [    ] o.e.j.s.session DefaultSessionIdManager workerName=node0
   [junit4]   2> 289036 INFO  (closeThreadPool-2794-thread-1) [    ] o.e.j.s.session No SessionScavenger set, using defaults
   [junit4]   2> 289036 INFO  (closeThreadPool-2794-thread-1) [    ] o.e.j.s.session node0 Scavenging every 600000ms
   [junit4]   2> 289041 INFO  (closeThreadPool-2794-thread-1) [    ] o.e.j.s.h.ContextHandler Started o.e.j.s.ServletContextHandler@3ea00896{/xv_,null,AVAILABLE}
   [junit4]   2> 289044 INFO  (closeThreadPool-2794-thread-1) [    ] o.e.j.s.AbstractConnector Started ServerConnector@2b4524d3{HTTP/1.1,[http/1.1, h2c]}{127.0.0.1:41317}
   [junit4]   2> 289044 INFO  (closeThreadPool-2794-thread-1) [    ] o.e.j.s.Server Started @289095ms
   [junit4]   2> 289044 INFO  (closeThreadPool-2794-thread-1) [    ] o.a.s.c.s.e.JettySolrRunner Jetty properties: {hostContext=/xv_, solrconfig=solrconfig.xml, solr.data.dir=/home/jenkins/jenkins-slave/workspace/Lucene-Solr-BadApples-Tests-master/solr/build/solr-core/test/J0/temp/solr.cloud.UnloadDistributedZkTest_C3BF86D591BE0B10-001/tempDir-001/jetty1, hostPort=41317, coreRootDirectory=/home/jenkins/jenkins-slave/workspace/Lucene-Solr-BadApples-Tests-master/solr/build/solr-core/test/J0/temp/solr.cloud.UnloadDistributedZkTest_C3BF86D591BE0B10-001/shard-1-001/cores}
   [junit4]   2> 289044 ERROR (closeThreadPool-2794-thread-1) [    ] o.a.s.u.StartupLoggingUtils Missing Java Option solr.log.dir. Logging may be missing or incomplete.
   [junit4]   2> 289044 INFO  (closeThreadPool-2794-thread-1) [    ] o.a.s.s.SolrDispatchFilter Using logger factory org.apache.logging.slf4j.Log4jLoggerFactory
   [junit4]   2> 289052 INFO  (closeThreadPool-2794-thread-1) [    ] o.a.s.s.SolrDispatchFilter  ___      _       Welcome to Apache Solr? version 9.0.0
   [junit4]   2> 289052 INFO  (closeThreadPool-2794-thread-1) [    ] o.a.s.s.SolrDispatchFilter / __| ___| |_ _   Starting in cloud mode on port null
   [junit4]   2> 289052 INFO  (closeThreadPool-2794-thread-1) [    ] o.a.s.s.SolrDispatchFilter \__ \/ _ \ | '_|  Install dir: null
   [junit4]   2> 289052 INFO  (closeThreadPool-2794-thread-1) [    ] o.a.s.s.SolrDispatchFilter |___/\___/_|_|    Start time: 2019-04-16T19:35:32.311256Z
   [junit4]   2> 289091 INFO  (zkConnectionManagerCallback-2796-thread-1) [    ] o.a.s.c.c.ConnectionManager zkClient has connected
   [junit4]   2> 289094 INFO  (closeThreadPool-2794-thread-1) [    ] o.a.s.s.SolrDispatchFilter Loading solr.xml from SolrHome (not found in ZooKeeper)
   [junit4]   2> 289094 INFO  (closeThreadPool-2794-thread-1) [    ] o.a.s.c.SolrXmlConfig Loading container configuration from /home/jenkins/jenkins-slave/workspace/Lucene-Solr-BadApples-Tests-master/solr/build/solr-core/test/J0/temp/solr.cloud.UnloadDistributedZkTest_C3BF86D591BE0B10-001/shard-1-001/solr.xml
   [junit4]   2> 289097 INFO  (closeThreadPool-2794-thread-1) [    ] o.a.s.c.SolrXmlConfig Configuration parameter autoReplicaFailoverWorkLoopDelay is ignored
   [junit4]   2> 289097 INFO  (closeThreadPool-2794-thread-1) [    ] o.a.s.c.SolrXmlConfig Configuration parameter autoReplicaFailoverBadNodeExpiration is ignored
   [junit4]   2> 289098 INFO  (closeThreadPool-2794-thread-1) [    ] o.a.s.c.SolrXmlConfig MBean server found: com.sun.jmx.mbeanserver.JmxMBeanServer@7ccb36e6, but no JMX reporters were configured - adding default JMX reporter.
   [junit4]   2> 289148 INFO  (TEST-UnloadDistributedZkTest.test-seed#[C3BF86D591BE0B10]) [    ] o.a.s.c.AbstractFullDistribZkTestBase create jetty 2 in directory /home/jenkins/jenkins-slave/workspace/Lucene-Solr-BadApples-Tests-master/solr/build/solr-core/test/J0/temp/solr.cloud.UnloadDistributedZkTest_C3BF86D591BE0B10-001/shard-2-001 of type NRT
   [junit4]   2> 289165 WARN  (closeThreadPool-2794-thread-2) [    ] o.e.j.s.AbstractConnector Ignoring deprecated socket close linger time
   [junit4]   2> 289165 INFO  (closeThreadPool-2794-thread-2) [    ] o.a.s.c.s.e.JettySolrRunner Start Jetty (original configured port=0)
   [junit4]   2> 289165 INFO  (closeThreadPool-2794-thread-2) [    ] o.a.s.c.s.e.JettySolrRunner Trying to start Jetty on port 0 try number 1 ...
   [junit4]   2> 289165 INFO  (closeThreadPool-2794-thread-2) [    ] o.e.j.s.Server jetty-9.4.14.v20181114; built: 2018-11-14T21:20:31.478Z; git: c4550056e785fb5665914545889f21dc136ad9e6; jvm 11.0.1+13-LTS
   [junit4]   2> 289209 INFO  (closeThreadPool-2794-thread-2) [    ] o.e.j.s.session DefaultSessionIdManager workerName=node0
   [junit4]   2> 289209 INFO  (closeThreadPool-2794-thread-2) [    ] o.e.j.s.session No SessionScavenger set, using defaults
   [junit4]   2> 289209 INFO  (closeThreadPool-2794-thread-2) [    ] o.e.j.s.session node0 Scavenging every 660000ms
   [junit4]   2> 289212 INFO  (closeThreadPool-2794-thread-2) [    ] o.e.j.s.h.ContextHandler Started o.e.j.s.ServletContextHandler@688a42b5{/xv_,null,AVAILABLE}
   [junit4]   2> 289212 INFO  (closeThreadPool-2794-thread-2) [    ] o.e.j.s.AbstractConnector Started ServerConnector@79bee639{HTTP/1.1,[http/1.1, h2c]}{127.0.0.1:43657}
   [junit4]   2> 289213 INFO  (closeThreadPool-2794-thread-2) [    ] o.e.j.s.Server Started @289264ms
   [junit4]   2> 289213 INFO  (closeThreadPool-2794-thread-2) [    ] o.a.s.c.s.e.JettySolrRunner Jetty properties: {hostContext=/xv_, solrconfig=solrconfig.xml, solr.data.dir=/home/jenkins/jenkins-slave/workspace/Lucene-Solr-BadApples-Tests-master/solr/build/solr-core/test/J0/temp/solr.cloud.UnloadDistributedZkTest_C3BF86D591BE0B10-001/tempDir-001/jetty2, hostPort=43657, coreRootDirectory=/home/jenkins/jenkins-slave/workspace/Lucene-Solr-BadApples-Tests-master/solr/build/solr-core/test/J0/temp/solr.cloud.UnloadDistributedZkTest_C3BF86D591BE0B10-001/shard-2-001/cores}
   [junit4]   2> 289213 ERROR (closeThreadPool-2794-thread-2) [    ] o.a.s.u.StartupLoggingUtils Missing Java Option solr.log.dir. Logging may be missing or incomplete.
   [junit4]   2> 289213 INFO  (closeThreadPool-2794-thread-2) [    ] o.a.s.s.SolrDispatchFilter Using logger factory org.apache.logging.slf4j.Log4jLoggerFactory
   [junit4]   2> 289213 INFO  (closeThreadPool-2794-thread-2) [    ] o.a.s.s.SolrDispatchFilter  ___      _       Welcome to Apache Solr? version 9.0.0
   [junit4]   2> 289214 INFO  (closeThreadPool-2794-thread-2) [    ] o.a.s.s.SolrDispatchFilter / __| ___| |_ _   Starting in cloud mode on port null
   [junit4]   2> 289214 INFO  (closeThreadPool-2794-thread-2) [    ] o.a.s.s.SolrDispatchFilter \__ \/ _ \ | '_|  Install dir: null
   [junit4]   2> 289214 INFO  (closeThreadPool-2794-thread-2) [    ] o.a.s.s.SolrDispatchFilter |___/\___/_|_|    Start time: 2019-04-16T19:35:32.473077Z
   [junit4]   2> 289231 INFO  (zkConnectionManagerCallback-2799-thread-1) [    ] o.a.s.c.c.ConnectionManager zkClient has connected
   [junit4]   2> 289232 INFO  (closeThreadPool-2794-thread-2) [    ] o.a.s.s.SolrDispatchFilter Loading solr.xml from SolrHome (not found in ZooKeeper)
   [junit4]   2> 289232 INFO  (closeThreadPool-2794-thread-2) [    ] o.a.s.c.SolrXmlConfig Loading container configuration from /home/jenkins/jenkins-slave/workspace/Lucene-Solr-BadApples-Tests-master/solr/build/solr-core/test/J0/temp/solr.cloud.UnloadDistributedZkTest_C3BF86D591BE0B10-001/shard-2-001/solr.xml
   [junit4]   2> 289235 INFO  (closeThreadPool-2794-thread-2) [    ] o.a.s.c.SolrXmlConfig Configuration parameter autoReplicaFailoverWorkLoopDelay is ignored
   [junit4]   2> 289235 INFO  (closeThreadPool-2794-thread-2) [    ] o.a.s.c.SolrXmlConfig Configuration parameter autoReplicaFailoverBadNodeExpiration is ignored
   [junit4]   2> 289237 INFO  (closeThreadPool-2794-thread-2) [    ] o.a.s.c.SolrXmlConfig MBean server found: com.sun.jmx.mbeanserver.JmxMBeanServer@7ccb36e6, but no JMX reporters were configured - adding default JMX reporter.
   [junit4]   2> 289366 INFO  (closeThreadPool-2794-thread-1) [    ] o.a.s.h.c.HttpShardHandlerFactory Host whitelist initialized: WhitelistHostChecker [whitelistHosts=null, whitelistHostCheckingEnabled=false]
   [junit4]   2> 289376 WARN  (closeThreadPool-2794-thread-1) [    ] o.e.j.u.s.S.config No Client EndPointIdentificationAlgorithm configured for SslContextFactory@1d186649[provider=null,keyStore=null,trustStore=null]
   [junit4]   2> 289446 INFO  (closeThreadPool-2794-thread-2) [    ] o.a.s.h.c.HttpShardHandlerFactory Host whitelist initialized: WhitelistHostChecker [whitelistHosts=null, whitelistHostCheckingEnabled=false]
   [junit4]   2> 289447 WARN  (closeThreadPool-2794-thread-1) [    ] o.e.j.u.s.S.config No Client EndPointIdentificationAlgorithm configured for SslContextFactory@50eb1cc3[provider=null,keyStore=null,trustStore=null]
   [junit4]   2> 289452 INFO  (closeThreadPool-2794-thread-1) [    ] o.a.s.c.ZkContainer Zookeeper client=127.0.0.1:45366/solr
   [junit4]   2> 289464 WARN  (closeThreadPool-2794-thread-2) [    ] o.e.j.u.s.S.config No Client EndPointIdentificationAlgorithm configured for SslContextFactory@797e0e7c[provider=null,keyStore=null,trustStore=null]
   [junit4]   2> 289497 WARN  (closeThreadPool-2794-thread-2) [    ] o.e.j.u.s.S.config No Client EndPointIdentificationAlgorithm configured for SslContextFactory@30d7d87d[provider=null,keyStore=null,trustStore=null]
   [junit4]   2> 289498 INFO  (closeThreadPool-2794-thread-2) [    ] o.a.s.c.ZkContainer Zookeeper client=127.0.0.1:45366/solr
   [junit4]   2> 289498 INFO  (zkConnectionManagerCallback-2807-thread-1) [    ] o.a.s.c.c.ConnectionManager zkClient has connected
   [junit4]   2> 289501 WARN  (NIOServerCxn.Factory:0.0.0.0/0.0.0.0:0) [    ] o.a.z.s.NIOServerCnxn Unable to read additional data from client sessionid 0x108cbe82e09000a, likely client has closed socket
   [junit4]   2> 289538 INFO  (zkConnectionManagerCallback-2812-thread-1) [    ] o.a.s.c.c.ConnectionManager zkClient has connected
   [junit4]   2> 289544 INFO  (zkConnectionManagerCallback-2814-thread-1) [    ] o.a.s.c.c.ConnectionManager zkClient has connected
   [junit4]   2> 289549 INFO  (closeThreadPool-2794-thread-1) [n:127.0.0.1:41317_xv_    ] o.a.s.c.c.ZkStateReader Updated live nodes from ZooKeeper... (0) -> (1)
   [junit4]   2> 289553 INFO  (closeThreadPool-2794-thread-1) [n:127.0.0.1:41317_xv_    ] o.a.s.c.ZkController Publish node=127.0.0.1:41317_xv_ as DOWN
   [junit4]   2> 289555 INFO  (closeThreadPool-2794-thread-1) [n:127.0.0.1:41317_xv_    ] o.a.s.c.TransientSolrCoreCacheDefault Allocating transient cache for 4 transient cores
   [junit4]   2> 289555 INFO  (closeThreadPool-2794-thread-1) [n:127.0.0.1:41317_xv_    ] o.a.s.c.ZkController Register node as live in ZooKeeper:/live_nodes/127.0.0.1:41317_xv_
   [junit4]   2> 289556 INFO  (zkCallback-2792-thread-1) [    ] o.a.s.c.c.ZkStateReader Updated live nodes from ZooKeeper... (1) -> (2)
   [junit4]   2> 289556 INFO  (zkCallback-2780-thread-1) [    ] o.a.s.c.c.ZkStateReader Updated live nodes from ZooKeeper... (1) -> (2)
   [junit4]   2> 289556 INFO  (zkCallback-2773-thread-3) [    ] o.a.s.c.c.ZkStateReader Updated live nodes from ZooKeeper... (1) -> (2)
   [junit4]   2> 289566 INFO  (TEST-UnloadDistributedZkTest.test-seed#[C3BF86D591BE0B10]) [    ] o.a.s.c.AbstractFullDistribZkTestBase create jetty 3 in directory /home/jenkins/jenkins-slave/workspace/Lucene-Solr-BadApples-Tests-master/solr/build/solr-core/test/J0/temp/solr.cloud.UnloadDistributedZkTest_C3BF86D591BE0B10-001/shard-3-001 of type NRT
   [junit4]   2> 289567 INFO  (zkConnectionManagerCallback-2816-thread-1) [    ] o.a.s.c.c.ConnectionManager zkClient has connected
   [junit4]   2> 289572 INFO  (zkCallback-2813-thread-1) [    ] o.a.s.c.c.ZkStateReader Updated live nodes from ZooKeeper... (1) -> (2)
   [junit4]   2> 289572 INFO  (closeThreadPool-2794-thread-2) [n:127.0.0.1:43657_xv_    ] o.a.s.c.c.ZkStateReader Updated live nodes from ZooKeeper... (0) -> (2)
   [junit4]   2> 289576 INFO  (closeThreadPool-2794-thread-2) [n:127.0.0.1:43657_xv_    ] o.a.s.c.ZkController Publish node=127.0.0.1:43657_xv_ as DOWN
   [junit4]   2> 289577 INFO  (closeThreadPool-2794-thread-2) [n:127.0.0.1:43657_xv_    ] o.a.s.c.TransientSolrCoreCacheDefault Allocating transient cache for 4 transient cores
   [junit4]   2> 289577 INFO  (closeThreadPool-2794-thread-2) [n:127.0.0.1:43657_xv_    ] o.a.s.c.ZkController Register node as live in ZooKeeper:/live_nodes/127.0.0.1:43657_xv_
   [junit4]   2> 289578 INFO  (zkCallback-2792-thread-1) [    ] o.a.s.c.c.ZkStateReader Updated live nodes from ZooKeeper... (2) -> (3)
   [junit4]   2> 289579 INFO  (zkCallback-2773-thread-3) [    ] o.a.s.c.c.ZkStateReader Updated live nodes from ZooKeeper... (2) -> (3)
   [junit4]   2> 289579 INFO  (zkCallback-2780-thread-1) [    ] o.a.s.c.c.ZkStateReader Updated live nodes from ZooKeeper... (2) -> (3)
   [junit4]   2> 289579 INFO  (zkCallback-2813-thread-1) [    ] o.a.s.c.c.ZkStateReader Updated live nodes from ZooKeeper... (2) -> (3)
   [junit4]   2> 289600 WARN  (closeThreadPool-2794-thread-3) [    ] o.e.j.s.AbstractConnector Ignoring deprecated socket close linger time
   [junit4]   2> 289600 INFO  (closeThreadPool-2794-thread-3) [    ] o.a.s.c.s.e.JettySolrRunner Start Jetty (original configured port=0)
   [junit4]   2> 289600 INFO  (closeThreadPool-2794-thread-3) [    ] o.a.s.c.s.e.JettySolrRunner Trying to start Jetty on port 0 try number 1 ...
   [junit4]   2> 289600 INFO  (closeThreadPool-2794-thread-3) [    ] o.e.j.s.Server jetty-9.4.14.v20181114; built: 2018-11-14T21:20:31.478Z; git: c4550056e785fb5665914545889f21dc136ad9e6; jvm 11.0.1+13-LTS
   [junit4]   2> 289601 INFO  (zkCallback-2815-thread-1) [    ] o.a.s.c.c.ZkStateReader Updated live nodes from ZooKeeper... (2) -> (3)
   [junit4]   2> 289656 INFO  (zkConnectionManagerCallback-2825-thread-1) [    ] o.a.s.c.c.ConnectionManager zkClient has connected
   [junit4]   2> 289657 INFO  (closeThreadPool-2794-thread-1) [n:127.0.0.1:41317_xv_    ] o.a.s.c.c.ZkStateReader Updated live nodes from ZooKeeper... (0) -> (3)
   [junit4]   2> 289659 INFO  (closeThreadPool-2794-thread-1) [n:127.0.0.1:41317_xv_    ] o.a.s.c.s.i.ZkClientClusterStateProvider Cluster at 127.0.0.1:45366/solr ready
   [junit4]   2> 289668 INFO  (zkConnectionManagerCallback-2830-thread-1) [    ] o.a.s.c.c.ConnectionManager zkClient has connected
   [junit4]   2> 289669 INFO  (closeThreadPool-2794-thread-2) [n:127.0.0.1:43657_xv_    ] o.a.s.c.c.ZkStateReader Updated live nodes from ZooKeeper... (0) -> (3)
   [junit4]   2> 289671 INFO  (closeThreadPool-2794-thread-2) [n:127.0.0.1:43657_xv_    ] o.a.s.c.s.i.ZkClientClusterStateProvider Cluster at 127.0.0.1:45366/solr ready
   [junit4]   2> 289728 INFO  (closeThreadPool-2794-thread-2) [n:127.0.0.1:43657_xv_    ] o.a.s.h.a.MetricsHistoryHandler No .system collection, keeping metrics history in memory.
   [junit4]   2> 289755 INFO  (closeThreadPool-2794-thread-2) [n:127.0.0.1:43657_xv_    ] o.a.s.m.r.SolrJmxReporter JMX monitoring for 'solr.node' (registry 'solr.node') enabled at server: com.sun.jmx.mbeanserver.JmxMBeanServer@7ccb36e6
   [junit4]   2> 289761 INFO  (closeThreadPool-2794-thread-1) [n:127.0.0.1:41317_xv_    ] o.a.s.h.a.MetricsHistoryHandler No .system collection, keeping metrics history in memory.
   [junit4]   2> 289778 INFO  (closeThreadPool-2794-thread-3) [    ] o.e.j.s.session DefaultSessionIdManager workerName=node0
   [junit4]   2> 289778 INFO  (closeThreadPool-2794-thread-3) [    ] o.e.j.s.session No SessionScavenger set, using defaults
   [junit4]   2> 289778 INFO  (closeThreadPool-2794-thread-3) [    ] o.e.j.s.session node0 Scavenging every 600000ms
   [junit4]   2> 289784 INFO  (closeThreadPool-2794-thread-3) [    ] o.e.j.s.h.ContextHandler Started o.e.j.s.ServletContextHandler@5124cf2{/xv_,null,AVAILABLE}
   [junit4]   2> 289785 INFO  (closeThreadPool-2794-thread-3) [    ] o.e.j.s.AbstractConnector Started ServerConnector@6ea1e914{HTTP/1.1,[http/1.1, h2c]}{127.0.0.1:38129}
   [junit4]   2> 289785 INFO  (closeThreadPool-2794-thread-3) [    ] o.e.j.s.Server Started @289836ms
   [junit4]   2> 289785 INFO  (closeThreadPool-2794-thread-3) [    ] o.a.s.c.s.e.JettySolrRunner Jetty properties: {hostContext=/xv_, solrconfig=solrconfig.xml, solr.data.dir=/home/jenkins/jenkins-slave/workspace/Lucene-Solr-BadApples-Tests-master/solr/build/solr-core/test/J0/temp/solr.cloud.UnloadDistributedZkTest_C3BF86D591BE0B10-001/tempDir-001/jetty3, hostPort=38129, coreRootDirectory=/home/jenkins/jenkins-slave/workspace/Lucene-Solr-BadApples-Tests-master/solr/build/solr-core/test/J0/temp/solr.cloud.UnloadDistributedZkTest_C3BF86D591BE0B10-001/shard-3-001/cores}
   [junit4]   2> 289786 ERROR (closeThreadPool-2794-thread-3) [    ] o.a.s.u.StartupLoggingUtils Missing Java Option solr.log.dir. Logging may be missing or incomplete.
   [junit4]   2> 289786 INFO  (closeThreadPool-2794-thread-3) [    ] o.a.s.s.SolrDispatchFilter Using logger factory org.apache.logging.slf4j.Log4jLoggerFactory
   [junit4]   2> 289786 INFO  (closeThreadPool-2794-thread-3) [    ] o.a.s.s.SolrDispatchFilter  ___      _       Welcome to Apache Solr? version 9.0.0
   [junit4]   2> 289786 INFO  (closeThreadPool-2794-thread-3) [    ] o.a.s.s.SolrDispatchFilter / __| ___| |_ _   Starting in cloud mode on port null
   [junit4]   2> 289786 INFO  (closeThreadPool-2794-thread-3) [    ] o.a.s.s.SolrDispatchFilter \__ \/ _ \ | '_|  Install dir: null
   [junit4]   2> 289786 INFO  (closeThreadPool-2794-thread-3) [    ] o.a.s.s.SolrDispatchFilter |___/\___/_|_|    Start time: 2019-04-16T19:35:33.045356Z
   [junit4]   2> 289797 INFO  (closeThreadPool-2794-thread-1) [n:127.0.0.1:41317_xv_    ] o.a.s.m.r.SolrJmxReporter JMX monitoring for 'solr.node' (registry 'solr.node') enabled at server: com.sun.jmx.mbeanserver.JmxMBeanServer@7ccb36e6
   [junit4]   2> 289798 INFO  (closeThreadPool-2794-thread-2) [n:127.0.0.1:43657_xv_    ] o.a.s.m.r.SolrJmxReporter JMX monitoring for 'solr.jvm' (registry 'solr.jvm') enabled at server: com.sun.jmx.mbeanserver.JmxMBeanServer@7ccb36e6
   [junit4]   2> 289800 INFO  (zkConnectionManagerCallback-2834-thread-1) [    ] o.a.s.c.c.ConnectionManager zkClient has connected
   [junit4]   2> 289800 INFO  (closeThreadPool-2794-thread-2) [n:127.0.0.1:43657_xv_    ] o.a.s.m.r.SolrJmxReporter JMX monitoring for 'solr.jetty' (registry 'solr.jetty') enabled at server: com.sun.jmx.mbeanserver.JmxMBeanServer@7ccb36e6
   [junit4]   2> 289801 INFO  (closeThreadPool-2794-thread-3) [    ] o.a.s.s.SolrDispatchFilter Loading solr.xml from SolrHome (not found in ZooKeeper)
   [junit4]   2> 289801 INFO  (closeThreadPool-2794-thread-3) [    ] o.a.s.c.SolrXmlConfig Loading container configuration from /home/jenkins/jenkins-slave/workspace/Lucene-Solr-BadApples-Tests-master/solr/build/solr-core/test/J0/temp/solr.cloud.UnloadDistributedZkTest_C3BF86D591BE0B10-001/shard-3-001/solr.xml
   [junit4]   2> 289804 INFO  (closeThreadPool-2794-thread-3) [    ] o.a.s.c.SolrXmlConfig Configuration parameter autoReplicaFailoverWorkLoopDelay is ignored
   [junit4]   2> 289804 INFO  (closeThreadPool-2794-thread-3) [    ] o.a.s.c.SolrXmlConfig Configuration parameter autoReplicaFailoverBadNodeExpiration is ignored
   [junit4]   2> 289844 INFO  (closeThreadPool-2794-thread-2) [n:127.0.0.1:43657_xv_    ] o.a.s.c.CorePropertiesLocator Found 0 core definitions underneath /home/jenkins/jenkins-slave/workspace/Lucene-Solr-BadApples-Tests-master/solr/build/solr-core/test/J0/temp/solr.cloud.UnloadDistributedZkTest_C3BF86D591BE0B10-001/shard-2-001/cores
   [junit4]   2> 289845 INFO  (closeThreadPool-2794-thread-3) [    ] o.a.s.c.SolrXmlConfig MBean server found: com.sun.jmx.mbeanserver.JmxMBeanServer@7ccb36e6, but no JMX reporters were configured - adding default JMX reporter.
   [junit4]   2> 289880 INFO  (TEST-UnloadDistributedZkTest.test-seed#[C3BF86D591BE0B10]) [    ] o.a.s.c.AbstractFullDistribZkTestBase create jetty 4 in directory /home/jenkins/jenkins-slave/workspace/Lucene-Solr-BadApples-Tests-master/solr/build/solr-core/test/J0/temp/solr.cloud.UnloadDistributedZkTest_C3BF86D591BE0B10-001/shard-4-001 of type NRT
   [junit4]   2> 289880 WARN  (closeThreadPool-2794-thread-4) [    ] o.e.j.s.AbstractConnector Ignoring deprecated socket close linger time
   [junit4]   2> 289881 INFO  (closeThreadPool-2794-thread-4) [    ] o.a.s.c.s.e.JettySolrRunner Start Jetty (original configured port=0)
   [junit4]   2> 289881 INFO  (closeThreadPool-2794-thread-4) [    ] o.a.s.c.s.e.JettySolrRunner Trying to start Jetty on port 0 try number 1 ...
   [junit4]   2> 289881 INFO  (closeThreadPool-2794-thread-4) [    ] o.e.j.s.Server jetty-9.4.14.v20181114; built: 2018-11-14T21:20:31.478Z; git: c4550056e785fb5665914545889f21dc136ad9e6; jvm 11.0.1+13-LTS
   [junit4]   2> 289885 INFO  (closeThreadPool-2794-thread-1) [n:127.0.0.1:41317_xv_    ] o.a.s.m.r.SolrJmxReporter JMX monitoring for 'solr.jvm' (registry 'solr.jvm') enabled at server: com.sun.jmx.mbeanserver.JmxMBeanServer@7ccb36e6
   [junit4]   2> 289885 INFO  (closeThreadPool-2794-thread-1) [n:127.0.0.1:41317_xv_    ] o.a.s.m.r.SolrJmxReporter JMX monitoring for 'solr.jetty' (registry 'solr.jetty') enabled at server: com.sun.jmx.mbeanserver.JmxMBeanServer@7ccb36e6
   [junit4]   2> 289887 INFO  (closeThreadPool-2794-thread-1) [n:127.0.0.1:41317_xv_    ] o.a.s.c.CorePropertiesLocator Found 0 core definitions underneath /home/jenkins/jenkins-slave/workspace/Lucene-Solr-BadApples-Tests-master/solr/build/solr-core/test/J0/temp/solr.cloud.UnloadDistributedZkTest_C3BF86D591BE0B10-001/shard-1-001/cores
   [junit4]   2> 289889 INFO  (closeThreadPool-2794-thread-4) [    ] o.e.j.s.session DefaultSessionIdManager workerName=node0
   [junit4]   2> 289889 INFO  (closeThreadPool-2794-thread-4) [    ] o.e.j.s.session No SessionScavenger set, using defaults
   [junit4]   2> 289889 INFO  (closeThreadPool-2794-thread-4) [    ] o.e.j.s.session node0 Scavenging every 660000ms
   [junit4]   2> 289890 INFO  (closeThreadPool-2794-thread-4) [    ] o.e.j.s.h.ContextHandler Started o.e.j.s.ServletContextHandler@658a7c32{/xv_,null,AVAILABLE}
   [junit4]   2> 289890 INFO  (closeThreadPool-2794-thread-4) [    ] o.e.j.s.AbstractConnector Started ServerConnector@7a4a5d59{HTTP/1.1,[http/1.1, h2c]}{127.0.0.1:44005}
   [junit4]   2> 289890 INFO  (closeThreadPool-2794-thread-4) [    ] o.e.j.s.Server Started @289942ms
   [junit4]   2> 289890 INFO  (closeThreadPool-2794-thread-4) [    ] o.a.s.c.s.e.JettySolrRunner Jetty properties: {hostContext=/xv_, solrconfig=solrconfig.xml, solr.data.dir=/home/jenkins/jenkins-slave/workspace/Lucene-Solr-BadApples-Tests-master/solr/build/solr-core/test/J0/temp/solr.cloud.UnloadDistributedZkTest_C3BF86D591BE0B10-001/tempDir-001/jetty4, hostPort=44005, coreRootDirectory=/home/jenkins/jenkins-slave/workspace/Lucene-Solr-BadApples-Tests-master/solr/build/solr-core/test/J0/temp/solr.cloud.UnloadDistributedZkTest_C3BF86D591BE0B10-001/shard-4-001/cores}
   [junit4]   2> 289891 ERROR (closeThreadPool-2794-thread-4) [    ] o.a.s.u.StartupLoggingUtils Missing Java Option solr.log.dir. Logging may be missing or incomplete.
   [junit4]   2> 289891 INFO  (closeThreadPool-2794-thread-4) [    ] o.a.s.s.SolrDispatchFilter Using logger factory org.apache.logging.slf4j.Log4jLoggerFactory
   [junit4]   2> 289891 INFO  (closeThreadPool-2794-thread-4) [    ] o.a.s.s.SolrDispatchFilter  ___      _       Welcome to Apache Solr? version 9.0.0
   [junit4]   2> 289891 INFO  (closeThreadPool-2794-thread-4) [    ] o.a.s.s.SolrDispatchFilter / __| ___| |_ _   Starting in cloud mode on port null
   [junit4]   2> 289891 INFO  (closeThreadPool-2794-thread-4) [    ] o.a.s.s.SolrDispatchFilter \__ \/ _ \ | '_|  Install dir: null
   [junit4]   2> 289891 INFO  (closeThreadPool-2794-thread-4) [    ] o.a.s.s.SolrDispatchFilter |___/\___/_|_|    Start time: 2019-04-16T19:35:33.150265Z
   [junit4]   2> 289893 INFO  (zkConnectionManagerCallback-2837-thread-1) [    ] o.a.s.c.c.ConnectionManager zkClient has connected
   [junit4]   2> 289894 INFO  (closeThreadPool-2794-thread-4) [    ] o.a.s.s.SolrDispatchFilter Loading solr.xml from SolrHome (not found in ZooKeeper)
   [junit4]   2> 289894 INFO  (closeThreadPool-2794-thread-4) [    ] o.a.s.c.SolrXmlConfig Loading container configuration from /home/jenkins/jenkins-slave/workspace/Lucene-Solr-BadApples-Tests-master/solr/build/solr-core/test/J0/temp/solr.cloud.UnloadDistributedZkTest_C3BF86D591BE0B10-001/shard-4-001/solr.xml
   [junit4]   2> 289897 INFO  (closeThreadPool-2794-thread-4) [    ] o.a.s.c.SolrXmlConfig Configuration parameter autoReplicaFailoverWorkLoopDelay is ignored
   [junit4]   2> 289897 INFO  (closeThreadPool-2794-thread-4) [    ] o.a.s.c.SolrXmlConfig Configuration parameter autoReplicaFailoverBadNodeExpiration is ignored
   [junit4]   2> 289898 INFO  (closeThreadPool-2794-thread-4) [    ] o.a.s.c.SolrXmlConfig MBean server found: com.sun.jmx.mbeanserver.JmxMBeanServer@7ccb36e6, but no JMX reporters were configured - adding default JMX reporter.
   [junit4]   2> 290057 INFO  (closeThreadPool-2794-thread-4) [    ] o.a.s.h.c.HttpShardHandlerFactory Host whitelist initialized: WhitelistHostChecker [whitelistHosts=null, whitelistHostCheckingEnabled=false]
   [junit4]   2> 290069 WARN  (closeThreadPool-2794-thread-4) [    ] o.e.j.u.s.S.config No Client EndPointIdentificationAlgorithm configured for SslContextFactory@3399ac6b[provider=null,keyStore=null,trustStore=null]
   [junit4]   2> 290103 WARN  (closeThreadPool-2794-thread-4) [    ] o.e.j.u.s.S.config No Client EndPointIdentificationAlgorithm configured for SslContextFactory@11691c9f[provider=null,keyStore=null,trustStore=null]
   [junit4]   2> 290105 INFO  (closeThreadPool-2794-thread-4) [    ] o.a.s.c.ZkContainer Zookeeper client=127.0.0.1:45366/solr
   [junit4]   2> 290140 INFO  (zkConnectionManagerCallback-2844-thread-1) [    ] o.a.s.c.c.ConnectionManager zkClient has connected
   [junit4]   2> 290164 INFO  (zkConnectionManagerCallback-2846-thread-1) [    ] o.a.s.c.c.ConnectionManager zkClient has connected
   [junit4]   2> 290169 INFO  (closeThreadPool-2794-thread-4) [n:127.0.0.1:44005_xv_    ] o.a.s.c.c.ZkStateReader Updated live nodes from ZooKeeper... (0) -> (3)
   [junit4]   2> 290173 INFO  (closeThreadPool-2794-thread-4) [n:127.0.0.1:44005_xv_    ] o.a.s.c.ZkController Publish node=127.0.0.1:44005_xv_ as DOWN
   [junit4]   2> 290174 INFO  (closeThreadPool-2794-thread-4) [n:127.0.0.1:44005_xv_    ] o.a.s.c.TransientSolrCoreCacheDefault Allocating transient cache for 4 transient cores
   [junit4]   2> 290174 INFO  (closeThreadPool-2794-thread-4) [n:127.0.0.1:44005_xv_    ] o.a.s.c.ZkController Register node as live in ZooKeeper:/live_nodes/127.0.0.1:44005_xv_
   [junit4]   2> 290176 INFO  (zkCallback-2780-thread-1) [    ] o.a.s.c.c.ZkStateReader Updated live nodes from ZooKeeper... (3) -> (4)
   [junit4]   2> 290176 INFO  (zkCallback-2792-thread-1) [    ] o.a.s.c.c.ZkStateReader Updated live nodes from ZooKeeper... (3) -> (4)
   [junit4]   2> 290176 INFO  (zkCallback-2815-thread-1) [    ] o.a.s.c.c.ZkStateReader Updated live nodes from ZooKeeper... (3) -> (4)
   [junit4]   2> 290176 INFO  (zkCallback-2813-thread-1) [    ] o.a.s.c.c.ZkStateReader Updated live nodes from ZooKeeper... (3) -> (4)
   [junit4]   2> 290176 INFO  (zkCallback-2773-thread-3) [    ] o.a.s.c.c.ZkStateReader Updated live nodes from ZooKeeper... (3) -> (4)
   [junit4]   2> 290190 INFO  (zkCallback-2829-thread-1) [    ] o.a.s.c.c.ZkStateReader Updated live nodes from ZooKeeper... (3) -> (4)
   [junit4]   2> 290200 INFO  (zkCallback-2824-thread-1) [    ] o.a.s.c.c.ZkStateReader Updated live nodes from ZooKeeper... (3) -> (4)
   [junit4]   2> 290200 INFO  (zkCallback-2845-thread-1) [    ] o.a.s.c.c.ZkStateReader Updated live nodes from ZooKeeper... (3) -> (4)
   [junit4]   2> 290224 INFO  (zkConnectionManagerCallback-2853-thread-1) [    ] o.a.s.c.c.ConnectionManager zkClient has connected
   [junit4]   2> 290225 INFO  (closeThreadPool-2794-thread-4) [n:127.0.0.1:44005_xv_    ] o.a.s.c.c.ZkStateReader Updated live nodes from ZooKeeper... (0) -> (4)
   [junit4]   2> 290226 INFO  (closeThreadPool-2794-thread-4) [n:127.0.0.1:44005_xv_    ] o.a.s.c.s.i.ZkClientClusterStateProvider Cluster at 127.0.0.1:45366/solr ready
   [junit4]   2> 290227 INFO  (closeThreadPool-2794-thread-4) [n:127.0.0.1:44005_xv_    ] o.a.s.h.a.MetricsHistoryHandler No .system collection, keeping metrics history in memory.
   [junit4]   2> 290234 INFO  (closeThreadPool-2794-thread-3) [    ] o.a.s.h.c.HttpShardHandlerFactory Host whitelist initialized: WhitelistHostChecker [whitelistHosts=null, whitelistHostCheckingEnabled=false]
   [junit4]   2> 290235 WARN  (closeThreadPool-2794-thread-3) [    ] o.e.j.u.s.S.config No Client EndPointIdentificationAlgorithm configured for SslContextFactory@d6deae8[provider=null,keyStore=null,trustStore=null]
   [junit4]   2> 290245 INFO  (closeThreadPool-2794-thread-4) [n:127.0.0.1:44005_xv_    ] o.a.s.m.r.SolrJmxReporter JMX monitoring for 'solr.node' (registry 'solr.node') enabled at server: com.sun.jmx.mbeanserver.JmxMBeanServer@7ccb36e6
   [junit4]   2> 290254 INFO  (closeThreadPool-2794-thread-4) [n:127.0.0.1:44005_xv_    ] o.a.s.m.r.SolrJmxReporter JMX monitoring for 'solr.jvm' (registry 'solr.jvm') enabled at server: com.sun.jmx.mbeanserver.JmxMBeanServer@7ccb36e6
   [junit4]   2> 290254 INFO  (closeThreadPool-2794-thread-4) [n:127.0.0.1:44005_xv_    ] o.a.s.m.r.SolrJmxReporter JMX monitoring for 'solr.jetty' (registry 'solr.jetty') enabled at server: com.sun.jmx.mbeanserver.JmxMBeanServer@7ccb36e6
   [junit4]   2> 290256 INFO  (closeThreadPool-2794-thread-4) [n:127.0.0.1:44005_xv_    ] o.a.s.c.CorePropertiesLocator Found 0 core definitions underneath /home/jenkins/jenkins-slave/workspace/Lucene-Solr-BadApples-Tests-master/solr/build/solr-core/test/J0/temp/solr.cloud.UnloadDistributedZkTest_C3BF86D591BE0B10-001/shard-4-001/cores
   [junit4]   2> 290284 WARN  (closeThreadPool-2794-thread-3) [    ] o.e.j.u.s.S.config No Client EndPointIdentificationAlgorithm configured for SslContextFactory@1d622306[provider=null,keyStore=null,trustStore=null]
   [junit4]   2> 290285 INFO  (closeThreadPool-2794-thread-3) [    ] o.a.s.c.ZkContainer Zookeeper client=127.0.0.1:45366/solr
   [junit4]   2> 290304 INFO  (zkConnectionManagerCallback-2860-thread-1) [    ] o.a.s.c.c.ConnectionManager zkClient has connected
   [junit4]   2> 290328 INFO  (zkConnectionManagerCallback-2862-thread-1) [    ] o.a.s.c.c.ConnectionManager zkClient has connected
   [junit4]   2> 290335 INFO  (closeThreadPool-2794-thread-3) [n:127.0.0.1:38129_xv_    ] o.a.s.c.c.ZkStateReader Updated live nodes from ZooKeeper... (0) -> (4)
   [junit4]   2> 290348 INFO  (closeThreadPool-2794-thread-3) [n:127.0.0.1:38129_xv_    ] o.a.s.c.ZkController Publish node=127.0.0.1:38129_xv_ as DOWN
   [junit4]   2> 290349 INFO  (closeThreadPool-2794-thread-3) [n:127.0.0.1:38129_xv_    ] o.a.s.c.TransientSolrCoreCacheDefault Allocating transient cache for 4 transient cores
   [junit4]   2> 290349 INFO  (closeThreadPool-2794-thread-3) [n:127.0.0.1:38129_xv_    ] o.a.s.c.ZkController Register node as live in ZooKeeper:/live_nodes/127.0.0.1:38129_xv_
   [junit4]   2> 290351 INFO  (zkCallback-2792-thread-1) [    ] o.a.s.c.c.ZkStateReader Updated live nodes from ZooKeeper... (4) -> (5)
   [junit4]   2> 290351 INFO  (zkCallback-2824-thread-1) [    ] o.a.s.c.c.ZkStateReader Updated live nodes from ZooKeeper... (4) -> (5)
   [junit4]   2> 290351 INFO  (zkCallback-2829-thread-1) [    ] o.a.s.c.c.ZkStateReader Updated live nodes from ZooKeeper... (4) -> (5)
   [junit4]   2> 290351 INFO  (zkCallback-2845-thread-1) [    ] o.a.s.c.c.ZkStateReader Updated live nodes from ZooKeeper... (4) -> (5)
   [junit4]   2> 290351 INFO  (zkCallback-2813-thread-1) [    ] o.a.s.c.c.ZkStateReader Updated live nodes from ZooKeeper... (4) -> (5)
   [junit4]   2> 290351 INFO  (zkCallback-2780-thread-1) [    ] o.a.s.c.c.ZkStateReader Updated live nodes from ZooKeeper... (4) -> (5)
   [junit4]   2> 290351 INFO  (zkCallback-2773-thread-3) [    ] o.a.s.c.c.ZkStateReader Updated live nodes from ZooKeeper... (4) -> (5)
   [junit4]   2> 290351 INFO  (zkCallback-2815-thread-1) [    ] o.a.s.c.c.ZkStateReader Updated live nodes from ZooKeeper... (4) -> (5)
   [junit4]   2> 290353 INFO  (zkCallback-2852-thread-1) [    ] o.a.s.c.c.ZkStateReader Updated live nodes from ZooKeeper... (4) -> (5)
   [junit4]   2> 290380 INFO  (zkCallback-2861-thread-1) [    ] o.a.s.c.c.ZkStateReader Updated live nodes from ZooKeeper... (4) -> (5)
   [junit4]   2> 290392 INFO  (zkConnectionManagerCallback-2869-thread-1) [    ] o.a.s.c.c.ConnectionManager zkClient has connected
   [junit4]   2> 290393 INFO  (closeThreadPool-2794-thread-3) [n:127.0.0.1:38129_xv_    ] o.a.s.c.c.ZkStateReader Updated live nodes from ZooKeeper... (0) -> (5)
   [junit4]   2> 290394 INFO  (closeThreadPool-2794-thread-3) [n:127.0.0.1:38129_xv_    ] o.a.s.c.s.i.ZkClientClusterStateProvider Cluster at 127.0.0.1:45366/solr ready
   [junit4]   2> 290395 INFO  (closeThreadPool-2794-thread-3) [n:127.0.0.1:38129_xv_    ] o.a.s.h.a.MetricsHistoryHandler No .system collection, keeping metrics history in memory.
   [junit4]   2> 290472 INFO  (closeThreadPool-2794-thread-3) [n:127.0.0.1:38129_xv_    ] o.a.s.m.r.SolrJmxReporter JMX monitoring for 'solr.node' (registry 'solr.node') enabled at server: com.sun.jmx.mbeanserver.JmxMBeanServer@7ccb36e6
   [junit4]   2> 290487 INFO  (closeThreadPool-2794-thread-3) [n:127.0.0.1:38129_xv_    ] o.a.s.m.r.SolrJmxReporter JMX monitoring for 'solr.jvm' (registry 'solr.jvm') enabled at server: com.sun.jmx.mbeanserver.JmxMBeanServer@7ccb36e6
   [junit4]   2> 290490 INFO  (closeThreadPool-2794-thread-3) [n:127.0.0.1:38129_xv_    ] o.a.s.m.r.SolrJmxReporter JMX monitoring for 'solr.jetty' (registry 'solr.jetty') enabled at server: com.sun.jmx.mbeanserver.JmxMBeanServer@7ccb36e6
   [junit4]   2> 290491 INFO  (closeThreadPool-2794-thread-3) [n:127.0.0.1:38129_xv_    ] o.a.s.c.CorePropertiesLocator Found 0 core definitions underneath /home/jenkins/jenkins-slave/workspace/Lucene-Solr-BadApples-Tests-master/solr/build/solr-core/test/J0/temp/solr.cloud.UnloadDistributedZkTest_C3BF86D591BE0B10-001/shard-3-001/cores
   [junit4]   2> 290742 INFO  (qtp120097236-5419) [n:127.0.0.1:38129_xv_    ] o.a.s.h.a.CollectionsHandler Invoked Collection Action :addreplica with params node=127.0.0.1:41317_xv_&action=ADDREPLICA&collection=collection1&shard=shard2&type=NRT&wt=javabin&version=2 and sendToOCPQueue=true
   [junit4]   2> 290750 INFO  (qtp120097236-5426) [n:127.0.0.1:38129_xv_    ] o.a.s.h.a.CollectionsHandler Invoked Collection Action :addreplica with params node=127.0.0.1:44005_xv_&action=ADDREPLICA&collection=collection1&shard=shard1&type=NRT&wt=javabin&version=2 and sendToOCPQueue=true
   [junit4]   2> 290751 INFO  (qtp120097236-5423) [n:127.0.0.1:38129_xv_    ] o.a.s.h.a.CollectionsHandler Invoked Collection Action :addreplica with params node=127.0.0.1:38129_xv_&action=ADDREPLICA&collection=collection1&shard=shard2&type=NRT&wt=javabin&version=2 and sendToOCPQueue=true
   [junit4]   2> 290759 INFO  (qtp120097236-5418) [n:127.0.0.1:38129_xv_    ] o.a.s.h.a.CollectionsHandler Invoked Collection Action :addreplica with params node=127.0.0.1:43657_xv_&action=ADDREPLICA&collection=collection1&shard=shard1&type=NRT&wt=javabin&version=2 and sendToOCPQueue=true
   [junit4]   2> 290768 INFO  (OverseerThreadFactory-581-thread-3-processing-n:127.0.0.1:43525_xv_) [n:127.0.0.1:43525_xv_ c:collection1 s:shard2  ] o.a.s.c.a.c.AddReplicaCmd Node Identified 127.0.0.1:41317_xv_ for creating new replica of shard shard2 for collection collection1
   [junit4]   2> 290770 INFO  (OverseerThreadFactory-581-thread-4-processing-n:127.0.0.1:43525_xv_) [n:127.0.0.1:43525_xv_ c:collection1 s:shard1  ] o.a.s.c.a.c.AddReplicaCmd Node Identified 127.0.0.1:44005_xv_ for creating new replica of shard shard1 for collection collection1
   [junit4]   2> 290778 INFO  (OverseerThreadFactory-581-thread-3-processing-n:127.0.0.1:43525_xv_) [n:127.0.0.1:43525_xv_ c:collection1 s:shard2  ] o.a.s.c.a.c.AddReplicaCmd Returning CreateReplica command.
   [junit4]   2> 290779 INFO  (OverseerThreadFactory-581-thread-4-processing-n:127.0.0.1:43525_xv_) [n:127.0.0.1:43525_xv_ c:collection1 s:shard1  ] o.a.s.c.a.c.AddReplicaCmd Returning CreateReplica command.
   [junit4]   2> 290849 INFO  (qtp1389896931-5442) [n:127.0.0.1:44005_xv_    x:collection1_shard1_replica_n2] o.a.s.h.a.CoreAdminOperation core create command qt=/admin/cores&collection.configName=conf1&name=collection1_shard1_replica_n2&action=CREATE&collection=collection1&shard=shard1&wt=javabin&version=2&replicaType=NRT
   [junit4]   2> 290862 INFO  (qtp563420733-5367) [n:127.0.0.1:41317_xv_    x:collection1_shard2_replica_n1] o.a.s.h.a.CoreAdminOperation core create command qt=/admin/cores&collection.configName=conf1&name=collection1_shard2_replica_n1&action=CREATE&collection=collection1&shard=shard2&wt=javabin&version=2&replicaType=NRT
   [junit4]   2> 291893 INFO  (qtp1389896931-5442) [n:127.0.0.1:44005_xv_ c:collection1 s:shard1  x:collection1_shard1_replica_n2] o.a.s.c.SolrConfig Using Lucene MatchVersion: 9.0.0
   [junit4]   2> 291912 INFO  (qtp563420733-5367) [n:127.0.0.1:41317_xv_ c:collection1 s:shard2  x:collection1_shard2_replica_n1] o.a.s.c.SolrConfig Using Lucene MatchVersion: 9.0.0
   [junit4]   2> 291934 INFO  (qtp563420733-5367) [n:127.0.0.1:41317_xv_ c:collection1 s:shard2  x:collection1_shard2_replica_n1] o.a.s.s.IndexSchema [collection1_shard2_replica_n1] Schema name=test
   [junit4]   2> 291936 INFO  (qtp1389896931-5442) [n:127.0.0.1:44005_xv_ c:collection1 s:shard1  x:collection1_shard1_replica_n2] o.a.s.s.IndexSchema [collection1_shard1_replica_n2] Schema name=test
   [junit4]   2> 292146 INFO  (qtp1389896931-5442) [n:127.0.0.1:44005_xv_ c:collection1 s:shard1  x:collection1_shard1_replica_n2] o.a.s.s.IndexSchema Loaded schema test/1.0 with uniqueid field id
   [junit4]   2> 292188 INFO  (qtp1389896931-5442) [n:127.0.0.1:44005_xv_ c:collection1 s:shard1  x:collection1_shard1_replica_n2] o.a.s.c.CoreContainer Creating SolrCore 'collection1_shard1_replica_n2' using configuration from collection collection1, trusted=true
   [junit4]   2> 292189 INFO  (qtp1389896931-5442) [n:127.0.0.1:44005_xv_ c:collection1 s:shard1  x:collection1_shard1_replica_n2] o.a.s.m.r.SolrJmxReporter JMX monitoring for 'solr.core.collection1.shard1.replica_n2' (registry 'solr.core.collection1.shard1.replica_n2') enabled at server: com.sun.jmx.mbeanserver.JmxMBeanServer@7ccb36e6
   [junit4]   2> 292189 INFO  (qtp1389896931-5442) [n:127.0.0.1:44005_xv_ c:collection1 s:shard1  x:collection1_shard1_replica_n2] o.a.s.c.SolrCore [[collection1_shard1_replica_n2] ] Opening new SolrCore at [/home/jenkins/jenkins-slave/workspace/Lucene-Solr-BadApples-Tests-master/solr/build/solr-core/test/J0/temp/solr.cloud.UnloadDistributedZkTest_C3BF86D591BE0B10-001/shard-4-001/cores/collection1_shard1_replica_n2], dataDir=[/home/jenkins/jenkins-slave/workspace/Lucene-Solr-BadApples-Tests-master/solr/build/solr-core/test/J0/temp/solr.cloud.UnloadDistributedZkTest_C3BF86D591BE0B10-001/shard-4-001/cores/collection1_shard1_replica_n2/data/]
   [junit4]   2> 292192 INFO  (qtp1389896931-5442) [n:127.0.0.1:44005_xv_ c:collection1 s:shard1  x:collection1_shard1_replica_n2] o.a.s.u.RandomMergePolicy RandomMergePolicy wrapping class org.apache.lucene.index.TieredMergePolicy: [TieredMergePolicy: maxMergeAtOnce=22, maxMergeAtOnceExplicit=45, maxMergedSegmentMB=73.759765625, floorSegmentMB=1.76171875, forceMergeDeletesPctAllowed=26.90872171721398, segmentsPerTier=23.0, maxCFSSegmentSizeMB=8.796093022207999E12, noCFSRatio=1.0, deletesPctAllowed=42.141480919630695
   [junit4]   2> 292194 WARN  (qtp1389896931-5442) [n:127.0.0.1:44005_xv_ c:collection1 s:shard1  x:collection1_shard1_replica_n2] o.a.s.c.RequestHandlers INVALID paramSet a in requestHandler {type = requestHandler,name = /dump,class = DumpRequestHandler,attributes = {initParams=a, name=/dump, class=DumpRequestHandler},args = {defaults={a=A,b=B}}}
   [junit4]   2> 292222 INFO  (qtp563420733-5367) [n:127.0.0.1:41317_xv_ c:collection1 s:shard2  x:collection1_shard2_replica_n1] o.a.s.s.IndexSchema Loaded schema test/1.0 with uniqueid field id
   [junit4]   2> 292287 INFO  (qtp563420733-5367) [n:127.0.0.1:41317_xv_ c:collection1 s:shard2  x:collection1_shard2_replica_n1] o.a.s.c.CoreContainer Creating SolrCore 'collection1_shard2_replica_n1' using configuration from collection collection1, trusted=true
   [junit4]   2> 292289 INFO  (qtp563420733-5367) [n:127.0.0.1:41317_xv_ c:collection1 s:shard2  x:collection1_shard2_replica_n1] o.a.s.m.r.SolrJmxReporter JMX monitoring for 'solr.core.collection1.shard2.replica_n1' (registry 'solr.core.collection1.shard2.replica_n1') enabled at server: com.sun.jmx.mbeanserver.JmxMBeanServer@7ccb36e6
   [junit4]   2> 292289 INFO  (qtp563420733-5367) [n:127.0.0.1:41317_xv_ c:collection1 s:shard2  x:collection1_shard2_replica_n1] o.a.s.c.SolrCore [[collection1_shard2_replica_n1] ] Opening new SolrCore at [/home/jenkins/jenkins-slave/workspace/Lucene-Solr-BadApples-Tests-master/solr/build/solr-core/test/J0/temp/solr.cloud.UnloadDistributedZkTest_C3BF86D591BE0B10-001/shard-1-001/cores/collection1_shard2_replica_n1], dataDir=[/home/jenkins/jenkins-slave/workspace/Lucene-Solr-BadApples-Tests-master/solr/build/solr-core/test/J0/temp/solr.cloud.UnloadDistributedZkTest_C3BF86D591BE0B10-001/shard-1-001/cores/collection1_shard2_replica_n1/data/]
   [junit4]   2> 292307 INFO  (qtp563420733-5367) [n:127.0.0.1:41317_xv_ c:collection1 s:shard2  x:collection1_shard2_replica_n1] o.a.s.u.RandomMergePolicy RandomMergePolicy wrapping class org.apache.lucene.index.TieredMergePolicy: [TieredMergePolicy: maxMergeAtOnce=22, maxMergeAtOnceExplicit=45, maxMergedSegmentMB=73.759765625, floorSegmentMB=1.76171875, forceMergeDeletesPctAllowed=26.90872171721398, segmentsPerTier=23.0, maxCFSSegmentSizeMB=8.796093022207999E12, noCFSRatio=1.0, deletesPctAllowed=42.141480919630695
   [junit4]   2> 292319 WARN  (qtp563420733-5367) [n:127.0.0.1:41317_xv_ c:collection1 s:shard2  x:collection1_shard2_replica_n1] o.a.s.c.RequestHandlers INVALID paramSet a in requestHandler {type = requestHandler,name = /dump,class = DumpRequestHandler,attributes = {initParams=a, name=/dump, class=DumpRequestHandler},args = {defaults={a=A,b=B}}}
   [junit4]   2> 292348 INFO  (qtp1389896931-5442) [n:127.0.0.1:44005_xv_ c:collection1 s:shard1  x:collection1_shard1_replica_n2] o.a.s.u.UpdateHandler Using UpdateLog implementation: org.apache.solr.update.UpdateLog
   [junit4]   2> 292348 INFO  (qtp1389896931-5442) [n:127.0.0.1:44005_xv_ c:collection1 s:shard1  x:collection1_shard1_replica_n2] o.a.s.u.UpdateLog Initializing UpdateLog: dataDir= defaultSyncLevel=FLUSH numRecordsToKeep=100 maxNumLogsToKeep=10 numVersionBuckets=65536
   [junit4]   2> 292384 INFO  (qtp1389896931-5442) [n:127.0.0.1:44005_xv_ c:collection1 s:shard1  x:collection1_shard1_replica_n2] o.a.s.u.CommitTracker Hard AutoCommit: disabled
   [junit4]   2> 292384 INFO  (qtp1389896931-5442) [n:127.0.0.1:44005_xv_ c:collection1 s:shard1  x:collection1_shard1_replica_n2] o.a.s.u.CommitTracker Soft AutoCommit: disabled
   [junit4]   2> 292385 INFO  (qtp1389896931-5442) [n:127.0.0.1:44005_xv_ c:collection1 s:shard1  x:collection1_shard1_replica_n2] o.a.s.u.RandomMergePolicy RandomMergePolicy wrapping class org.apache.lucene.index.LogByteSizeMergePolicy: [LogByteSizeMergePolicy: minMergeSize=1677721, mergeFactor=34, maxMergeSize=2147483648, maxMergeSizeForForcedMerge=9223372036854775807, calibrateSizeByDeletes=false, maxMergeDocs=2147483647, maxCFSSegmentSizeMB=8.796093022207999E12, noCFSRatio=1.0]
   [junit4]   2> 292386 INFO  (qtp1389896931-5442) [n:127.0.0.1:44005_xv_ c:collecti

[...truncated too long message...]

s.xml

resolve:

ivy-availability-check:
[loadresource] Do not set property disallowed.ivy.jars.list as its length is 0.

-ivy-fail-disallowed-ivy-version:

ivy-fail:

ivy-configure:
[ivy:configure] :: loading settings :: file = /home/jenkins/jenkins-slave/workspace/Lucene-Solr-BadApples-Tests-master/lucene/top-level-ivy-settings.xml

resolve:

ivy-availability-check:
[loadresource] Do not set property disallowed.ivy.jars.list as its length is 0.

-ivy-fail-disallowed-ivy-version:

ivy-fail:

ivy-fail:

ivy-configure:
[ivy:configure] :: loading settings :: file = /home/jenkins/jenkins-slave/workspace/Lucene-Solr-BadApples-Tests-master/lucene/top-level-ivy-settings.xml

resolve:

ivy-availability-check:
[loadresource] Do not set property disallowed.ivy.jars.list as its length is 0.

-ivy-fail-disallowed-ivy-version:

ivy-fail:

ivy-configure:
[ivy:configure] :: loading settings :: file = /home/jenkins/jenkins-slave/workspace/Lucene-Solr-BadApples-Tests-master/lucene/top-level-ivy-settings.xml

resolve:

ivy-availability-check:
[loadresource] Do not set property disallowed.ivy.jars.list as its length is 0.

-ivy-fail-disallowed-ivy-version:

ivy-fail:

ivy-fail:

ivy-configure:
[ivy:configure] :: loading settings :: file = /home/jenkins/jenkins-slave/workspace/Lucene-Solr-BadApples-Tests-master/lucene/top-level-ivy-settings.xml

resolve:

ivy-availability-check:
[loadresource] Do not set property disallowed.ivy.jars.list as its length is 0.

-ivy-fail-disallowed-ivy-version:

ivy-fail:

ivy-fail:

ivy-configure:
[ivy:configure] :: loading settings :: file = /home/jenkins/jenkins-slave/workspace/Lucene-Solr-BadApples-Tests-master/lucene/top-level-ivy-settings.xml

resolve:

ivy-availability-check:
[loadresource] Do not set property disallowed.ivy.jars.list as its length is 0.

-ivy-fail-disallowed-ivy-version:

ivy-fail:

ivy-fail:

ivy-configure:
[ivy:configure] :: loading settings :: file = /home/jenkins/jenkins-slave/workspace/Lucene-Solr-BadApples-Tests-master/lucene/top-level-ivy-settings.xml

resolve:

ivy-availability-check:
[loadresource] Do not set property disallowed.ivy.jars.list as its length is 0.

-ivy-fail-disallowed-ivy-version:

ivy-fail:

ivy-fail:

ivy-configure:
[ivy:configure] :: loading settings :: file = /home/jenkins/jenkins-slave/workspace/Lucene-Solr-BadApples-Tests-master/lucene/top-level-ivy-settings.xml

resolve:

ivy-availability-check:
[loadresource] Do not set property disallowed.ivy.jars.list as its length is 0.

-ivy-fail-disallowed-ivy-version:

ivy-fail:

ivy-fail:

ivy-configure:
[ivy:configure] :: loading settings :: file = /home/jenkins/jenkins-slave/workspace/Lucene-Solr-BadApples-Tests-master/lucene/top-level-ivy-settings.xml

resolve:

ivy-availability-check:
[loadresource] Do not set property disallowed.ivy.jars.list as its length is 0.

-ivy-fail-disallowed-ivy-version:

ivy-fail:

ivy-fail:

ivy-configure:
[ivy:configure] :: loading settings :: file = /home/jenkins/jenkins-slave/workspace/Lucene-Solr-BadApples-Tests-master/lucene/top-level-ivy-settings.xml

resolve:

ivy-availability-check:
[loadresource] Do not set property disallowed.ivy.jars.list as its length is 0.

-ivy-fail-disallowed-ivy-version:

ivy-fail:

ivy-fail:

ivy-configure:
[ivy:configure] :: loading settings :: file = /home/jenkins/jenkins-slave/workspace/Lucene-Solr-BadApples-Tests-master/lucene/top-level-ivy-settings.xml

resolve:

ivy-availability-check:
[loadresource] Do not set property disallowed.ivy.jars.list as its length is 0.

-ivy-fail-disallowed-ivy-version:

ivy-fail:

ivy-fail:

ivy-configure:
[ivy:configure] :: loading settings :: file = /home/jenkins/jenkins-slave/workspace/Lucene-Solr-BadApples-Tests-master/lucene/top-level-ivy-settings.xml

resolve:

ivy-availability-check:
[loadresource] Do not set property disallowed.ivy.jars.list as its length is 0.

-ivy-fail-disallowed-ivy-version:

ivy-fail:

ivy-fail:

ivy-configure:
[ivy:configure] :: loading settings :: file = /home/jenkins/jenkins-slave/workspace/Lucene-Solr-BadApples-Tests-master/lucene/top-level-ivy-settings.xml

resolve:

ivy-availability-check:
[loadresource] Do not set property disallowed.ivy.jars.list as its length is 0.

-ivy-fail-disallowed-ivy-version:

ivy-fail:

ivy-fail:

ivy-configure:
[ivy:configure] :: loading settings :: file = /home/jenkins/jenkins-slave/workspace/Lucene-Solr-BadApples-Tests-master/lucene/top-level-ivy-settings.xml

resolve:

jar-checksums:
    [mkdir] Created dir: /home/jenkins/jenkins-slave/workspace/Lucene-Solr-BadApples-Tests-master/solr/null621726960
     [copy] Copying 240 files to /home/jenkins/jenkins-slave/workspace/Lucene-Solr-BadApples-Tests-master/solr/null621726960
   [delete] Deleting directory /home/jenkins/jenkins-slave/workspace/Lucene-Solr-BadApples-Tests-master/solr/null621726960

check-working-copy:
[ivy:cachepath] :: resolving dependencies :: org.eclipse.jgit#org.eclipse.jgit-caller;working
[ivy:cachepath] 	confs: [default]
[ivy:cachepath] 	found org.eclipse.jgit#org.eclipse.jgit;4.6.0.201612231935-r in public
[ivy:cachepath] 	found com.jcraft#jsch;0.1.53 in public
[ivy:cachepath] 	found com.googlecode.javaewah#JavaEWAH;1.1.6 in public
[ivy:cachepath] 	found org.apache.httpcomponents#httpclient;4.3.6 in public
[ivy:cachepath] 	found org.apache.httpcomponents#httpcore;4.3.3 in public
[ivy:cachepath] 	found commons-logging#commons-logging;1.1.3 in public
[ivy:cachepath] 	found commons-codec#commons-codec;1.6 in public
[ivy:cachepath] 	found org.slf4j#slf4j-api;1.7.2 in public
[ivy:cachepath] :: resolution report :: resolve 67ms :: artifacts dl 1ms
	---------------------------------------------------------------------
	|                  |            modules            ||   artifacts   |
	|       conf       | number| search|dwnlded|evicted|| number|dwnlded|
	---------------------------------------------------------------------
	|      default     |   8   |   0   |   0   |   0   ||   8   |   0   |
	---------------------------------------------------------------------
[wc-checker] Initializing working copy...
[wc-checker] SLF4J: Failed to load class "org.slf4j.impl.StaticLoggerBinder".
[wc-checker] SLF4J: Defaulting to no-operation (NOP) logger implementation
[wc-checker] SLF4J: See http://www.slf4j.org/codes.html#StaticLoggerBinder for further details.
[wc-checker] Checking working copy status...

-jenkins-base:

BUILD SUCCESSFUL
Total time: 256 minutes 34 seconds
Archiving artifacts
java.lang.InterruptedException: no matches found within 10000
	at hudson.FilePath$ValidateAntFileMask.hasMatch(FilePath.java:2847)
	at hudson.FilePath$ValidateAntFileMask.invoke(FilePath.java:2726)
	at hudson.FilePath$ValidateAntFileMask.invoke(FilePath.java:2707)
	at hudson.FilePath$FileCallableWrapper.call(FilePath.java:3086)
Also:   hudson.remoting.Channel$CallSiteStackTrace: Remote call to lucene2
		at hudson.remoting.Channel.attachCallSiteStackTrace(Channel.java:1741)
		at hudson.remoting.UserRequest$ExceptionResponse.retrieve(UserRequest.java:357)
		at hudson.remoting.Channel.call(Channel.java:955)
		at hudson.FilePath.act(FilePath.java:1072)
		at hudson.FilePath.act(FilePath.java:1061)
		at hudson.FilePath.validateAntFileMask(FilePath.java:2705)
		at hudson.tasks.ArtifactArchiver.perform(ArtifactArchiver.java:243)
		at hudson.tasks.BuildStepCompatibilityLayer.perform(BuildStepCompatibilityLayer.java:81)
		at hudson.tasks.BuildStepMonitor$1.perform(BuildStepMonitor.java:20)
		at hudson.model.AbstractBuild$AbstractBuildExecution.perform(AbstractBuild.java:744)
		at hudson.model.AbstractBuild$AbstractBuildExecution.performAllBuildSteps(AbstractBuild.java:690)
		at hudson.model.Build$BuildExecution.post2(Build.java:186)
		at hudson.model.AbstractBuild$AbstractBuildExecution.post(AbstractBuild.java:635)
		at hudson.model.Run.execute(Run.java:1835)
		at hudson.model.FreeStyleBuild.run(FreeStyleBuild.java:43)
		at hudson.model.ResourceController.execute(ResourceController.java:97)
		at hudson.model.Executor.run(Executor.java:429)
Caused: hudson.FilePath$TunneledInterruptedException
	at hudson.FilePath$FileCallableWrapper.call(FilePath.java:3088)
	at hudson.remoting.UserRequest.perform(UserRequest.java:212)
	at hudson.remoting.UserRequest.perform(UserRequest.java:54)
	at hudson.remoting.Request$2.run(Request.java:369)
	at hudson.remoting.InterceptingExecutorService$1.call(InterceptingExecutorService.java:72)
	at java.util.concurrent.FutureTask.run(FutureTask.java:266)
	at java.util.concurrent.ThreadPoolExecutor.runWorker(ThreadPoolExecutor.java:1142)
	at java.util.concurrent.ThreadPoolExecutor$Worker.run(ThreadPoolExecutor.java:617)
	at java.lang.Thread.run(Thread.java:748)
Caused: java.lang.InterruptedException: java.lang.InterruptedException: no matches found within 10000
	at hudson.FilePath.act(FilePath.java:1074)
	at hudson.FilePath.act(FilePath.java:1061)
	at hudson.FilePath.validateAntFileMask(FilePath.java:2705)
	at hudson.tasks.ArtifactArchiver.perform(ArtifactArchiver.java:243)
	at hudson.tasks.BuildStepCompatibilityLayer.perform(BuildStepCompatibilityLayer.java:81)
	at hudson.tasks.BuildStepMonitor$1.perform(BuildStepMonitor.java:20)
	at hudson.model.AbstractBuild$AbstractBuildExecution.perform(AbstractBuild.java:744)
	at hudson.model.AbstractBuild$AbstractBuildExecution.performAllBuildSteps(AbstractBuild.java:690)
	at hudson.model.Build$BuildExecution.post2(Build.java:186)
	at hudson.model.AbstractBuild$AbstractBuildExecution.post(AbstractBuild.java:635)
	at hudson.model.Run.execute(Run.java:1835)
	at hudson.model.FreeStyleBuild.run(FreeStyleBuild.java:43)
	at hudson.model.ResourceController.execute(ResourceController.java:97)
	at hudson.model.Executor.run(Executor.java:429)
No artifacts found that match the file pattern "**/*.events,heapdumps/**,**/hs_err_pid*". Configuration error?
Recording test results
Build step 'Publish JUnit test result report' changed build result to UNSTABLE
Email was triggered for: Unstable (Test Failures)
Sending email for trigger: Unstable (Test Failures)