You are viewing a plain text version of this content. The canonical link for it is here.
Posted to dev@kafka.apache.org by Apache Jenkins Server <je...@builds.apache.org> on 2019/07/25 21:49:37 UTC
Build failed in Jenkins: kafka-trunk-jdk8 #3811
See <https://builds.apache.org/job/kafka-trunk-jdk8/3811/display/redirect?page=changes>
Changes:
[wangguoz] KAFKA-8179: add public ConsumerPartitionAssignor interface (#7108)
------------------------------------------
Started by an SCM change
Started by an SCM change
[EnvInject] - Loading node environment variables.
Building remotely on H44 (ubuntu bionic) in workspace <https://builds.apache.org/job/kafka-trunk-jdk8/ws/>
[WS-CLEANUP] Deleting project workspace...
[WS-CLEANUP] Deferred wipeout is used...
[WS-CLEANUP] Done
No credentials specified
Cloning the remote Git repository
Cloning repository https://github.com/apache/kafka.git
> git init <https://builds.apache.org/job/kafka-trunk-jdk8/ws/> # timeout=10
Fetching upstream changes from https://github.com/apache/kafka.git
> git --version # timeout=10
> git fetch --tags --progress https://github.com/apache/kafka.git +refs/heads/*:refs/remotes/origin/*
> git config remote.origin.url https://github.com/apache/kafka.git # timeout=10
> git config --add remote.origin.fetch +refs/heads/*:refs/remotes/origin/* # timeout=10
> git config remote.origin.url https://github.com/apache/kafka.git # timeout=10
Fetching upstream changes from https://github.com/apache/kafka.git
> git fetch --tags --progress https://github.com/apache/kafka.git +refs/heads/*:refs/remotes/origin/*
> git rev-parse refs/remotes/origin/trunk^{commit} # timeout=10
> git rev-parse refs/remotes/origin/origin/trunk^{commit} # timeout=10
Checking out Revision 69d86a197f86ad4c6f1636b5ab4678907e30a4c0 (refs/remotes/origin/trunk)
> git config core.sparsecheckout # timeout=10
> git checkout -f 69d86a197f86ad4c6f1636b5ab4678907e30a4c0
Commit message: "KAFKA-8179: add public ConsumerPartitionAssignor interface (#7108)"
> git rev-list --no-walk e9c61f690e548fb8c587d777e5c8f71149a38fea # timeout=10
Setting GRADLE_4_8_1_HOME=/home/jenkins/tools/gradle/4.8.1
[kafka-trunk-jdk8] $ /bin/bash -xe /tmp/jenkins1918243911402619654.sh
+ rm -rf <https://builds.apache.org/job/kafka-trunk-jdk8/ws/.gradle>
+ /home/jenkins/tools/gradle/4.8.1/bin/gradle
/tmp/jenkins1918243911402619654.sh: line 4: /home/jenkins/tools/gradle/4.8.1/bin/gradle: No such file or directory
Build step 'Execute shell' marked build as failure
[FINDBUGS] Collecting findbugs analysis files...
Setting GRADLE_4_8_1_HOME=/home/jenkins/tools/gradle/4.8.1
[FINDBUGS] Searching for all files in <https://builds.apache.org/job/kafka-trunk-jdk8/ws/> that match the pattern **/build/reports/*bugs/*.xml
[FINDBUGS] No files found. Configuration error?
Setting GRADLE_4_8_1_HOME=/home/jenkins/tools/gradle/4.8.1
No credentials specified
Setting GRADLE_4_8_1_HOME=/home/jenkins/tools/gradle/4.8.1
<Git Blamer> Using GitBlamer to create author and commit information for all warnings.
<Git Blamer> GIT_COMMIT=69d86a197f86ad4c6f1636b5ab4678907e30a4c0, workspace=<https://builds.apache.org/job/kafka-trunk-jdk8/ws/>
[FINDBUGS] Computing warning deltas based on reference build #3796
Recording test results
Setting GRADLE_4_8_1_HOME=/home/jenkins/tools/gradle/4.8.1
ERROR: Step ?Publish JUnit test result report? failed: No test report files were found. Configuration error?
Setting GRADLE_4_8_1_HOME=/home/jenkins/tools/gradle/4.8.1
Not sending mail to unregistered user noreply@github.com
Not sending mail to unregistered user wangguoz@gmail.com
Not sending mail to unregistered user rajinisivaram@googlemail.com
Jenkins build is back to normal : kafka-trunk-jdk8 #3819
Posted by Apache Jenkins Server <je...@builds.apache.org>.
See <https://builds.apache.org/job/kafka-trunk-jdk8/3819/display/redirect?page=changes>
Build failed in Jenkins: kafka-trunk-jdk8 #3818
Posted by Apache Jenkins Server <je...@builds.apache.org>.
See <https://builds.apache.org/job/kafka-trunk-jdk8/3818/display/redirect>
------------------------------------------
[...truncated 6.46 MB...]
org.apache.kafka.connect.json.JsonConverterTest > structToConnect PASSED
org.apache.kafka.connect.json.JsonConverterTest > stringToJson STARTED
org.apache.kafka.connect.json.JsonConverterTest > stringToJson PASSED
org.apache.kafka.connect.json.JsonConverterTest > nullSchemaAndArrayToJson STARTED
org.apache.kafka.connect.json.JsonConverterTest > nullSchemaAndArrayToJson PASSED
org.apache.kafka.connect.json.JsonConverterTest > byteToConnect STARTED
org.apache.kafka.connect.json.JsonConverterTest > byteToConnect PASSED
org.apache.kafka.connect.json.JsonConverterTest > nullSchemaPrimitiveToConnect STARTED
org.apache.kafka.connect.json.JsonConverterTest > nullSchemaPrimitiveToConnect PASSED
org.apache.kafka.connect.json.JsonConverterTest > byteToJson STARTED
org.apache.kafka.connect.json.JsonConverterTest > byteToJson PASSED
org.apache.kafka.connect.json.JsonConverterTest > intToConnect STARTED
org.apache.kafka.connect.json.JsonConverterTest > intToConnect PASSED
org.apache.kafka.connect.json.JsonConverterTest > dateToJson STARTED
org.apache.kafka.connect.json.JsonConverterTest > dateToJson PASSED
org.apache.kafka.connect.json.JsonConverterTest > noSchemaToConnect STARTED
org.apache.kafka.connect.json.JsonConverterTest > noSchemaToConnect PASSED
org.apache.kafka.connect.json.JsonConverterTest > noSchemaToJson STARTED
org.apache.kafka.connect.json.JsonConverterTest > noSchemaToJson PASSED
org.apache.kafka.connect.json.JsonConverterTest > nullSchemaAndPrimitiveToJson STARTED
org.apache.kafka.connect.json.JsonConverterTest > nullSchemaAndPrimitiveToJson PASSED
org.apache.kafka.connect.json.JsonConverterTest > decimalToConnectOptionalWithDefaultValue STARTED
org.apache.kafka.connect.json.JsonConverterTest > decimalToConnectOptionalWithDefaultValue PASSED
org.apache.kafka.connect.json.JsonConverterTest > mapToJsonStringKeys STARTED
org.apache.kafka.connect.json.JsonConverterTest > mapToJsonStringKeys PASSED
org.apache.kafka.connect.json.JsonConverterTest > arrayToJson STARTED
org.apache.kafka.connect.json.JsonConverterTest > arrayToJson PASSED
org.apache.kafka.connect.json.JsonConverterTest > nullToConnect STARTED
org.apache.kafka.connect.json.JsonConverterTest > nullToConnect PASSED
org.apache.kafka.connect.json.JsonConverterTest > timeToJson STARTED
org.apache.kafka.connect.json.JsonConverterTest > timeToJson PASSED
org.apache.kafka.connect.json.JsonConverterTest > structToJson STARTED
org.apache.kafka.connect.json.JsonConverterTest > structToJson PASSED
org.apache.kafka.connect.json.JsonConverterTest > testConnectSchemaMetadataTranslation STARTED
org.apache.kafka.connect.json.JsonConverterTest > testConnectSchemaMetadataTranslation PASSED
org.apache.kafka.connect.json.JsonConverterTest > shortToJson STARTED
org.apache.kafka.connect.json.JsonConverterTest > shortToJson PASSED
org.apache.kafka.connect.json.JsonConverterTest > dateToConnect STARTED
org.apache.kafka.connect.json.JsonConverterTest > dateToConnect PASSED
org.apache.kafka.connect.json.JsonConverterTest > doubleToJson STARTED
org.apache.kafka.connect.json.JsonConverterTest > doubleToJson PASSED
org.apache.kafka.connect.json.JsonConverterTest > testStringHeaderToJson STARTED
org.apache.kafka.connect.json.JsonConverterTest > testStringHeaderToJson PASSED
org.apache.kafka.connect.json.JsonConverterTest > decimalToConnectOptional STARTED
org.apache.kafka.connect.json.JsonConverterTest > decimalToConnectOptional PASSED
org.apache.kafka.connect.json.JsonConverterTest > structSchemaIdentical STARTED
org.apache.kafka.connect.json.JsonConverterTest > structSchemaIdentical PASSED
org.apache.kafka.connect.json.JsonConverterTest > timeToConnectWithDefaultValue STARTED
org.apache.kafka.connect.json.JsonConverterTest > timeToConnectWithDefaultValue PASSED
org.apache.kafka.connect.json.JsonConverterTest > timeToConnect STARTED
org.apache.kafka.connect.json.JsonConverterTest > timeToConnect PASSED
org.apache.kafka.connect.json.JsonConverterTest > dateToConnectOptionalWithDefaultValue STARTED
org.apache.kafka.connect.json.JsonConverterTest > dateToConnectOptionalWithDefaultValue PASSED
org.apache.kafka.connect.json.JsonConverterTest > mapToConnectStringKeys STARTED
org.apache.kafka.connect.json.JsonConverterTest > mapToConnectStringKeys PASSED
org.apache.kafka.connect.json.JsonConverterTest > dateToConnectOptional STARTED
org.apache.kafka.connect.json.JsonConverterTest > dateToConnectOptional PASSED
org.apache.kafka.connect.json.JsonConverterTest > timeToConnectOptionalWithDefaultValue STARTED
org.apache.kafka.connect.json.JsonConverterTest > timeToConnectOptionalWithDefaultValue PASSED
org.apache.kafka.connect.json.JsonConverterTest > floatToConnect STARTED
org.apache.kafka.connect.json.JsonConverterTest > floatToConnect PASSED
org.apache.kafka.connect.json.JsonConverterTest > decimalToConnectWithDefaultValue STARTED
org.apache.kafka.connect.json.JsonConverterTest > decimalToConnectWithDefaultValue PASSED
org.apache.kafka.connect.json.JsonConverterTest > decimalToJson STARTED
org.apache.kafka.connect.json.JsonConverterTest > decimalToJson PASSED
org.apache.kafka.connect.json.JsonConverterTest > arrayToConnect STARTED
org.apache.kafka.connect.json.JsonConverterTest > arrayToConnect PASSED
org.apache.kafka.connect.json.JsonConverterTest > testCacheSchemaToConnectConversion STARTED
org.apache.kafka.connect.json.JsonConverterTest > testCacheSchemaToConnectConversion PASSED
org.apache.kafka.connect.json.JsonConverterTest > booleanToJson STARTED
org.apache.kafka.connect.json.JsonConverterTest > booleanToJson PASSED
org.apache.kafka.connect.json.JsonConverterTest > bytesToConnect STARTED
org.apache.kafka.connect.json.JsonConverterTest > bytesToConnect PASSED
org.apache.kafka.connect.json.JsonConverterTest > doubleToConnect STARTED
org.apache.kafka.connect.json.JsonConverterTest > doubleToConnect PASSED
org.apache.kafka.connect.json.JsonConverterTest > timestampToConnectOptionalWithDefaultValue STARTED
org.apache.kafka.connect.json.JsonConverterTest > timestampToConnectOptionalWithDefaultValue PASSED
> Task :connect:basic-auth-extension:test
org.apache.kafka.connect.rest.basic.auth.extension.JaasBasicAuthFilterTest > testSuccess STARTED
org.apache.kafka.connect.rest.basic.auth.extension.JaasBasicAuthFilterTest > testSuccess PASSED
org.apache.kafka.connect.rest.basic.auth.extension.JaasBasicAuthFilterTest > testBadCredential STARTED
org.apache.kafka.connect.rest.basic.auth.extension.JaasBasicAuthFilterTest > testBadCredential PASSED
org.apache.kafka.connect.rest.basic.auth.extension.JaasBasicAuthFilterTest > testBadPassword STARTED
org.apache.kafka.connect.rest.basic.auth.extension.JaasBasicAuthFilterTest > testBadPassword PASSED
org.apache.kafka.connect.rest.basic.auth.extension.JaasBasicAuthFilterTest > testUnknownBearer STARTED
org.apache.kafka.connect.rest.basic.auth.extension.JaasBasicAuthFilterTest > testUnknownBearer PASSED
org.apache.kafka.connect.rest.basic.auth.extension.JaasBasicAuthFilterTest > testUnknownLoginModule STARTED
org.apache.kafka.connect.rest.basic.auth.extension.JaasBasicAuthFilterTest > testUnknownLoginModule PASSED
org.apache.kafka.connect.rest.basic.auth.extension.JaasBasicAuthFilterTest > testUnknownCredentialsFile STARTED
org.apache.kafka.connect.rest.basic.auth.extension.JaasBasicAuthFilterTest > testUnknownCredentialsFile PASSED
org.apache.kafka.connect.rest.basic.auth.extension.JaasBasicAuthFilterTest > testEmptyCredentialsFile STARTED
org.apache.kafka.connect.rest.basic.auth.extension.JaasBasicAuthFilterTest > testEmptyCredentialsFile PASSED
org.apache.kafka.connect.rest.basic.auth.extension.JaasBasicAuthFilterTest > testNoFileOption STARTED
org.apache.kafka.connect.rest.basic.auth.extension.JaasBasicAuthFilterTest > testNoFileOption PASSED
org.apache.kafka.connect.rest.basic.auth.extension.JaasBasicAuthFilterTest > testPostWithoutAppropriateCredential STARTED
org.apache.kafka.connect.rest.basic.auth.extension.JaasBasicAuthFilterTest > testPostWithoutAppropriateCredential PASSED
org.apache.kafka.connect.rest.basic.auth.extension.JaasBasicAuthFilterTest > testPostNotChangingConnectorTask STARTED
org.apache.kafka.connect.rest.basic.auth.extension.JaasBasicAuthFilterTest > testPostNotChangingConnectorTask PASSED
FAILURE: Build failed with an exception.
* What went wrong:
Execution failed for task ':connect:runtime:test'.
> There were failing tests. See the report at: file://<https://builds.apache.org/job/kafka-trunk-jdk8/ws/connect/runtime/build/reports/tests/test/index.html>
* Try:
Run with --stacktrace option to get the stack trace. Run with --info or --debug option to get more log output. Run with --scan to get full insights.
* Get more help at https://help.gradle.org
Deprecated Gradle features were used in this build, making it incompatible with Gradle 6.0.
Use '--warning-mode all' to show the individual deprecation warnings.
See https://docs.gradle.org/5.4.1/userguide/command_line_interface.html#sec:command_line_warnings
BUILD FAILED in 3h 22m 11s
178 actionable tasks: 175 executed, 3 up-to-date
Build step 'Execute shell' marked build as failure
[FINDBUGS] Collecting findbugs analysis files...
Setting GRADLE_4_10_3_HOME=/home/jenkins/tools/gradle/4.10.3
[FINDBUGS] Searching for all files in <https://builds.apache.org/job/kafka-trunk-jdk8/ws/> that match the pattern **/build/reports/*bugs/*.xml
[FINDBUGS] Parsing 17 files in <https://builds.apache.org/job/kafka-trunk-jdk8/ws/>
[FINDBUGS] Successfully parsed file <https://builds.apache.org/job/kafka-trunk-jdk8/ws/clients/build/reports/spotbugs/main.xml> with 0 unique warnings and 0 duplicates.
[FINDBUGS] Successfully parsed file <https://builds.apache.org/job/kafka-trunk-jdk8/ws/connect/api/build/reports/spotbugs/main.xml> with 0 unique warnings and 0 duplicates.
[FINDBUGS] Successfully parsed file <https://builds.apache.org/job/kafka-trunk-jdk8/ws/connect/basic-auth-extension/build/reports/spotbugs/main.xml> with 0 unique warnings and 0 duplicates.
[FINDBUGS] Successfully parsed file <https://builds.apache.org/job/kafka-trunk-jdk8/ws/connect/file/build/reports/spotbugs/main.xml> with 0 unique warnings and 0 duplicates.
[FINDBUGS] Successfully parsed file <https://builds.apache.org/job/kafka-trunk-jdk8/ws/connect/json/build/reports/spotbugs/main.xml> with 0 unique warnings and 0 duplicates.
[FINDBUGS] Successfully parsed file <https://builds.apache.org/job/kafka-trunk-jdk8/ws/connect/runtime/build/reports/spotbugs/main.xml> with 0 unique warnings and 0 duplicates.
[FINDBUGS] Successfully parsed file <https://builds.apache.org/job/kafka-trunk-jdk8/ws/connect/transforms/build/reports/spotbugs/main.xml> with 0 unique warnings and 0 duplicates.
[FINDBUGS] Successfully parsed file <https://builds.apache.org/job/kafka-trunk-jdk8/ws/core/build/reports/spotbugs/main.xml> with 0 unique warnings and 0 duplicates.
[FINDBUGS] Successfully parsed file <https://builds.apache.org/job/kafka-trunk-jdk8/ws/examples/build/reports/spotbugs/main.xml> with 0 unique warnings and 0 duplicates.
[FINDBUGS] Successfully parsed file <https://builds.apache.org/job/kafka-trunk-jdk8/ws/generator/build/reports/spotbugs/main.xml> with 0 unique warnings and 0 duplicates.
[FINDBUGS] Successfully parsed file <https://builds.apache.org/job/kafka-trunk-jdk8/ws/jmh-benchmarks/build/reports/spotbugs/main.xml> with 0 unique warnings and 0 duplicates.
[FINDBUGS] Successfully parsed file <https://builds.apache.org/job/kafka-trunk-jdk8/ws/log4j-appender/build/reports/spotbugs/main.xml> with 0 unique warnings and 0 duplicates.
[FINDBUGS] Successfully parsed file <https://builds.apache.org/job/kafka-trunk-jdk8/ws/streams/build/reports/spotbugs/main.xml> with 0 unique warnings and 0 duplicates.
[FINDBUGS] Successfully parsed file <https://builds.apache.org/job/kafka-trunk-jdk8/ws/streams/examples/build/reports/spotbugs/main.xml> with 0 unique warnings and 0 duplicates.
[FINDBUGS] Successfully parsed file <https://builds.apache.org/job/kafka-trunk-jdk8/ws/streams/streams-scala/build/reports/spotbugs/main.xml> with 0 unique warnings and 0 duplicates.
[FINDBUGS] Successfully parsed file <https://builds.apache.org/job/kafka-trunk-jdk8/ws/streams/test-utils/build/reports/spotbugs/main.xml> with 0 unique warnings and 0 duplicates.
[FINDBUGS] Successfully parsed file <https://builds.apache.org/job/kafka-trunk-jdk8/ws/tools/build/reports/spotbugs/main.xml> with 0 unique warnings and 0 duplicates.
Setting GRADLE_4_10_3_HOME=/home/jenkins/tools/gradle/4.10.3
No credentials specified
Setting GRADLE_4_10_3_HOME=/home/jenkins/tools/gradle/4.10.3
<Git Blamer> Using GitBlamer to create author and commit information for all warnings.
<Git Blamer> GIT_COMMIT=81900d0ba0a5839a1e5dc876897bab1c24b3bd94, workspace=<https://builds.apache.org/job/kafka-trunk-jdk8/ws/>
[FINDBUGS] Computing warning deltas based on reference build #3796
Recording test results
Setting GRADLE_4_10_3_HOME=/home/jenkins/tools/gradle/4.10.3
Setting GRADLE_4_10_3_HOME=/home/jenkins/tools/gradle/4.10.3
Not sending mail to unregistered user ismael@juma.me.uk
Not sending mail to unregistered user noreply@github.com
Not sending mail to unregistered user wangguoz@gmail.com
Not sending mail to unregistered user rajinisivaram@googlemail.com
Build failed in Jenkins: kafka-trunk-jdk8 #3817
Posted by Apache Jenkins Server <je...@builds.apache.org>.
See <https://builds.apache.org/job/kafka-trunk-jdk8/3817/display/redirect?page=changes>
Changes:
[cmccabe] KAFKA-8345: KIP-455 Protocol changes (part 1) (#7114)
------------------------------------------
[...truncated 6.47 MB...]
org.apache.kafka.connect.data.SchemaProjectorTest > testStructAddField PASSED
org.apache.kafka.connect.data.SchemaProjectorTest > testStructRemoveField STARTED
org.apache.kafka.connect.data.SchemaProjectorTest > testStructRemoveField PASSED
org.apache.kafka.connect.data.SchemaProjectorTest > testStructDefaultValue STARTED
org.apache.kafka.connect.data.SchemaProjectorTest > testStructDefaultValue PASSED
org.apache.kafka.connect.data.SchemaProjectorTest > testProjectMissingDefaultValuedStructField STARTED
org.apache.kafka.connect.data.SchemaProjectorTest > testProjectMissingDefaultValuedStructField PASSED
org.apache.kafka.connect.data.SchemaProjectorTest > testPrimitiveOptionalProjection STARTED
org.apache.kafka.connect.data.SchemaProjectorTest > testPrimitiveOptionalProjection PASSED
org.apache.kafka.connect.data.SchemaProjectorTest > testProjectMissingOptionalStructField STARTED
org.apache.kafka.connect.data.SchemaProjectorTest > testProjectMissingOptionalStructField PASSED
org.apache.kafka.connect.data.SchemaProjectorTest > testMaybeCompatible STARTED
org.apache.kafka.connect.data.SchemaProjectorTest > testMaybeCompatible PASSED
org.apache.kafka.connect.data.FieldTest > testEquality STARTED
org.apache.kafka.connect.data.FieldTest > testEquality PASSED
org.apache.kafka.connect.storage.StringConverterTest > testBytesNullToString STARTED
org.apache.kafka.connect.storage.StringConverterTest > testBytesNullToString PASSED
org.apache.kafka.connect.storage.StringConverterTest > testToBytesNonUtf8Encoding STARTED
org.apache.kafka.connect.storage.StringConverterTest > testToBytesNonUtf8Encoding PASSED
org.apache.kafka.connect.storage.StringConverterTest > testNonStringToBytes STARTED
org.apache.kafka.connect.storage.StringConverterTest > testNonStringToBytes PASSED
org.apache.kafka.connect.storage.StringConverterTest > testBytesToStringNonUtf8Encoding STARTED
org.apache.kafka.connect.storage.StringConverterTest > testBytesToStringNonUtf8Encoding PASSED
org.apache.kafka.connect.storage.StringConverterTest > testNullToBytes STARTED
org.apache.kafka.connect.storage.StringConverterTest > testNullToBytes PASSED
org.apache.kafka.connect.storage.StringConverterTest > testNullHeaderValueToBytes STARTED
org.apache.kafka.connect.storage.StringConverterTest > testNullHeaderValueToBytes PASSED
org.apache.kafka.connect.storage.StringConverterTest > testStringHeaderValueToBytes STARTED
org.apache.kafka.connect.storage.StringConverterTest > testStringHeaderValueToBytes PASSED
org.apache.kafka.connect.storage.StringConverterTest > testToBytesIgnoresSchema STARTED
org.apache.kafka.connect.storage.StringConverterTest > testToBytesIgnoresSchema PASSED
org.apache.kafka.connect.storage.StringConverterTest > testNonStringHeaderValueToBytes STARTED
org.apache.kafka.connect.storage.StringConverterTest > testNonStringHeaderValueToBytes PASSED
org.apache.kafka.connect.storage.StringConverterTest > testStringToBytes STARTED
org.apache.kafka.connect.storage.StringConverterTest > testStringToBytes PASSED
org.apache.kafka.connect.storage.StringConverterTest > testBytesToString STARTED
org.apache.kafka.connect.storage.StringConverterTest > testBytesToString PASSED
org.apache.kafka.connect.storage.SimpleHeaderConverterTest > shouldConvertEmptyListToListWithoutSchema STARTED
org.apache.kafka.connect.storage.SimpleHeaderConverterTest > shouldConvertEmptyListToListWithoutSchema PASSED
org.apache.kafka.connect.storage.SimpleHeaderConverterTest > shouldConvertStringWithQuotesAndOtherDelimiterCharacters STARTED
org.apache.kafka.connect.storage.SimpleHeaderConverterTest > shouldConvertStringWithQuotesAndOtherDelimiterCharacters PASSED
org.apache.kafka.connect.storage.SimpleHeaderConverterTest > shouldConvertListWithMixedValuesToListWithoutSchema STARTED
org.apache.kafka.connect.storage.SimpleHeaderConverterTest > shouldConvertListWithMixedValuesToListWithoutSchema PASSED
org.apache.kafka.connect.storage.SimpleHeaderConverterTest > shouldConvertMapWithStringKeys STARTED
org.apache.kafka.connect.storage.SimpleHeaderConverterTest > shouldConvertMapWithStringKeys PASSED
org.apache.kafka.connect.storage.SimpleHeaderConverterTest > shouldParseStringOfMapWithStringValuesWithWhitespaceAsMap STARTED
org.apache.kafka.connect.storage.SimpleHeaderConverterTest > shouldParseStringOfMapWithStringValuesWithWhitespaceAsMap PASSED
org.apache.kafka.connect.storage.SimpleHeaderConverterTest > shouldConvertMapWithStringKeysAndShortValues STARTED
org.apache.kafka.connect.storage.SimpleHeaderConverterTest > shouldConvertMapWithStringKeysAndShortValues PASSED
org.apache.kafka.connect.storage.SimpleHeaderConverterTest > shouldParseStringOfMapWithStringValuesWithoutWhitespaceAsMap STARTED
org.apache.kafka.connect.storage.SimpleHeaderConverterTest > shouldParseStringOfMapWithStringValuesWithoutWhitespaceAsMap PASSED
org.apache.kafka.connect.storage.SimpleHeaderConverterTest > shouldConvertSimpleString STARTED
org.apache.kafka.connect.storage.SimpleHeaderConverterTest > shouldConvertSimpleString PASSED
org.apache.kafka.connect.storage.SimpleHeaderConverterTest > shouldConvertEmptyMapToMapWithoutSchema STARTED
org.apache.kafka.connect.storage.SimpleHeaderConverterTest > shouldConvertEmptyMapToMapWithoutSchema PASSED
org.apache.kafka.connect.storage.SimpleHeaderConverterTest > shouldConvertEmptyString STARTED
org.apache.kafka.connect.storage.SimpleHeaderConverterTest > shouldConvertEmptyString PASSED
org.apache.kafka.connect.storage.SimpleHeaderConverterTest > shouldConvertMapWithStringKeysAndMixedValuesToMapWithoutSchema STARTED
org.apache.kafka.connect.storage.SimpleHeaderConverterTest > shouldConvertMapWithStringKeysAndMixedValuesToMapWithoutSchema PASSED
org.apache.kafka.connect.storage.SimpleHeaderConverterTest > shouldParseStringOfMapWithIntValuesWithoutWhitespaceAsMap STARTED
org.apache.kafka.connect.storage.SimpleHeaderConverterTest > shouldParseStringOfMapWithIntValuesWithoutWhitespaceAsMap PASSED
org.apache.kafka.connect.storage.SimpleHeaderConverterTest > shouldParseStringOfMapWithShortValuesWithWhitespaceAsMap STARTED
org.apache.kafka.connect.storage.SimpleHeaderConverterTest > shouldParseStringOfMapWithShortValuesWithWhitespaceAsMap PASSED
org.apache.kafka.connect.storage.SimpleHeaderConverterTest > shouldConvertMapWithStringKeysAndIntegerValues STARTED
org.apache.kafka.connect.storage.SimpleHeaderConverterTest > shouldConvertMapWithStringKeysAndIntegerValues PASSED
org.apache.kafka.connect.storage.SimpleHeaderConverterTest > shouldConvertNullValue STARTED
org.apache.kafka.connect.storage.SimpleHeaderConverterTest > shouldConvertNullValue PASSED
org.apache.kafka.connect.storage.SimpleHeaderConverterTest > shouldParseStringOfMapWithShortValuesWithoutWhitespaceAsMap STARTED
org.apache.kafka.connect.storage.SimpleHeaderConverterTest > shouldParseStringOfMapWithShortValuesWithoutWhitespaceAsMap PASSED
org.apache.kafka.connect.storage.SimpleHeaderConverterTest > shouldConvertListWithStringValues STARTED
org.apache.kafka.connect.storage.SimpleHeaderConverterTest > shouldConvertListWithStringValues PASSED
org.apache.kafka.connect.storage.SimpleHeaderConverterTest > shouldParseStringOfMapWithIntValuesWithWhitespaceAsMap STARTED
org.apache.kafka.connect.storage.SimpleHeaderConverterTest > shouldParseStringOfMapWithIntValuesWithWhitespaceAsMap PASSED
org.apache.kafka.connect.storage.SimpleHeaderConverterTest > shouldConvertListWithIntegerValues STARTED
org.apache.kafka.connect.storage.SimpleHeaderConverterTest > shouldConvertListWithIntegerValues PASSED
org.apache.kafka.connect.storage.ConverterTypeTest > shouldFindByName STARTED
org.apache.kafka.connect.storage.ConverterTypeTest > shouldFindByName PASSED
org.apache.kafka.connect.connector.ConnectorReconfigurationTest > testReconfigureStopException STARTED
org.apache.kafka.connect.connector.ConnectorReconfigurationTest > testReconfigureStopException PASSED
org.apache.kafka.connect.connector.ConnectorReconfigurationTest > testDefaultReconfigure STARTED
org.apache.kafka.connect.connector.ConnectorReconfigurationTest > testDefaultReconfigure PASSED
org.apache.kafka.connect.source.SourceRecordTest > shouldDuplicateRecordAndCloneHeaders STARTED
org.apache.kafka.connect.source.SourceRecordTest > shouldDuplicateRecordAndCloneHeaders PASSED
org.apache.kafka.connect.source.SourceRecordTest > shouldDuplicateRecordUsingNewHeaders STARTED
org.apache.kafka.connect.source.SourceRecordTest > shouldDuplicateRecordUsingNewHeaders PASSED
org.apache.kafka.connect.source.SourceRecordTest > shouldModifyRecordHeader STARTED
org.apache.kafka.connect.source.SourceRecordTest > shouldModifyRecordHeader PASSED
org.apache.kafka.connect.source.SourceRecordTest > shouldCreateSinkRecordWithHeaders STARTED
org.apache.kafka.connect.source.SourceRecordTest > shouldCreateSinkRecordWithHeaders PASSED
org.apache.kafka.connect.source.SourceRecordTest > shouldCreateSinkRecordWithEmtpyHeaders STARTED
org.apache.kafka.connect.source.SourceRecordTest > shouldCreateSinkRecordWithEmtpyHeaders PASSED
org.apache.kafka.connect.util.ConnectorUtilsTest > testGroupPartitions STARTED
org.apache.kafka.connect.util.ConnectorUtilsTest > testGroupPartitions PASSED
org.apache.kafka.connect.util.ConnectorUtilsTest > testGroupPartitionsInvalidCount STARTED
org.apache.kafka.connect.util.ConnectorUtilsTest > testGroupPartitionsInvalidCount PASSED
> Task :streams:examples:test
org.apache.kafka.streams.examples.wordcount.WordCountProcessorTest > test STARTED
org.apache.kafka.streams.examples.wordcount.WordCountProcessorTest > test PASSED
FAILURE: Build failed with an exception.
* What went wrong:
Execution failed for task ':connect:runtime:test'.
> There were failing tests. See the report at: file://<https://builds.apache.org/job/kafka-trunk-jdk8/ws/connect/runtime/build/reports/tests/test/index.html>
* Try:
Run with --stacktrace option to get the stack trace. Run with --info or --debug option to get more log output. Run with --scan to get full insights.
* Get more help at https://help.gradle.org
Deprecated Gradle features were used in this build, making it incompatible with Gradle 6.0.
Use '--warning-mode all' to show the individual deprecation warnings.
See https://docs.gradle.org/5.4.1/userguide/command_line_interface.html#sec:command_line_warnings
BUILD FAILED in 3h 22m 37s
178 actionable tasks: 175 executed, 3 up-to-date
Build step 'Execute shell' marked build as failure
[FINDBUGS] Collecting findbugs analysis files...
Setting GRADLE_4_8_1_HOME=/home/jenkins/tools/gradle/4.8.1
[FINDBUGS] Searching for all files in <https://builds.apache.org/job/kafka-trunk-jdk8/ws/> that match the pattern **/build/reports/*bugs/*.xml
[FINDBUGS] Parsing 17 files in <https://builds.apache.org/job/kafka-trunk-jdk8/ws/>
[FINDBUGS] Successfully parsed file <https://builds.apache.org/job/kafka-trunk-jdk8/ws/clients/build/reports/spotbugs/main.xml> with 0 unique warnings and 0 duplicates.
[FINDBUGS] Successfully parsed file <https://builds.apache.org/job/kafka-trunk-jdk8/ws/connect/api/build/reports/spotbugs/main.xml> with 0 unique warnings and 0 duplicates.
[FINDBUGS] Successfully parsed file <https://builds.apache.org/job/kafka-trunk-jdk8/ws/connect/basic-auth-extension/build/reports/spotbugs/main.xml> with 0 unique warnings and 0 duplicates.
[FINDBUGS] Successfully parsed file <https://builds.apache.org/job/kafka-trunk-jdk8/ws/connect/file/build/reports/spotbugs/main.xml> with 0 unique warnings and 0 duplicates.
[FINDBUGS] Successfully parsed file <https://builds.apache.org/job/kafka-trunk-jdk8/ws/connect/json/build/reports/spotbugs/main.xml> with 0 unique warnings and 0 duplicates.
[FINDBUGS] Successfully parsed file <https://builds.apache.org/job/kafka-trunk-jdk8/ws/connect/runtime/build/reports/spotbugs/main.xml> with 0 unique warnings and 0 duplicates.
[FINDBUGS] Successfully parsed file <https://builds.apache.org/job/kafka-trunk-jdk8/ws/connect/transforms/build/reports/spotbugs/main.xml> with 0 unique warnings and 0 duplicates.
[FINDBUGS] Successfully parsed file <https://builds.apache.org/job/kafka-trunk-jdk8/ws/core/build/reports/spotbugs/main.xml> with 0 unique warnings and 0 duplicates.
[FINDBUGS] Successfully parsed file <https://builds.apache.org/job/kafka-trunk-jdk8/ws/examples/build/reports/spotbugs/main.xml> with 0 unique warnings and 0 duplicates.
[FINDBUGS] Successfully parsed file <https://builds.apache.org/job/kafka-trunk-jdk8/ws/generator/build/reports/spotbugs/main.xml> with 0 unique warnings and 0 duplicates.
[FINDBUGS] Successfully parsed file <https://builds.apache.org/job/kafka-trunk-jdk8/ws/jmh-benchmarks/build/reports/spotbugs/main.xml> with 0 unique warnings and 0 duplicates.
[FINDBUGS] Successfully parsed file <https://builds.apache.org/job/kafka-trunk-jdk8/ws/log4j-appender/build/reports/spotbugs/main.xml> with 0 unique warnings and 0 duplicates.
[FINDBUGS] Successfully parsed file <https://builds.apache.org/job/kafka-trunk-jdk8/ws/streams/build/reports/spotbugs/main.xml> with 0 unique warnings and 0 duplicates.
[FINDBUGS] Successfully parsed file <https://builds.apache.org/job/kafka-trunk-jdk8/ws/streams/examples/build/reports/spotbugs/main.xml> with 0 unique warnings and 0 duplicates.
[FINDBUGS] Successfully parsed file <https://builds.apache.org/job/kafka-trunk-jdk8/ws/streams/streams-scala/build/reports/spotbugs/main.xml> with 0 unique warnings and 0 duplicates.
[FINDBUGS] Successfully parsed file <https://builds.apache.org/job/kafka-trunk-jdk8/ws/streams/test-utils/build/reports/spotbugs/main.xml> with 0 unique warnings and 0 duplicates.
[FINDBUGS] Successfully parsed file <https://builds.apache.org/job/kafka-trunk-jdk8/ws/tools/build/reports/spotbugs/main.xml> with 0 unique warnings and 0 duplicates.
Setting GRADLE_4_8_1_HOME=/home/jenkins/tools/gradle/4.8.1
No credentials specified
Setting GRADLE_4_8_1_HOME=/home/jenkins/tools/gradle/4.8.1
<Git Blamer> Using GitBlamer to create author and commit information for all warnings.
<Git Blamer> GIT_COMMIT=81900d0ba0a5839a1e5dc876897bab1c24b3bd94, workspace=<https://builds.apache.org/job/kafka-trunk-jdk8/ws/>
[FINDBUGS] Computing warning deltas based on reference build #3796
Recording test results
Setting GRADLE_4_8_1_HOME=/home/jenkins/tools/gradle/4.8.1
Setting GRADLE_4_8_1_HOME=/home/jenkins/tools/gradle/4.8.1
Not sending mail to unregistered user ismael@juma.me.uk
Not sending mail to unregistered user noreply@github.com
Not sending mail to unregistered user wangguoz@gmail.com
Not sending mail to unregistered user rajinisivaram@googlemail.com
Build failed in Jenkins: kafka-trunk-jdk8 #3816
Posted by Apache Jenkins Server <je...@builds.apache.org>.
See <https://builds.apache.org/job/kafka-trunk-jdk8/3816/display/redirect?page=changes>
Changes:
[github] MINOR: Fix Streams metadata upgrade system test (#7118)
------------------------------------------
Started by an SCM change
[EnvInject] - Loading node environment variables.
Building remotely on H44 (ubuntu bionic) in workspace <https://builds.apache.org/job/kafka-trunk-jdk8/ws/>
[WS-CLEANUP] Deleting project workspace...
[WS-CLEANUP] Deferred wipeout is used...
[WS-CLEANUP] Done
No credentials specified
Cloning the remote Git repository
Cloning repository https://github.com/apache/kafka.git
> git init <https://builds.apache.org/job/kafka-trunk-jdk8/ws/> # timeout=10
Fetching upstream changes from https://github.com/apache/kafka.git
> git --version # timeout=10
> git fetch --tags --progress https://github.com/apache/kafka.git +refs/heads/*:refs/remotes/origin/*
> git config remote.origin.url https://github.com/apache/kafka.git # timeout=10
> git config --add remote.origin.fetch +refs/heads/*:refs/remotes/origin/* # timeout=10
> git config remote.origin.url https://github.com/apache/kafka.git # timeout=10
Fetching upstream changes from https://github.com/apache/kafka.git
> git fetch --tags --progress https://github.com/apache/kafka.git +refs/heads/*:refs/remotes/origin/*
> git rev-parse refs/remotes/origin/trunk^{commit} # timeout=10
> git rev-parse refs/remotes/origin/origin/trunk^{commit} # timeout=10
Checking out Revision 39bcc8447c906506d63b8df156cf90174bbb8b78 (refs/remotes/origin/trunk)
> git config core.sparsecheckout # timeout=10
> git checkout -f 39bcc8447c906506d63b8df156cf90174bbb8b78
Commit message: "MINOR: Fix Streams metadata upgrade system test (#7118)"
> git rev-list --no-walk acf507ce9cd0a6037da3e4c561bd4c50ba526f8a # timeout=10
Setting GRADLE_4_8_1_HOME=/home/jenkins/tools/gradle/4.8.1
[kafka-trunk-jdk8] $ /bin/bash -xe /tmp/jenkins6004398714022845310.sh
+ rm -rf <https://builds.apache.org/job/kafka-trunk-jdk8/ws/.gradle>
+ /home/jenkins/tools/gradle/4.8.1/bin/gradle
/tmp/jenkins6004398714022845310.sh: line 4: /home/jenkins/tools/gradle/4.8.1/bin/gradle: No such file or directory
Build step 'Execute shell' marked build as failure
[FINDBUGS] Collecting findbugs analysis files...
Setting GRADLE_4_8_1_HOME=/home/jenkins/tools/gradle/4.8.1
[FINDBUGS] Searching for all files in <https://builds.apache.org/job/kafka-trunk-jdk8/ws/> that match the pattern **/build/reports/*bugs/*.xml
[FINDBUGS] No files found. Configuration error?
Setting GRADLE_4_8_1_HOME=/home/jenkins/tools/gradle/4.8.1
No credentials specified
Setting GRADLE_4_8_1_HOME=/home/jenkins/tools/gradle/4.8.1
<Git Blamer> Using GitBlamer to create author and commit information for all warnings.
<Git Blamer> GIT_COMMIT=39bcc8447c906506d63b8df156cf90174bbb8b78, workspace=<https://builds.apache.org/job/kafka-trunk-jdk8/ws/>
[FINDBUGS] Computing warning deltas based on reference build #3796
Recording test results
Setting GRADLE_4_8_1_HOME=/home/jenkins/tools/gradle/4.8.1
ERROR: Step ?Publish JUnit test result report? failed: No test report files were found. Configuration error?
Setting GRADLE_4_8_1_HOME=/home/jenkins/tools/gradle/4.8.1
Not sending mail to unregistered user ismael@juma.me.uk
Not sending mail to unregistered user noreply@github.com
Not sending mail to unregistered user wangguoz@gmail.com
Not sending mail to unregistered user rajinisivaram@googlemail.com
Re: Build failed in Jenkins: kafka-trunk-jdk8 #3815
Posted by Divansh Arora <di...@iiitd.ac.in>.
m
On Sun, Jul 28, 2019 at 10:42 PM Apache Jenkins Server <
jenkins@builds.apache.org> wrote:
> See <
> https://builds.apache.org/job/kafka-trunk-jdk8/3815/display/redirect?page=changes
> >
>
> Changes:
>
> [github] MINOR: Remove unused TopicAndPartition and remove unused symbols
> (#7119)
>
> ------------------------------------------
> Started by an SCM change
> [EnvInject] - Loading node environment variables.
> Building remotely on H44 (ubuntu bionic) in workspace <
> https://builds.apache.org/job/kafka-trunk-jdk8/ws/>
> [WS-CLEANUP] Deleting project workspace...
> [WS-CLEANUP] Deferred wipeout is used...
> [WS-CLEANUP] Done
> No credentials specified
> Cloning the remote Git repository
> Cloning repository https://github.com/apache/kafka.git
> > git init <https://builds.apache.org/job/kafka-trunk-jdk8/ws/> #
> timeout=10
> Fetching upstream changes from https://github.com/apache/kafka.git
> > git --version # timeout=10
> > git fetch --tags --progress https://github.com/apache/kafka.git
> +refs/heads/*:refs/remotes/origin/*
> > git config remote.origin.url https://github.com/apache/kafka.git #
> timeout=10
> > git config --add remote.origin.fetch
> +refs/heads/*:refs/remotes/origin/* # timeout=10
> > git config remote.origin.url https://github.com/apache/kafka.git #
> timeout=10
> Fetching upstream changes from https://github.com/apache/kafka.git
> > git fetch --tags --progress https://github.com/apache/kafka.git
> +refs/heads/*:refs/remotes/origin/*
> > git rev-parse refs/remotes/origin/trunk^{commit} # timeout=10
> > git rev-parse refs/remotes/origin/origin/trunk^{commit} # timeout=10
> Checking out Revision acf507ce9cd0a6037da3e4c561bd4c50ba526f8a
> (refs/remotes/origin/trunk)
> > git config core.sparsecheckout # timeout=10
> > git checkout -f acf507ce9cd0a6037da3e4c561bd4c50ba526f8a
> Commit message: "MINOR: Remove unused TopicAndPartition and remove unused
> symbols (#7119)"
> > git rev-list --no-walk 9ad7bce492869e7d971bb7c83becf795622fa4dd #
> timeout=10
> Setting GRADLE_4_8_1_HOME=/home/jenkins/tools/gradle/4.8.1
> [kafka-trunk-jdk8] $ /bin/bash -xe /tmp/jenkins4422692413816819539.sh
> + rm -rf <https://builds.apache.org/job/kafka-trunk-jdk8/ws/.gradle>
> + /home/jenkins/tools/gradle/4.8.1/bin/gradle
> /tmp/jenkins4422692413816819539.sh: line 4:
> /home/jenkins/tools/gradle/4.8.1/bin/gradle: No such file or directory
> Build step 'Execute shell' marked build as failure
> [FINDBUGS] Collecting findbugs analysis files...
> Setting GRADLE_4_8_1_HOME=/home/jenkins/tools/gradle/4.8.1
> [FINDBUGS] Searching for all files in <
> https://builds.apache.org/job/kafka-trunk-jdk8/ws/> that match the
> pattern **/build/reports/*bugs/*.xml
> [FINDBUGS] No files found. Configuration error?
> Setting GRADLE_4_8_1_HOME=/home/jenkins/tools/gradle/4.8.1
> No credentials specified
> Setting GRADLE_4_8_1_HOME=/home/jenkins/tools/gradle/4.8.1
> <Git Blamer> Using GitBlamer to create author and commit information for
> all warnings.
> <Git Blamer> GIT_COMMIT=acf507ce9cd0a6037da3e4c561bd4c50ba526f8a,
> workspace=<https://builds.apache.org/job/kafka-trunk-jdk8/ws/>
> [FINDBUGS] Computing warning deltas based on reference build #3796
> Recording test results
> Setting GRADLE_4_8_1_HOME=/home/jenkins/tools/gradle/4.8.1
> ERROR: Step ?Publish JUnit test result report? failed: No test report
> files were found. Configuration error?
> Setting GRADLE_4_8_1_HOME=/home/jenkins/tools/gradle/4.8.1
> Not sending mail to unregistered user ismael@juma.me.uk
> Not sending mail to unregistered user noreply@github.com
> Not sending mail to unregistered user wangguoz@gmail.com
> Not sending mail to unregistered user rajinisivaram@googlemail.com
>
Build failed in Jenkins: kafka-trunk-jdk8 #3815
Posted by Apache Jenkins Server <je...@builds.apache.org>.
See <https://builds.apache.org/job/kafka-trunk-jdk8/3815/display/redirect?page=changes>
Changes:
[github] MINOR: Remove unused TopicAndPartition and remove unused symbols (#7119)
------------------------------------------
Started by an SCM change
[EnvInject] - Loading node environment variables.
Building remotely on H44 (ubuntu bionic) in workspace <https://builds.apache.org/job/kafka-trunk-jdk8/ws/>
[WS-CLEANUP] Deleting project workspace...
[WS-CLEANUP] Deferred wipeout is used...
[WS-CLEANUP] Done
No credentials specified
Cloning the remote Git repository
Cloning repository https://github.com/apache/kafka.git
> git init <https://builds.apache.org/job/kafka-trunk-jdk8/ws/> # timeout=10
Fetching upstream changes from https://github.com/apache/kafka.git
> git --version # timeout=10
> git fetch --tags --progress https://github.com/apache/kafka.git +refs/heads/*:refs/remotes/origin/*
> git config remote.origin.url https://github.com/apache/kafka.git # timeout=10
> git config --add remote.origin.fetch +refs/heads/*:refs/remotes/origin/* # timeout=10
> git config remote.origin.url https://github.com/apache/kafka.git # timeout=10
Fetching upstream changes from https://github.com/apache/kafka.git
> git fetch --tags --progress https://github.com/apache/kafka.git +refs/heads/*:refs/remotes/origin/*
> git rev-parse refs/remotes/origin/trunk^{commit} # timeout=10
> git rev-parse refs/remotes/origin/origin/trunk^{commit} # timeout=10
Checking out Revision acf507ce9cd0a6037da3e4c561bd4c50ba526f8a (refs/remotes/origin/trunk)
> git config core.sparsecheckout # timeout=10
> git checkout -f acf507ce9cd0a6037da3e4c561bd4c50ba526f8a
Commit message: "MINOR: Remove unused TopicAndPartition and remove unused symbols (#7119)"
> git rev-list --no-walk 9ad7bce492869e7d971bb7c83becf795622fa4dd # timeout=10
Setting GRADLE_4_8_1_HOME=/home/jenkins/tools/gradle/4.8.1
[kafka-trunk-jdk8] $ /bin/bash -xe /tmp/jenkins4422692413816819539.sh
+ rm -rf <https://builds.apache.org/job/kafka-trunk-jdk8/ws/.gradle>
+ /home/jenkins/tools/gradle/4.8.1/bin/gradle
/tmp/jenkins4422692413816819539.sh: line 4: /home/jenkins/tools/gradle/4.8.1/bin/gradle: No such file or directory
Build step 'Execute shell' marked build as failure
[FINDBUGS] Collecting findbugs analysis files...
Setting GRADLE_4_8_1_HOME=/home/jenkins/tools/gradle/4.8.1
[FINDBUGS] Searching for all files in <https://builds.apache.org/job/kafka-trunk-jdk8/ws/> that match the pattern **/build/reports/*bugs/*.xml
[FINDBUGS] No files found. Configuration error?
Setting GRADLE_4_8_1_HOME=/home/jenkins/tools/gradle/4.8.1
No credentials specified
Setting GRADLE_4_8_1_HOME=/home/jenkins/tools/gradle/4.8.1
<Git Blamer> Using GitBlamer to create author and commit information for all warnings.
<Git Blamer> GIT_COMMIT=acf507ce9cd0a6037da3e4c561bd4c50ba526f8a, workspace=<https://builds.apache.org/job/kafka-trunk-jdk8/ws/>
[FINDBUGS] Computing warning deltas based on reference build #3796
Recording test results
Setting GRADLE_4_8_1_HOME=/home/jenkins/tools/gradle/4.8.1
ERROR: Step ?Publish JUnit test result report? failed: No test report files were found. Configuration error?
Setting GRADLE_4_8_1_HOME=/home/jenkins/tools/gradle/4.8.1
Not sending mail to unregistered user ismael@juma.me.uk
Not sending mail to unregistered user noreply@github.com
Not sending mail to unregistered user wangguoz@gmail.com
Not sending mail to unregistered user rajinisivaram@googlemail.com
Build failed in Jenkins: kafka-trunk-jdk8 #3814
Posted by Apache Jenkins Server <je...@builds.apache.org>.
See <https://builds.apache.org/job/kafka-trunk-jdk8/3814/display/redirect?page=changes>
Changes:
[ismael] MINOR: Close ZKDatabase in EmbeddedZookeeper (#6237)
------------------------------------------
[...truncated 6.45 MB...]
org.apache.kafka.connect.util.KafkaBasedLogTest > testStartStop STARTED
org.apache.kafka.connect.util.KafkaBasedLogTest > testStartStop PASSED
org.apache.kafka.connect.util.KafkaBasedLogTest > testReloadOnStart STARTED
org.apache.kafka.connect.util.KafkaBasedLogTest > testReloadOnStart PASSED
org.apache.kafka.connect.converters.FloatConverterTest > testBytesNullToNumber STARTED
org.apache.kafka.connect.converters.FloatConverterTest > testBytesNullToNumber PASSED
org.apache.kafka.connect.converters.FloatConverterTest > testSerializingIncorrectType STARTED
org.apache.kafka.connect.converters.FloatConverterTest > testSerializingIncorrectType PASSED
org.apache.kafka.connect.converters.FloatConverterTest > testDeserializingHeaderWithTooManyBytes STARTED
org.apache.kafka.connect.converters.FloatConverterTest > testDeserializingHeaderWithTooManyBytes PASSED
org.apache.kafka.connect.converters.FloatConverterTest > testNullToBytes STARTED
org.apache.kafka.connect.converters.FloatConverterTest > testNullToBytes PASSED
org.apache.kafka.connect.converters.FloatConverterTest > testSerializingIncorrectHeader STARTED
org.apache.kafka.connect.converters.FloatConverterTest > testSerializingIncorrectHeader PASSED
org.apache.kafka.connect.converters.FloatConverterTest > testDeserializingDataWithTooManyBytes STARTED
org.apache.kafka.connect.converters.FloatConverterTest > testDeserializingDataWithTooManyBytes PASSED
org.apache.kafka.connect.converters.FloatConverterTest > testConvertingSamplesToAndFromBytes STARTED
org.apache.kafka.connect.converters.FloatConverterTest > testConvertingSamplesToAndFromBytes PASSED
org.apache.kafka.connect.converters.IntegerConverterTest > testBytesNullToNumber STARTED
org.apache.kafka.connect.converters.IntegerConverterTest > testBytesNullToNumber PASSED
org.apache.kafka.connect.converters.IntegerConverterTest > testSerializingIncorrectType STARTED
org.apache.kafka.connect.converters.IntegerConverterTest > testSerializingIncorrectType PASSED
org.apache.kafka.connect.converters.IntegerConverterTest > testDeserializingHeaderWithTooManyBytes STARTED
org.apache.kafka.connect.converters.IntegerConverterTest > testDeserializingHeaderWithTooManyBytes PASSED
org.apache.kafka.connect.converters.IntegerConverterTest > testNullToBytes STARTED
org.apache.kafka.connect.converters.IntegerConverterTest > testNullToBytes PASSED
org.apache.kafka.connect.converters.IntegerConverterTest > testSerializingIncorrectHeader STARTED
org.apache.kafka.connect.converters.IntegerConverterTest > testSerializingIncorrectHeader PASSED
org.apache.kafka.connect.converters.IntegerConverterTest > testDeserializingDataWithTooManyBytes STARTED
org.apache.kafka.connect.converters.IntegerConverterTest > testDeserializingDataWithTooManyBytes PASSED
org.apache.kafka.connect.converters.IntegerConverterTest > testConvertingSamplesToAndFromBytes STARTED
org.apache.kafka.connect.converters.IntegerConverterTest > testConvertingSamplesToAndFromBytes PASSED
org.apache.kafka.connect.converters.ByteArrayConverterTest > testFromConnectSchemaless STARTED
org.apache.kafka.connect.converters.ByteArrayConverterTest > testFromConnectSchemaless PASSED
org.apache.kafka.connect.converters.ByteArrayConverterTest > testToConnectNull STARTED
org.apache.kafka.connect.converters.ByteArrayConverterTest > testToConnectNull PASSED
org.apache.kafka.connect.converters.ByteArrayConverterTest > testFromConnectBadSchema STARTED
org.apache.kafka.connect.converters.ByteArrayConverterTest > testFromConnectBadSchema PASSED
org.apache.kafka.connect.converters.ByteArrayConverterTest > testFromConnectNull STARTED
org.apache.kafka.connect.converters.ByteArrayConverterTest > testFromConnectNull PASSED
org.apache.kafka.connect.converters.ByteArrayConverterTest > testToConnect STARTED
org.apache.kafka.connect.converters.ByteArrayConverterTest > testToConnect PASSED
org.apache.kafka.connect.converters.ByteArrayConverterTest > testFromConnect STARTED
org.apache.kafka.connect.converters.ByteArrayConverterTest > testFromConnect PASSED
org.apache.kafka.connect.converters.ByteArrayConverterTest > testFromConnectInvalidValue STARTED
org.apache.kafka.connect.converters.ByteArrayConverterTest > testFromConnectInvalidValue PASSED
org.apache.kafka.connect.converters.DoubleConverterTest > testBytesNullToNumber STARTED
org.apache.kafka.connect.converters.DoubleConverterTest > testBytesNullToNumber PASSED
org.apache.kafka.connect.converters.DoubleConverterTest > testSerializingIncorrectType STARTED
org.apache.kafka.connect.converters.DoubleConverterTest > testSerializingIncorrectType PASSED
org.apache.kafka.connect.converters.DoubleConverterTest > testDeserializingHeaderWithTooManyBytes STARTED
org.apache.kafka.connect.converters.DoubleConverterTest > testDeserializingHeaderWithTooManyBytes PASSED
org.apache.kafka.connect.converters.DoubleConverterTest > testNullToBytes STARTED
org.apache.kafka.connect.converters.DoubleConverterTest > testNullToBytes PASSED
org.apache.kafka.connect.converters.DoubleConverterTest > testSerializingIncorrectHeader STARTED
org.apache.kafka.connect.converters.DoubleConverterTest > testSerializingIncorrectHeader PASSED
org.apache.kafka.connect.converters.DoubleConverterTest > testDeserializingDataWithTooManyBytes STARTED
org.apache.kafka.connect.converters.DoubleConverterTest > testDeserializingDataWithTooManyBytes PASSED
org.apache.kafka.connect.converters.DoubleConverterTest > testConvertingSamplesToAndFromBytes STARTED
org.apache.kafka.connect.converters.DoubleConverterTest > testConvertingSamplesToAndFromBytes PASSED
org.apache.kafka.connect.converters.LongConverterTest > testBytesNullToNumber STARTED
org.apache.kafka.connect.converters.LongConverterTest > testBytesNullToNumber PASSED
org.apache.kafka.connect.converters.LongConverterTest > testSerializingIncorrectType STARTED
org.apache.kafka.connect.converters.LongConverterTest > testSerializingIncorrectType PASSED
org.apache.kafka.connect.converters.LongConverterTest > testDeserializingHeaderWithTooManyBytes STARTED
org.apache.kafka.connect.converters.LongConverterTest > testDeserializingHeaderWithTooManyBytes PASSED
org.apache.kafka.connect.converters.LongConverterTest > testNullToBytes STARTED
org.apache.kafka.connect.converters.LongConverterTest > testNullToBytes PASSED
org.apache.kafka.connect.converters.LongConverterTest > testSerializingIncorrectHeader STARTED
org.apache.kafka.connect.converters.LongConverterTest > testSerializingIncorrectHeader PASSED
org.apache.kafka.connect.converters.LongConverterTest > testDeserializingDataWithTooManyBytes STARTED
org.apache.kafka.connect.converters.LongConverterTest > testDeserializingDataWithTooManyBytes PASSED
org.apache.kafka.connect.converters.LongConverterTest > testConvertingSamplesToAndFromBytes STARTED
org.apache.kafka.connect.converters.LongConverterTest > testConvertingSamplesToAndFromBytes PASSED
org.apache.kafka.connect.converters.ShortConverterTest > testBytesNullToNumber STARTED
org.apache.kafka.connect.converters.ShortConverterTest > testBytesNullToNumber PASSED
org.apache.kafka.connect.converters.ShortConverterTest > testSerializingIncorrectType STARTED
org.apache.kafka.connect.converters.ShortConverterTest > testSerializingIncorrectType PASSED
org.apache.kafka.connect.converters.ShortConverterTest > testDeserializingHeaderWithTooManyBytes STARTED
org.apache.kafka.connect.converters.ShortConverterTest > testDeserializingHeaderWithTooManyBytes PASSED
org.apache.kafka.connect.converters.ShortConverterTest > testNullToBytes STARTED
org.apache.kafka.connect.converters.ShortConverterTest > testNullToBytes PASSED
org.apache.kafka.connect.converters.ShortConverterTest > testSerializingIncorrectHeader STARTED
org.apache.kafka.connect.converters.ShortConverterTest > testSerializingIncorrectHeader PASSED
org.apache.kafka.connect.converters.ShortConverterTest > testDeserializingDataWithTooManyBytes STARTED
org.apache.kafka.connect.converters.ShortConverterTest > testDeserializingDataWithTooManyBytes PASSED
org.apache.kafka.connect.converters.ShortConverterTest > testConvertingSamplesToAndFromBytes STARTED
org.apache.kafka.connect.converters.ShortConverterTest > testConvertingSamplesToAndFromBytes PASSED
org.apache.kafka.connect.connector.policy.NoneConnectorClientConfigOverridePolicyTest > testNoOverrides STARTED
org.apache.kafka.connect.connector.policy.NoneConnectorClientConfigOverridePolicyTest > testNoOverrides PASSED
org.apache.kafka.connect.connector.policy.NoneConnectorClientConfigOverridePolicyTest > testWithOverrides STARTED
org.apache.kafka.connect.connector.policy.NoneConnectorClientConfigOverridePolicyTest > testWithOverrides PASSED
org.apache.kafka.connect.connector.policy.PrincipalConnectorClientConfigOverridePolicyTest > testPrincipalPlusOtherConfigs STARTED
org.apache.kafka.connect.connector.policy.PrincipalConnectorClientConfigOverridePolicyTest > testPrincipalPlusOtherConfigs PASSED
org.apache.kafka.connect.connector.policy.PrincipalConnectorClientConfigOverridePolicyTest > testPrincipalOnly STARTED
org.apache.kafka.connect.connector.policy.PrincipalConnectorClientConfigOverridePolicyTest > testPrincipalOnly PASSED
470 tests completed, 1 failed
> Task :connect:runtime:test FAILED
FAILURE: Build failed with an exception.
* What went wrong:
Execution failed for task ':connect:runtime:test'.
> There were failing tests. See the report at: file://<https://builds.apache.org/job/kafka-trunk-jdk8/ws/connect/runtime/build/reports/tests/test/index.html>
* Try:
Run with --stacktrace option to get the stack trace. Run with --info or --debug option to get more log output. Run with --scan to get full insights.
* Get more help at https://help.gradle.org
Deprecated Gradle features were used in this build, making it incompatible with Gradle 6.0.
Use '--warning-mode all' to show the individual deprecation warnings.
See https://docs.gradle.org/5.4.1/userguide/command_line_interface.html#sec:command_line_warnings
BUILD FAILED in 3h 9m 37s
178 actionable tasks: 175 executed, 3 up-to-date
Build step 'Execute shell' marked build as failure
[FINDBUGS] Collecting findbugs analysis files...
Setting GRADLE_4_8_1_HOME=/home/jenkins/tools/gradle/4.8.1
[FINDBUGS] Searching for all files in <https://builds.apache.org/job/kafka-trunk-jdk8/ws/> that match the pattern **/build/reports/*bugs/*.xml
[FINDBUGS] Parsing 17 files in <https://builds.apache.org/job/kafka-trunk-jdk8/ws/>
[FINDBUGS] Successfully parsed file <https://builds.apache.org/job/kafka-trunk-jdk8/ws/clients/build/reports/spotbugs/main.xml> with 0 unique warnings and 0 duplicates.
[FINDBUGS] Successfully parsed file <https://builds.apache.org/job/kafka-trunk-jdk8/ws/connect/api/build/reports/spotbugs/main.xml> with 0 unique warnings and 0 duplicates.
[FINDBUGS] Successfully parsed file <https://builds.apache.org/job/kafka-trunk-jdk8/ws/connect/basic-auth-extension/build/reports/spotbugs/main.xml> with 0 unique warnings and 0 duplicates.
[FINDBUGS] Successfully parsed file <https://builds.apache.org/job/kafka-trunk-jdk8/ws/connect/file/build/reports/spotbugs/main.xml> with 0 unique warnings and 0 duplicates.
[FINDBUGS] Successfully parsed file <https://builds.apache.org/job/kafka-trunk-jdk8/ws/connect/json/build/reports/spotbugs/main.xml> with 0 unique warnings and 0 duplicates.
[FINDBUGS] Successfully parsed file <https://builds.apache.org/job/kafka-trunk-jdk8/ws/connect/runtime/build/reports/spotbugs/main.xml> with 0 unique warnings and 0 duplicates.
[FINDBUGS] Successfully parsed file <https://builds.apache.org/job/kafka-trunk-jdk8/ws/connect/transforms/build/reports/spotbugs/main.xml> with 0 unique warnings and 0 duplicates.
[FINDBUGS] Successfully parsed file <https://builds.apache.org/job/kafka-trunk-jdk8/ws/core/build/reports/spotbugs/main.xml> with 0 unique warnings and 0 duplicates.
[FINDBUGS] Successfully parsed file <https://builds.apache.org/job/kafka-trunk-jdk8/ws/examples/build/reports/spotbugs/main.xml> with 0 unique warnings and 0 duplicates.
[FINDBUGS] Successfully parsed file <https://builds.apache.org/job/kafka-trunk-jdk8/ws/generator/build/reports/spotbugs/main.xml> with 0 unique warnings and 0 duplicates.
[FINDBUGS] Successfully parsed file <https://builds.apache.org/job/kafka-trunk-jdk8/ws/jmh-benchmarks/build/reports/spotbugs/main.xml> with 0 unique warnings and 0 duplicates.
[FINDBUGS] Successfully parsed file <https://builds.apache.org/job/kafka-trunk-jdk8/ws/log4j-appender/build/reports/spotbugs/main.xml> with 0 unique warnings and 0 duplicates.
[FINDBUGS] Successfully parsed file <https://builds.apache.org/job/kafka-trunk-jdk8/ws/streams/build/reports/spotbugs/main.xml> with 0 unique warnings and 0 duplicates.
[FINDBUGS] Successfully parsed file <https://builds.apache.org/job/kafka-trunk-jdk8/ws/streams/examples/build/reports/spotbugs/main.xml> with 0 unique warnings and 0 duplicates.
[FINDBUGS] Successfully parsed file <https://builds.apache.org/job/kafka-trunk-jdk8/ws/streams/streams-scala/build/reports/spotbugs/main.xml> with 0 unique warnings and 0 duplicates.
[FINDBUGS] Successfully parsed file <https://builds.apache.org/job/kafka-trunk-jdk8/ws/streams/test-utils/build/reports/spotbugs/main.xml> with 0 unique warnings and 0 duplicates.
[FINDBUGS] Successfully parsed file <https://builds.apache.org/job/kafka-trunk-jdk8/ws/tools/build/reports/spotbugs/main.xml> with 0 unique warnings and 0 duplicates.
Setting GRADLE_4_8_1_HOME=/home/jenkins/tools/gradle/4.8.1
No credentials specified
Setting GRADLE_4_8_1_HOME=/home/jenkins/tools/gradle/4.8.1
<Git Blamer> Using GitBlamer to create author and commit information for all warnings.
<Git Blamer> GIT_COMMIT=9ad7bce492869e7d971bb7c83becf795622fa4dd, workspace=<https://builds.apache.org/job/kafka-trunk-jdk8/ws/>
[FINDBUGS] Computing warning deltas based on reference build #3796
Recording test results
Setting GRADLE_4_8_1_HOME=/home/jenkins/tools/gradle/4.8.1
Setting GRADLE_4_8_1_HOME=/home/jenkins/tools/gradle/4.8.1
Not sending mail to unregistered user ismael@juma.me.uk
Not sending mail to unregistered user noreply@github.com
Not sending mail to unregistered user wangguoz@gmail.com
Not sending mail to unregistered user rajinisivaram@googlemail.com
Build failed in Jenkins: kafka-trunk-jdk8 #3813
Posted by Apache Jenkins Server <je...@builds.apache.org>.
See <https://builds.apache.org/job/kafka-trunk-jdk8/3813/display/redirect?page=changes>
Changes:
[jason] KAFKA-8221; Add batch leave group request (#6714)
------------------------------------------
[...truncated 2.56 MB...]
org.apache.kafka.common.metrics.SensorTest > testRecordLevelEnum PASSED
org.apache.kafka.common.ClusterTest > testBootstrap STARTED
org.apache.kafka.common.ClusterTest > testBootstrap PASSED
> Task :streams:streams-scala:test
org.apache.kafka.streams.scala.StreamToTableJoinScalaIntegrationTestImplicitSerdes > testShouldCountClicksPerRegionWithNamedRepartitionTopic STARTED
org.apache.kafka.streams.scala.StreamToTableJoinScalaIntegrationTestImplicitSerdes > testShouldCountClicksPerRegionWithNamedRepartitionTopic PASSED
org.apache.kafka.streams.scala.StreamToTableJoinScalaIntegrationTestImplicitSerdes > testShouldCountClicksPerRegionJava STARTED
org.apache.kafka.streams.scala.StreamToTableJoinScalaIntegrationTestImplicitSerdes > testShouldCountClicksPerRegionJava PASSED
org.apache.kafka.streams.scala.StreamToTableJoinScalaIntegrationTestImplicitSerdes > testShouldCountClicksPerRegion STARTED
org.apache.kafka.streams.scala.StreamToTableJoinScalaIntegrationTestImplicitSerdes > testShouldCountClicksPerRegion PASSED
org.apache.kafka.streams.scala.kstream.SuppressedTest > Suppressed.untilWindowCloses should produce the correct suppression STARTED
org.apache.kafka.streams.scala.kstream.SuppressedTest > Suppressed.untilWindowCloses should produce the correct suppression PASSED
org.apache.kafka.streams.scala.kstream.SuppressedTest > Suppressed.untilTimeLimit should produce the correct suppression STARTED
org.apache.kafka.streams.scala.kstream.SuppressedTest > Suppressed.untilTimeLimit should produce the correct suppression PASSED
org.apache.kafka.streams.scala.kstream.SuppressedTest > BufferConfig.maxRecords should produce the correct buffer config STARTED
org.apache.kafka.streams.scala.kstream.SuppressedTest > BufferConfig.maxRecords should produce the correct buffer config PASSED
org.apache.kafka.streams.scala.kstream.SuppressedTest > BufferConfig.maxBytes should produce the correct buffer config STARTED
org.apache.kafka.streams.scala.kstream.SuppressedTest > BufferConfig.maxBytes should produce the correct buffer config PASSED
org.apache.kafka.streams.scala.kstream.SuppressedTest > BufferConfig.unbounded should produce the correct buffer config STARTED
org.apache.kafka.streams.scala.kstream.SuppressedTest > BufferConfig.unbounded should produce the correct buffer config PASSED
org.apache.kafka.streams.scala.kstream.SuppressedTest > BufferConfig should support very long chains of factory methods STARTED
org.apache.kafka.streams.scala.kstream.SuppressedTest > BufferConfig should support very long chains of factory methods PASSED
org.apache.kafka.streams.scala.kstream.ConsumedTest > Create a Consumed should create a Consumed with Serdes STARTED
org.apache.kafka.streams.scala.kstream.ConsumedTest > Create a Consumed should create a Consumed with Serdes PASSED
org.apache.kafka.streams.scala.kstream.ConsumedTest > Create a Consumed with timestampExtractor and resetPolicy should create a Consumed with Serdes, timestampExtractor and resetPolicy STARTED
org.apache.kafka.streams.scala.kstream.ConsumedTest > Create a Consumed with timestampExtractor and resetPolicy should create a Consumed with Serdes, timestampExtractor and resetPolicy PASSED
org.apache.kafka.streams.scala.kstream.ConsumedTest > Create a Consumed with timestampExtractor should create a Consumed with Serdes and timestampExtractor STARTED
org.apache.kafka.streams.scala.kstream.ConsumedTest > Create a Consumed with timestampExtractor should create a Consumed with Serdes and timestampExtractor PASSED
org.apache.kafka.streams.scala.kstream.ConsumedTest > Create a Consumed with resetPolicy should create a Consumed with Serdes and resetPolicy STARTED
org.apache.kafka.streams.scala.kstream.ConsumedTest > Create a Consumed with resetPolicy should create a Consumed with Serdes and resetPolicy PASSED
org.apache.kafka.streams.scala.kstream.ProducedTest > Create a Produced should create a Produced with Serdes STARTED
org.apache.kafka.streams.scala.kstream.ProducedTest > Create a Produced should create a Produced with Serdes PASSED
org.apache.kafka.streams.scala.kstream.ProducedTest > Create a Produced with timestampExtractor and resetPolicy should create a Consumed with Serdes, timestampExtractor and resetPolicy STARTED
org.apache.kafka.streams.scala.kstream.ProducedTest > Create a Produced with timestampExtractor and resetPolicy should create a Consumed with Serdes, timestampExtractor and resetPolicy PASSED
org.apache.kafka.streams.scala.kstream.GroupedTest > Create a Grouped should create a Grouped with Serdes STARTED
org.apache.kafka.streams.scala.kstream.GroupedTest > Create a Grouped should create a Grouped with Serdes PASSED
org.apache.kafka.streams.scala.kstream.GroupedTest > Create a Grouped with repartition topic name should create a Grouped with Serdes, and repartition topic name STARTED
org.apache.kafka.streams.scala.kstream.GroupedTest > Create a Grouped with repartition topic name should create a Grouped with Serdes, and repartition topic name PASSED
org.apache.kafka.streams.scala.kstream.JoinedTest > Create a Joined should create a Joined with Serdes STARTED
org.apache.kafka.streams.scala.kstream.JoinedTest > Create a Joined should create a Joined with Serdes PASSED
org.apache.kafka.streams.scala.kstream.JoinedTest > Create a Joined should create a Joined with Serdes and repartition topic name STARTED
org.apache.kafka.streams.scala.kstream.JoinedTest > Create a Joined should create a Joined with Serdes and repartition topic name PASSED
org.apache.kafka.streams.scala.kstream.KTableTest > filter a KTable should filter records satisfying the predicate STARTED
org.apache.kafka.streams.scala.kstream.KTableTest > filter a KTable should filter records satisfying the predicate PASSED
org.apache.kafka.streams.scala.kstream.KTableTest > filterNot a KTable should filter records not satisfying the predicate STARTED
org.apache.kafka.streams.scala.kstream.KTableTest > filterNot a KTable should filter records not satisfying the predicate PASSED
org.apache.kafka.streams.scala.kstream.KTableTest > join 2 KTables should join correctly records STARTED
org.apache.kafka.streams.scala.kstream.KTableTest > join 2 KTables should join correctly records PASSED
org.apache.kafka.streams.scala.kstream.KTableTest > join 2 KTables with a Materialized should join correctly records and state store STARTED
org.apache.kafka.streams.scala.kstream.KTableTest > join 2 KTables with a Materialized should join correctly records and state store PASSED
org.apache.kafka.streams.scala.kstream.KTableTest > windowed KTable#suppress should correctly suppress results using Suppressed.untilTimeLimit STARTED
org.apache.kafka.streams.scala.kstream.KTableTest > windowed KTable#suppress should correctly suppress results using Suppressed.untilTimeLimit PASSED
org.apache.kafka.streams.scala.kstream.KTableTest > windowed KTable#suppress should correctly suppress results using Suppressed.untilWindowCloses STARTED
org.apache.kafka.streams.scala.kstream.KTableTest > windowed KTable#suppress should correctly suppress results using Suppressed.untilWindowCloses PASSED
org.apache.kafka.streams.scala.kstream.KTableTest > session windowed KTable#suppress should correctly suppress results using Suppressed.untilWindowCloses STARTED
org.apache.kafka.streams.scala.kstream.KTableTest > session windowed KTable#suppress should correctly suppress results using Suppressed.untilWindowCloses PASSED
org.apache.kafka.streams.scala.kstream.KTableTest > non-windowed KTable#suppress should correctly suppress results using Suppressed.untilTimeLimit STARTED
org.apache.kafka.streams.scala.kstream.KTableTest > non-windowed KTable#suppress should correctly suppress results using Suppressed.untilTimeLimit PASSED
org.apache.kafka.streams.scala.kstream.MaterializedTest > Create a Materialized should create a Materialized with Serdes STARTED
org.apache.kafka.streams.scala.kstream.MaterializedTest > Create a Materialized should create a Materialized with Serdes PASSED
org.apache.kafka.streams.scala.kstream.MaterializedTest > Create a Materialize with a store name should create a Materialized with Serdes and a store name STARTED
org.apache.kafka.streams.scala.kstream.MaterializedTest > Create a Materialize with a store name should create a Materialized with Serdes and a store name PASSED
org.apache.kafka.streams.scala.kstream.MaterializedTest > Create a Materialize with a window store supplier should create a Materialized with Serdes and a store supplier STARTED
org.apache.kafka.streams.scala.kstream.MaterializedTest > Create a Materialize with a window store supplier should create a Materialized with Serdes and a store supplier PASSED
org.apache.kafka.streams.scala.kstream.MaterializedTest > Create a Materialize with a key value store supplier should create a Materialized with Serdes and a store supplier STARTED
org.apache.kafka.streams.scala.kstream.MaterializedTest > Create a Materialize with a key value store supplier should create a Materialized with Serdes and a store supplier PASSED
org.apache.kafka.streams.scala.kstream.MaterializedTest > Create a Materialize with a session store supplier should create a Materialized with Serdes and a store supplier STARTED
org.apache.kafka.streams.scala.kstream.MaterializedTest > Create a Materialize with a session store supplier should create a Materialized with Serdes and a store supplier PASSED
org.apache.kafka.streams.scala.kstream.KStreamTest > filter a KStream should filter records satisfying the predicate STARTED
org.apache.kafka.streams.scala.kstream.KStreamTest > filter a KStream should filter records satisfying the predicate PASSED
org.apache.kafka.streams.scala.kstream.KStreamTest > filterNot a KStream should filter records not satisfying the predicate STARTED
org.apache.kafka.streams.scala.kstream.KStreamTest > filterNot a KStream should filter records not satisfying the predicate PASSED
org.apache.kafka.streams.scala.kstream.KStreamTest > foreach a KStream should run foreach actions on records STARTED
org.apache.kafka.streams.scala.kstream.KStreamTest > foreach a KStream should run foreach actions on records PASSED
org.apache.kafka.streams.scala.kstream.KStreamTest > peek a KStream should run peek actions on records STARTED
org.apache.kafka.streams.scala.kstream.KStreamTest > peek a KStream should run peek actions on records PASSED
org.apache.kafka.streams.scala.kstream.KStreamTest > selectKey a KStream should select a new key STARTED
org.apache.kafka.streams.scala.kstream.KStreamTest > selectKey a KStream should select a new key PASSED
org.apache.kafka.streams.scala.kstream.KStreamTest > join 2 KStreams should join correctly records STARTED
org.apache.kafka.streams.scala.kstream.KStreamTest > join 2 KStreams should join correctly records PASSED
org.apache.kafka.streams.scala.WordCountTest > testShouldCountWordsMaterialized STARTED
org.apache.kafka.streams.scala.WordCountTest > testShouldCountWordsMaterialized PASSED
org.apache.kafka.streams.scala.WordCountTest > testShouldCountWordsJava STARTED
org.apache.kafka.streams.scala.WordCountTest > testShouldCountWordsJava PASSED
org.apache.kafka.streams.scala.WordCountTest > testShouldCountWords STARTED
org.apache.kafka.streams.scala.WordCountTest > testShouldCountWords PASSED
org.apache.kafka.streams.scala.TopologyTest > shouldBuildIdenticalTopologyInJavaNScalaJoin STARTED
org.apache.kafka.streams.scala.TopologyTest > shouldBuildIdenticalTopologyInJavaNScalaJoin PASSED
org.apache.kafka.streams.scala.TopologyTest > shouldBuildIdenticalTopologyInJavaNScalaSimple STARTED
org.apache.kafka.streams.scala.TopologyTest > shouldBuildIdenticalTopologyInJavaNScalaSimple PASSED
org.apache.kafka.streams.scala.TopologyTest > shouldBuildIdenticalTopologyInJavaNScalaAggregate STARTED
org.apache.kafka.streams.scala.TopologyTest > shouldBuildIdenticalTopologyInJavaNScalaAggregate PASSED
org.apache.kafka.streams.scala.TopologyTest > shouldBuildIdenticalTopologyInJavaNScalaProperties STARTED
org.apache.kafka.streams.scala.TopologyTest > shouldBuildIdenticalTopologyInJavaNScalaProperties PASSED
org.apache.kafka.streams.scala.TopologyTest > shouldBuildIdenticalTopologyInJavaNScalaTransform STARTED
org.apache.kafka.streams.scala.TopologyTest > shouldBuildIdenticalTopologyInJavaNScalaTransform PASSED
> Task :streams:examples:test
org.apache.kafka.streams.examples.wordcount.WordCountProcessorTest > test STARTED
org.apache.kafka.streams.examples.wordcount.WordCountProcessorTest > test PASSED
FAILURE: Build failed with an exception.
* What went wrong:
Execution failed for task ':connect:runtime:test'.
> There were failing tests. See the report at: file://<https://builds.apache.org/job/kafka-trunk-jdk8/ws/connect/runtime/build/reports/tests/test/index.html>
* Try:
Run with --stacktrace option to get the stack trace. Run with --info or --debug option to get more log output. Run with --scan to get full insights.
* Get more help at https://help.gradle.org
Deprecated Gradle features were used in this build, making it incompatible with Gradle 6.0.
Use '--warning-mode all' to show the individual deprecation warnings.
See https://docs.gradle.org/5.4.1/userguide/command_line_interface.html#sec:command_line_warnings
BUILD FAILED in 3h 1m 7s
178 actionable tasks: 152 executed, 26 up-to-date
Build step 'Execute shell' marked build as failure
[FINDBUGS] Collecting findbugs analysis files...
Setting GRADLE_4_8_1_HOME=/home/jenkins/tools/gradle/4.8.1
[FINDBUGS] Searching for all files in <https://builds.apache.org/job/kafka-trunk-jdk8/ws/> that match the pattern **/build/reports/*bugs/*.xml
[FINDBUGS] Parsing 17 files in <https://builds.apache.org/job/kafka-trunk-jdk8/ws/>
[FINDBUGS] Successfully parsed file <https://builds.apache.org/job/kafka-trunk-jdk8/ws/clients/build/reports/spotbugs/main.xml> with 0 unique warnings and 0 duplicates.
[FINDBUGS] Successfully parsed file <https://builds.apache.org/job/kafka-trunk-jdk8/ws/connect/api/build/reports/spotbugs/main.xml> with 0 unique warnings and 0 duplicates.
[FINDBUGS] Successfully parsed file <https://builds.apache.org/job/kafka-trunk-jdk8/ws/connect/basic-auth-extension/build/reports/spotbugs/main.xml> with 0 unique warnings and 0 duplicates.
[FINDBUGS] Successfully parsed file <https://builds.apache.org/job/kafka-trunk-jdk8/ws/connect/file/build/reports/spotbugs/main.xml> with 0 unique warnings and 0 duplicates.
[FINDBUGS] Successfully parsed file <https://builds.apache.org/job/kafka-trunk-jdk8/ws/connect/json/build/reports/spotbugs/main.xml> with 0 unique warnings and 0 duplicates.
[FINDBUGS] Successfully parsed file <https://builds.apache.org/job/kafka-trunk-jdk8/ws/connect/runtime/build/reports/spotbugs/main.xml> with 0 unique warnings and 0 duplicates.
[FINDBUGS] Successfully parsed file <https://builds.apache.org/job/kafka-trunk-jdk8/ws/connect/transforms/build/reports/spotbugs/main.xml> with 0 unique warnings and 0 duplicates.
[FINDBUGS] Successfully parsed file <https://builds.apache.org/job/kafka-trunk-jdk8/ws/core/build/reports/spotbugs/main.xml> with 0 unique warnings and 0 duplicates.
[FINDBUGS] Successfully parsed file <https://builds.apache.org/job/kafka-trunk-jdk8/ws/examples/build/reports/spotbugs/main.xml> with 0 unique warnings and 0 duplicates.
[FINDBUGS] Successfully parsed file <https://builds.apache.org/job/kafka-trunk-jdk8/ws/generator/build/reports/spotbugs/main.xml> with 0 unique warnings and 0 duplicates.
[FINDBUGS] Successfully parsed file <https://builds.apache.org/job/kafka-trunk-jdk8/ws/jmh-benchmarks/build/reports/spotbugs/main.xml> with 0 unique warnings and 0 duplicates.
[FINDBUGS] Successfully parsed file <https://builds.apache.org/job/kafka-trunk-jdk8/ws/log4j-appender/build/reports/spotbugs/main.xml> with 0 unique warnings and 0 duplicates.
[FINDBUGS] Successfully parsed file <https://builds.apache.org/job/kafka-trunk-jdk8/ws/streams/build/reports/spotbugs/main.xml> with 0 unique warnings and 0 duplicates.
[FINDBUGS] Successfully parsed file <https://builds.apache.org/job/kafka-trunk-jdk8/ws/streams/examples/build/reports/spotbugs/main.xml> with 0 unique warnings and 0 duplicates.
[FINDBUGS] Successfully parsed file <https://builds.apache.org/job/kafka-trunk-jdk8/ws/streams/streams-scala/build/reports/spotbugs/main.xml> with 0 unique warnings and 0 duplicates.
[FINDBUGS] Successfully parsed file <https://builds.apache.org/job/kafka-trunk-jdk8/ws/streams/test-utils/build/reports/spotbugs/main.xml> with 0 unique warnings and 0 duplicates.
[FINDBUGS] Successfully parsed file <https://builds.apache.org/job/kafka-trunk-jdk8/ws/tools/build/reports/spotbugs/main.xml> with 0 unique warnings and 0 duplicates.
Setting GRADLE_4_8_1_HOME=/home/jenkins/tools/gradle/4.8.1
No credentials specified
Setting GRADLE_4_8_1_HOME=/home/jenkins/tools/gradle/4.8.1
<Git Blamer> Using GitBlamer to create author and commit information for all warnings.
<Git Blamer> GIT_COMMIT=74c90f46c34727be9484e9826ff543b451ada775, workspace=<https://builds.apache.org/job/kafka-trunk-jdk8/ws/>
[FINDBUGS] Computing warning deltas based on reference build #3796
Recording test results
Setting GRADLE_4_8_1_HOME=/home/jenkins/tools/gradle/4.8.1
Setting GRADLE_4_8_1_HOME=/home/jenkins/tools/gradle/4.8.1
Not sending mail to unregistered user noreply@github.com
Not sending mail to unregistered user wangguoz@gmail.com
Not sending mail to unregistered user rajinisivaram@googlemail.com
Build failed in Jenkins: kafka-trunk-jdk8 #3812
Posted by Apache Jenkins Server <je...@builds.apache.org>.
See <https://builds.apache.org/job/kafka-trunk-jdk8/3812/display/redirect?page=changes>
Changes:
[jason] KAFKA-8715; Fix buggy reliance on state timestamp in static member.id
------------------------------------------
[...truncated 6.45 MB...]
org.apache.kafka.connect.runtime.distributed.DistributedHerderTest > testRebalance STARTED
org.apache.kafka.connect.runtime.distributed.DistributedHerderTest > testRebalance PASSED
org.apache.kafka.connect.runtime.distributed.DistributedHerderTest > testIncrementalCooperativeRebalanceForNewMember STARTED
org.apache.kafka.connect.runtime.distributed.DistributedHerderTest > testIncrementalCooperativeRebalanceForNewMember PASSED
org.apache.kafka.connect.runtime.distributed.DistributedHerderTest > testIncrementalCooperativeRebalanceForExistingMember STARTED
org.apache.kafka.connect.runtime.distributed.DistributedHerderTest > testIncrementalCooperativeRebalanceForExistingMember PASSED
org.apache.kafka.connect.runtime.distributed.DistributedHerderTest > testIncrementalCooperativeRebalanceWithDelay STARTED
org.apache.kafka.connect.runtime.distributed.DistributedHerderTest > testIncrementalCooperativeRebalanceWithDelay PASSED
org.apache.kafka.connect.runtime.distributed.DistributedHerderTest > testRebalanceFailedConnector STARTED
org.apache.kafka.connect.runtime.distributed.DistributedHerderTest > testRebalanceFailedConnector PASSED
org.apache.kafka.connect.runtime.distributed.DistributedHerderTest > testHaltCleansUpWorker STARTED
org.apache.kafka.connect.runtime.distributed.DistributedHerderTest > testHaltCleansUpWorker PASSED
org.apache.kafka.connect.runtime.distributed.DistributedHerderTest > testConnectorNameConflictsWithWorkerGroupId STARTED
org.apache.kafka.connect.runtime.distributed.DistributedHerderTest > testConnectorNameConflictsWithWorkerGroupId PASSED
org.apache.kafka.connect.runtime.distributed.DistributedHerderTest > testRestartUnknownConnector STARTED
org.apache.kafka.connect.runtime.distributed.DistributedHerderTest > testRestartUnknownConnector PASSED
org.apache.kafka.connect.runtime.distributed.DistributedHerderTest > testRestartConnectorRedirectToLeader STARTED
org.apache.kafka.connect.runtime.distributed.DistributedHerderTest > testRestartConnectorRedirectToLeader PASSED
org.apache.kafka.connect.runtime.distributed.DistributedHerderTest > testRestartConnectorRedirectToOwner STARTED
org.apache.kafka.connect.runtime.distributed.DistributedHerderTest > testRestartConnectorRedirectToOwner PASSED
org.apache.kafka.connect.runtime.distributed.DistributedHerderTest > testRestartUnknownTask STARTED
org.apache.kafka.connect.runtime.distributed.DistributedHerderTest > testRestartUnknownTask PASSED
org.apache.kafka.connect.runtime.distributed.DistributedHerderTest > testRequestProcessingOrder STARTED
org.apache.kafka.connect.runtime.distributed.DistributedHerderTest > testRequestProcessingOrder PASSED
org.apache.kafka.connect.runtime.distributed.DistributedHerderTest > testRestartTaskRedirectToLeader STARTED
org.apache.kafka.connect.runtime.distributed.DistributedHerderTest > testRestartTaskRedirectToLeader PASSED
org.apache.kafka.connect.runtime.distributed.DistributedHerderTest > testRestartTaskRedirectToOwner STARTED
org.apache.kafka.connect.runtime.distributed.DistributedHerderTest > testRestartTaskRedirectToOwner PASSED
org.apache.kafka.connect.runtime.distributed.DistributedHerderTest > testConnectorConfigAdded STARTED
org.apache.kafka.connect.runtime.distributed.DistributedHerderTest > testConnectorConfigAdded PASSED
org.apache.kafka.connect.runtime.distributed.DistributedHerderTest > testConnectorConfigUpdate STARTED
org.apache.kafka.connect.runtime.distributed.DistributedHerderTest > testConnectorConfigUpdate PASSED
org.apache.kafka.connect.runtime.distributed.DistributedHerderTest > testConnectorPaused STARTED
org.apache.kafka.connect.runtime.distributed.DistributedHerderTest > testConnectorPaused PASSED
org.apache.kafka.connect.runtime.distributed.DistributedHerderTest > testConnectorResumed STARTED
org.apache.kafka.connect.runtime.distributed.DistributedHerderTest > testConnectorResumed PASSED
org.apache.kafka.connect.runtime.distributed.DistributedHerderTest > testUnknownConnectorPaused STARTED
org.apache.kafka.connect.runtime.distributed.DistributedHerderTest > testUnknownConnectorPaused PASSED
org.apache.kafka.connect.runtime.distributed.DistributedHerderTest > testConnectorPausedRunningTaskOnly STARTED
org.apache.kafka.connect.runtime.distributed.DistributedHerderTest > testConnectorPausedRunningTaskOnly PASSED
org.apache.kafka.connect.runtime.distributed.DistributedHerderTest > testConnectorResumedRunningTaskOnly STARTED
org.apache.kafka.connect.runtime.distributed.DistributedHerderTest > testConnectorResumedRunningTaskOnly PASSED
org.apache.kafka.connect.runtime.distributed.DistributedHerderTest > testTaskConfigAdded STARTED
org.apache.kafka.connect.runtime.distributed.DistributedHerderTest > testTaskConfigAdded PASSED
org.apache.kafka.connect.runtime.distributed.DistributedHerderTest > testJoinLeaderCatchUpFails STARTED
org.apache.kafka.connect.runtime.distributed.DistributedHerderTest > testJoinLeaderCatchUpFails PASSED
org.apache.kafka.connect.runtime.distributed.DistributedHerderTest > testInconsistentConfigs STARTED
org.apache.kafka.connect.runtime.distributed.DistributedHerderTest > testInconsistentConfigs PASSED
org.apache.kafka.connect.runtime.distributed.WorkerCoordinatorIncrementalTest > testMetadataWithExistingAssignmentButOlderProtocolSelection[0] STARTED
org.apache.kafka.connect.runtime.distributed.WorkerCoordinatorIncrementalTest > testMetadataWithExistingAssignmentButOlderProtocolSelection[0] PASSED
org.apache.kafka.connect.runtime.distributed.WorkerCoordinatorIncrementalTest > testMetadataWithExistingAssignment[0] STARTED
org.apache.kafka.connect.runtime.distributed.WorkerCoordinatorIncrementalTest > testMetadataWithExistingAssignment[0] PASSED
org.apache.kafka.connect.runtime.distributed.WorkerCoordinatorIncrementalTest > testTaskAssignmentWhenWorkerBounces[0] STARTED
org.apache.kafka.connect.runtime.distributed.WorkerCoordinatorIncrementalTest > testTaskAssignmentWhenWorkerBounces[0] PASSED
org.apache.kafka.connect.runtime.distributed.WorkerCoordinatorIncrementalTest > testTaskAssignmentWhenWorkerJoins[0] STARTED
org.apache.kafka.connect.runtime.distributed.WorkerCoordinatorIncrementalTest > testTaskAssignmentWhenWorkerJoins[0] PASSED
org.apache.kafka.connect.runtime.distributed.WorkerCoordinatorIncrementalTest > testTaskAssignmentWhenWorkerLeavesPermanently[0] STARTED
org.apache.kafka.connect.runtime.distributed.WorkerCoordinatorIncrementalTest > testTaskAssignmentWhenWorkerLeavesPermanently[0] PASSED
org.apache.kafka.connect.runtime.distributed.WorkerCoordinatorIncrementalTest > testMetadata[0] STARTED
org.apache.kafka.connect.runtime.distributed.WorkerCoordinatorIncrementalTest > testMetadata[0] PASSED
org.apache.kafka.connect.runtime.distributed.ConnectProtocolCompatibilityTest > testCoopToCoopMetadata STARTED
org.apache.kafka.connect.runtime.distributed.ConnectProtocolCompatibilityTest > testCoopToCoopMetadata PASSED
org.apache.kafka.connect.runtime.distributed.ConnectProtocolCompatibilityTest > testCoopToEagerAssignment STARTED
org.apache.kafka.connect.runtime.distributed.ConnectProtocolCompatibilityTest > testCoopToEagerAssignment PASSED
org.apache.kafka.connect.runtime.distributed.ConnectProtocolCompatibilityTest > testCoopToCoopAssignment STARTED
org.apache.kafka.connect.runtime.distributed.ConnectProtocolCompatibilityTest > testCoopToCoopAssignment PASSED
org.apache.kafka.connect.runtime.distributed.ConnectProtocolCompatibilityTest > testEagerToCoopAssignment STARTED
org.apache.kafka.connect.runtime.distributed.ConnectProtocolCompatibilityTest > testEagerToCoopAssignment PASSED
org.apache.kafka.connect.runtime.distributed.ConnectProtocolCompatibilityTest > testEagerToEagerAssignment STARTED
org.apache.kafka.connect.runtime.distributed.ConnectProtocolCompatibilityTest > testEagerToEagerAssignment PASSED
org.apache.kafka.connect.runtime.distributed.ConnectProtocolCompatibilityTest > testCoopToEagerMetadata STARTED
org.apache.kafka.connect.runtime.distributed.ConnectProtocolCompatibilityTest > testCoopToEagerMetadata PASSED
org.apache.kafka.connect.runtime.distributed.ConnectProtocolCompatibilityTest > testEagerToEagerMetadata STARTED
org.apache.kafka.connect.runtime.distributed.ConnectProtocolCompatibilityTest > testEagerToEagerMetadata PASSED
org.apache.kafka.connect.runtime.distributed.ConnectProtocolCompatibilityTest > testEagerToCoopMetadata STARTED
org.apache.kafka.connect.runtime.distributed.ConnectProtocolCompatibilityTest > testEagerToCoopMetadata PASSED
org.apache.kafka.connect.runtime.ConnectorConfigTest > unconfiguredTransform STARTED
org.apache.kafka.connect.runtime.ConnectorConfigTest > unconfiguredTransform PASSED
org.apache.kafka.connect.runtime.ConnectorConfigTest > multipleTransformsOneDangling STARTED
org.apache.kafka.connect.runtime.ConnectorConfigTest > multipleTransformsOneDangling PASSED
org.apache.kafka.connect.runtime.ConnectorConfigTest > misconfiguredTransform STARTED
org.apache.kafka.connect.runtime.ConnectorConfigTest > misconfiguredTransform PASSED
org.apache.kafka.connect.runtime.ConnectorConfigTest > noTransforms STARTED
org.apache.kafka.connect.runtime.ConnectorConfigTest > noTransforms PASSED
org.apache.kafka.connect.runtime.ConnectorConfigTest > danglingTransformAlias STARTED
org.apache.kafka.connect.runtime.ConnectorConfigTest > danglingTransformAlias PASSED
org.apache.kafka.connect.runtime.ConnectorConfigTest > emptyConnectorName STARTED
org.apache.kafka.connect.runtime.ConnectorConfigTest > emptyConnectorName PASSED
org.apache.kafka.connect.runtime.ConnectorConfigTest > multipleTransforms STARTED
org.apache.kafka.connect.runtime.ConnectorConfigTest > multipleTransforms PASSED
org.apache.kafka.connect.runtime.ConnectorConfigTest > singleTransform STARTED
org.apache.kafka.connect.runtime.ConnectorConfigTest > singleTransform PASSED
org.apache.kafka.connect.runtime.ConnectorConfigTest > wrongTransformationType STARTED
org.apache.kafka.connect.runtime.ConnectorConfigTest > wrongTransformationType PASSED
470 tests completed, 1 failed
> Task :connect:runtime:test FAILED
> Task :streams:examples:test
org.apache.kafka.streams.examples.wordcount.WordCountProcessorTest > test STARTED
org.apache.kafka.streams.examples.wordcount.WordCountProcessorTest > test PASSED
FAILURE: Build failed with an exception.
* What went wrong:
Execution failed for task ':connect:runtime:test'.
> There were failing tests. See the report at: file://<https://builds.apache.org/job/kafka-trunk-jdk8/ws/connect/runtime/build/reports/tests/test/index.html>
* Try:
Run with --stacktrace option to get the stack trace. Run with --info or --debug option to get more log output. Run with --scan to get full insights.
* Get more help at https://help.gradle.org
Deprecated Gradle features were used in this build, making it incompatible with Gradle 6.0.
Use '--warning-mode all' to show the individual deprecation warnings.
See https://docs.gradle.org/5.4.1/userguide/command_line_interface.html#sec:command_line_warnings
BUILD FAILED in 2h 7m 39s
178 actionable tasks: 175 executed, 3 up-to-date
Build step 'Execute shell' marked build as failure
[FINDBUGS] Collecting findbugs analysis files...
Setting GRADLE_4_8_1_HOME=/home/jenkins/tools/gradle/4.8.1
[FINDBUGS] Searching for all files in <https://builds.apache.org/job/kafka-trunk-jdk8/ws/> that match the pattern **/build/reports/*bugs/*.xml
[FINDBUGS] Parsing 17 files in <https://builds.apache.org/job/kafka-trunk-jdk8/ws/>
[FINDBUGS] Successfully parsed file <https://builds.apache.org/job/kafka-trunk-jdk8/ws/clients/build/reports/spotbugs/main.xml> with 0 unique warnings and 0 duplicates.
[FINDBUGS] Successfully parsed file <https://builds.apache.org/job/kafka-trunk-jdk8/ws/connect/api/build/reports/spotbugs/main.xml> with 0 unique warnings and 0 duplicates.
[FINDBUGS] Successfully parsed file <https://builds.apache.org/job/kafka-trunk-jdk8/ws/connect/basic-auth-extension/build/reports/spotbugs/main.xml> with 0 unique warnings and 0 duplicates.
[FINDBUGS] Successfully parsed file <https://builds.apache.org/job/kafka-trunk-jdk8/ws/connect/file/build/reports/spotbugs/main.xml> with 0 unique warnings and 0 duplicates.
[FINDBUGS] Successfully parsed file <https://builds.apache.org/job/kafka-trunk-jdk8/ws/connect/json/build/reports/spotbugs/main.xml> with 0 unique warnings and 0 duplicates.
[FINDBUGS] Successfully parsed file <https://builds.apache.org/job/kafka-trunk-jdk8/ws/connect/runtime/build/reports/spotbugs/main.xml> with 0 unique warnings and 0 duplicates.
[FINDBUGS] Successfully parsed file <https://builds.apache.org/job/kafka-trunk-jdk8/ws/connect/transforms/build/reports/spotbugs/main.xml> with 0 unique warnings and 0 duplicates.
[FINDBUGS] Successfully parsed file <https://builds.apache.org/job/kafka-trunk-jdk8/ws/core/build/reports/spotbugs/main.xml> with 0 unique warnings and 0 duplicates.
[FINDBUGS] Successfully parsed file <https://builds.apache.org/job/kafka-trunk-jdk8/ws/examples/build/reports/spotbugs/main.xml> with 0 unique warnings and 0 duplicates.
[FINDBUGS] Successfully parsed file <https://builds.apache.org/job/kafka-trunk-jdk8/ws/generator/build/reports/spotbugs/main.xml> with 0 unique warnings and 0 duplicates.
[FINDBUGS] Successfully parsed file <https://builds.apache.org/job/kafka-trunk-jdk8/ws/jmh-benchmarks/build/reports/spotbugs/main.xml> with 0 unique warnings and 0 duplicates.
[FINDBUGS] Successfully parsed file <https://builds.apache.org/job/kafka-trunk-jdk8/ws/log4j-appender/build/reports/spotbugs/main.xml> with 0 unique warnings and 0 duplicates.
[FINDBUGS] Successfully parsed file <https://builds.apache.org/job/kafka-trunk-jdk8/ws/streams/build/reports/spotbugs/main.xml> with 0 unique warnings and 0 duplicates.
[FINDBUGS] Successfully parsed file <https://builds.apache.org/job/kafka-trunk-jdk8/ws/streams/examples/build/reports/spotbugs/main.xml> with 0 unique warnings and 0 duplicates.
[FINDBUGS] Successfully parsed file <https://builds.apache.org/job/kafka-trunk-jdk8/ws/streams/streams-scala/build/reports/spotbugs/main.xml> with 0 unique warnings and 0 duplicates.
[FINDBUGS] Successfully parsed file <https://builds.apache.org/job/kafka-trunk-jdk8/ws/streams/test-utils/build/reports/spotbugs/main.xml> with 0 unique warnings and 0 duplicates.
[FINDBUGS] Successfully parsed file <https://builds.apache.org/job/kafka-trunk-jdk8/ws/tools/build/reports/spotbugs/main.xml> with 0 unique warnings and 0 duplicates.
Setting GRADLE_4_8_1_HOME=/home/jenkins/tools/gradle/4.8.1
No credentials specified
Setting GRADLE_4_8_1_HOME=/home/jenkins/tools/gradle/4.8.1
<Git Blamer> Using GitBlamer to create author and commit information for all warnings.
<Git Blamer> GIT_COMMIT=79341a12f235510d9f78af24d979102c3d8882e1, workspace=<https://builds.apache.org/job/kafka-trunk-jdk8/ws/>
[FINDBUGS] Computing warning deltas based on reference build #3796
Recording test results
Setting GRADLE_4_8_1_HOME=/home/jenkins/tools/gradle/4.8.1
Setting GRADLE_4_8_1_HOME=/home/jenkins/tools/gradle/4.8.1
Not sending mail to unregistered user noreply@github.com
Not sending mail to unregistered user wangguoz@gmail.com
Not sending mail to unregistered user rajinisivaram@googlemail.com