You are viewing a plain text version of this content. The canonical link for it is here.
Posted to dev@aurora.apache.org by Apache Jenkins Server <je...@builds.apache.org> on 2016/03/09 02:42:13 UTC

Build failed in Jenkins: aurora-packaging-nightly #219

See <https://builds.apache.org/job/aurora-packaging-nightly/219/changes>

Changes:

[maxim] Implementing db snapshotting

[maxim] Fixed bug with LocalSchedulerMain not starting up due to missing

[john.sirois] Upgrade ZooKeeper to 3.4.8.

------------------------------------------
[...truncated 30068 lines...]
Setting up rename (0.20-3) ...
update-alternatives: using /usr/bin/file-rename to provide /usr/bin/rename (rename) in auto mode
Setting up rsync (3.1.1-3) ...
invoke-rc.d: policy-rc.d denied execution of restart.
Setting up shared-mime-info (1.3-1) ...
Setting up strace (4.9-2) ...
Setting up unzip (6.0-16+deb8u2) ...
Setting up wdiff (1.2.2-1) ...
Setting up xauth (1:1.0.9-1) ...
Setting up xdg-user-dirs (0.15-2) ...
Setting up xml-core (0.13+nmu2) ...
Setting up equivs (2.0.9) ...
Setting up libkrb5-dev (1.12.1+dfsg-19+deb8u2) ...
Setting up libsvn-dev (1.8.10-6+deb8u2) ...
Setting up thrift-compiler (0.9.1-2) ...
Setting up python3 (3.4.2-2) ...
Setting up devscripts (2.15.3) ...
Setting up liblwp-protocol-https-perl (6.06-2) ...
Setting up python3-apt (0.9.3.12) ...
Setting up python3-pkg-resources (5.5.1-1) ...
Setting up python3-chardet (2.3.0-1) ...
Setting up python3-dbus (1.2.0-2+b3) ...
Setting up python3-six (1.8.0-1) ...
Setting up python3-debian (0.1.27) ...
Setting up python3-gi (3.14.0-1) ...
Setting up python3-magic (1:5.22+15-2+deb8u1) ...
Setting up unattended-upgrades (0.83.3.2+deb8u1) ...
update-rc.d: warning: start and stop actions are no longer supported; falling back to defaults
Setting up python3-software-properties (0.92.25debian1) ...
Setting up software-properties-common (0.92.25debian1) ...
Setting up dh-python (1.20141111-2) ...
Setting up libwww-perl (6.08-1) ...
Setting up libparse-debcontrol-perl (2.005-4) ...
Setting up libxml-parser-perl (2.41-3) ...
Setting up libsoap-lite-perl (1.11-1) ...
Setting up libxmlrpc-lite-perl (0.717-1) ...
Processing triggers for systemd (215-17+deb8u3) ...
Processing triggers for libc-bin (2.19-18+deb8u3) ...
Processing triggers for ca-certificates (20141019+deb8u1) ...
Updating certificates in /etc/ssl/certs... 174 added, 0 removed; done.
Running hooks in /etc/ca-certificates/update.d....done.
Processing triggers for sgml-base (1.26+nmu4) ...
Processing triggers for dbus (1.8.20-0+deb8u1) ...
 ---> d46952e6c927
Removing intermediate container d8fa9c1d6c56
Step 6 : RUN apt-get -y -t jessie-backports install openjdk-8-jdk    && update-alternatives --set java /usr/lib/jvm/java-8-openjdk-amd64/jre/bin/java
 ---> Running in 8461ac136d80
Reading package lists...
Building dependency tree...
Reading state information...
The following extra packages will be installed:
  ca-certificates-java dbus-x11 fontconfig fontconfig-config fonts-dejavu-core
  fonts-dejavu-extra gconf-service gconf2 gconf2-common gnome-mime-data
  hicolor-icon-theme java-common libasound2 libasound2-data libasyncns0
  libatk-wrapper-java libatk-wrapper-java-jni libatk1.0-0 libatk1.0-data
  libavahi-client3 libavahi-common-data libavahi-common3 libavahi-glib1
  libbonobo2-0 libbonobo2-common libcairo2 libcanberra0 libcups2 libdatrie1
  libdrm-amdgpu1 libdrm-intel1 libdrm-nouveau2 libdrm-radeon1 libdrm2 libelf1
  libflac8 libfontconfig1 libfreetype6 libgconf-2-4 libgconf2-4
  libgdk-pixbuf2.0-0 libgdk-pixbuf2.0-common libgif4 libgl1-mesa-dri
  libgl1-mesa-glx libglapi-mesa libgnome-2-0 libgnome2-0 libgnome2-bin
  libgnome2-common libgnomevfs2-0 libgnomevfs2-common libgnomevfs2-extra
  libgraphite2-3 libgtk2.0-0 libgtk2.0-bin libgtk2.0-common libharfbuzz0b
  libice-dev libice6 libjasper1 libjbig0 libjpeg62-turbo libjson-c2 liblcms2-2
  libllvm3.5 libltdl7 libnspr4 libnss3 libogg0 liborbit-2-0 libpango-1.0-0
  libpangocairo-1.0-0 libpangoft2-1.0-0 libpciaccess0 libpcsclite1
  libpixman-1-0 libpng12-0 libpthread-stubs0-dev libpulse0 libsm-dev libsm6
  libsndfile1 libtdb1 libthai-data libthai0 libtiff5 libtxc-dxtn-s2tc0
  libvorbis0a libvorbisenc2 libvorbisfile3 libwrap0 libx11-dev libx11-doc
  libx11-xcb1 libxau-dev libxcb-dri2-0 libxcb-dri3-0 libxcb-glx0
  libxcb-present0 libxcb-render0 libxcb-shm0 libxcb-sync1 libxcb1-dev
  libxcomposite1 libxcursor1 libxdamage1 libxdmcp-dev libxfixes3 libxi6
  libxinerama1 libxrandr2 libxrender1 libxshmfence1 libxt-dev libxt6 libxtst6
  libxxf86vm1 openjdk-8-jre openjdk-8-jre-headless tcpd x11-common
  x11proto-core-dev x11proto-input-dev x11proto-kb-dev xorg-sgml-doctools
  xtrans-dev
Suggested packages:
  gconf-defaults-service default-jre libasound2-plugins alsa-utils
  libbonobo2-bin libcanberra-gtk0 libcanberra-pulse cups-common desktop-base
  libgnomevfs2-bin librsvg2-common gvfs libice-doc libjasper-runtime
  liblcms2-utils pciutils pcscd pulseaudio libsm-doc libxcb-doc libxt-doc
  openjdk-8-demo openjdk-8-source visualvm icedtea-8-plugin
  openjdk-8-jre-jamvm libnss-mdns fonts-ipafont-gothic fonts-ipafont-mincho
  ttf-wqy-microhei ttf-wqy-zenhei fonts-indic
The following NEW packages will be installed:
  ca-certificates-java dbus-x11 fontconfig fontconfig-config fonts-dejavu-core
  fonts-dejavu-extra gconf-service gconf2 gconf2-common gnome-mime-data
  hicolor-icon-theme java-common libasound2 libasound2-data libasyncns0
  libatk-wrapper-java libatk-wrapper-java-jni libatk1.0-0 libatk1.0-data
  libavahi-client3 libavahi-common-data libavahi-common3 libavahi-glib1
  libbonobo2-0 libbonobo2-common libcairo2 libcanberra0 libcups2 libdatrie1
  libdrm-amdgpu1 libdrm-intel1 libdrm-nouveau2 libdrm-radeon1 libdrm2 libelf1
  libflac8 libfontconfig1 libfreetype6 libgconf-2-4 libgconf2-4
  libgdk-pixbuf2.0-0 libgdk-pixbuf2.0-common libgif4 libgl1-mesa-dri
  libgl1-mesa-glx libglapi-mesa libgnome-2-0 libgnome2-0 libgnome2-bin
  libgnome2-common libgnomevfs2-0 libgnomevfs2-common libgnomevfs2-extra
  libgraphite2-3 libgtk2.0-0 libgtk2.0-bin libgtk2.0-common libharfbuzz0b
  libice-dev libice6 libjasper1 libjbig0 libjpeg62-turbo libjson-c2 liblcms2-2
  libllvm3.5 libltdl7 libnspr4 libnss3 libogg0 liborbit-2-0 libpango-1.0-0
  libpangocairo-1.0-0 libpangoft2-1.0-0 libpciaccess0 libpcsclite1
  libpixman-1-0 libpng12-0 libpthread-stubs0-dev libpulse0 libsm-dev libsm6
  libsndfile1 libtdb1 libthai-data libthai0 libtiff5 libtxc-dxtn-s2tc0
  libvorbis0a libvorbisenc2 libvorbisfile3 libwrap0 libx11-dev libx11-doc
  libx11-xcb1 libxau-dev libxcb-dri2-0 libxcb-dri3-0 libxcb-glx0
  libxcb-present0 libxcb-render0 libxcb-shm0 libxcb-sync1 libxcb1-dev
  libxcomposite1 libxcursor1 libxdamage1 libxdmcp-dev libxfixes3 libxi6
  libxinerama1 libxrandr2 libxrender1 libxshmfence1 libxt-dev libxt6 libxtst6
  libxxf86vm1 openjdk-8-jdk openjdk-8-jre openjdk-8-jre-headless tcpd
  x11-common x11proto-core-dev x11proto-input-dev x11proto-kb-dev
  xorg-sgml-doctools xtrans-dev
0 upgraded, 128 newly installed, 0 to remove and 10 not upgraded.
Need to get 80.4 MB of archives.
After this operation, 306 MB of additional disk space will be used.
Get:1 http://security.debian.org/ jessie/updates/main libjasper1 amd64 1.900.1-debian1-2.4+deb8u1 [134 kB]
Get:2 http://security.debian.org/ jessie/updates/main libtiff5 amd64 4.0.3-12.3+deb8u1 [213 kB]
Get:3 http://security.debian.org/ jessie/updates/main libgraphite2-3 amd64 1.3.5-1~deb8u1 [76.9 kB]
Get:4 http://httpredir.debian.org/debian/ jessie/main libjson-c2 amd64 0.11-4 [24.8 kB]
Get:5 http://httpredir.debian.org/debian/ jessie/main libfreetype6 amd64 2.5.2-3+deb8u1 [466 kB]
Get:6 http://httpredir.debian.org/debian/ jessie/main fonts-dejavu-core all 2.34-1 [1047 kB]
Get:7 http://httpredir.debian.org/debian/ jessie/main fontconfig-config all 2.11.0-6.3 [273 kB]
Get:8 http://httpredir.debian.org/debian/ jessie/main libfontconfig1 amd64 2.11.0-6.3 [329 kB]
Get:9 http://httpredir.debian.org/debian/ jessie/main libwrap0 amd64 7.6.q-25 [58.5 kB]
Get:10 http://httpredir.debian.org/debian/ jessie/main libasound2-data all 1.0.28-1 [64.8 kB]
Get:11 http://httpredir.debian.org/debian/ jessie/main libasound2 amd64 1.0.28-1 [374 kB]
Get:12 http://httpredir.debian.org/debian/ jessie/main libasyncns0 amd64 0.8-5 [12.5 kB]
Get:13 http://httpredir.debian.org/debian/ jessie/main libatk1.0-0 amd64 2.14.0-1 [92.0 kB]
Get:14 http://httpredir.debian.org/debian/ jessie/main libpng12-0 amd64 1.2.50-2+deb8u2 [173 kB]
Get:15 http://httpredir.debian.org/debian/ jessie/main libxcb-render0 amd64 1.10-3+b1 [17.5 kB]
Get:16 http://httpredir.debian.org/debian/ jessie/main libjpeg62-turbo amd64 1:1.3.1-12 [116 kB]
Get:17 http://httpredir.debian.org/debian/ jessie/main libjbig0 amd64 2.1-3.1 [30.7 kB]
Get:18 http://httpredir.debian.org/debian/ jessie/main libgdk-pixbuf2.0-common all 2.31.1-2+deb8u4 [294 kB]
Get:19 http://httpredir.debian.org/debian/ jessie/main libgdk-pixbuf2.0-0 amd64 2.31.1-2+deb8u4 [166 kB]
Get:20 http://httpredir.debian.org/debian/ jessie/main libgtk2.0-common all 2.24.25-3 [3123 kB]
Get:21 http://httpredir.debian.org/debian/ jessie/main libavahi-client3 amd64 0.6.31-5 [54.4 kB]
Get:22 http://httpredir.debian.org/debian/ jessie/main libcups2 amd64 1.7.5-11+deb8u1 [283 kB]
Get:23 http://httpredir.debian.org/debian/ jessie/main libthai0 amd64 0.1.21-1 [46.1 kB]
Get:24 http://httpredir.debian.org/debian/ jessie/main libpango-1.0-0 amd64 1.36.8-3 [291 kB]
Get:25 http://httpredir.debian.org/debian/ jessie/main libpangoft2-1.0-0 amd64 1.36.8-3 [213 kB]
Get:26 http://httpredir.debian.org/debian/ jessie/main libpangocairo-1.0-0 amd64 1.36.8-3 [200 kB]
Get:27 http://httpredir.debian.org/debian/ jessie/main fontconfig amd64 2.11.0-6.3 [402 kB]
Get:28 http://httpredir.debian.org/debian/ jessie/main libxcursor1 amd64 1:1.1.14-1+b1 [35.1 kB]
Get:29 http://httpredir.debian.org/debian/ jessie/main libxdamage1 amd64 1:1.1.4-2+b1 [14.7 kB]
Get:30 http://httpredir.debian.org/debian/ jessie/main libxi6 amd64 2:1.7.4-1+b2 [79.7 kB]
Get:31 http://httpredir.debian.org/debian/ jessie/main libxinerama1 amd64 2:1.1.3-1+b1 [16.9 kB]
Get:32 http://httpredir.debian.org/debian/ jessie/main libxrandr2 amd64 2:1.4.2-1+b1 [35.5 kB]
Get:33 http://httpredir.debian.org/debian/ jessie/main libgtk2.0-0 amd64 2.24.25-3 [2301 kB]
Get:34 http://httpredir.debian.org/debian/ jessie/main libatk-wrapper-java all 0.30.5-1 [30.3 kB]
Get:35 http://httpredir.debian.org/debian/ jessie/main libatk-wrapper-java-jni amd64 0.30.5-1 [24.8 kB]
Get:36 http://httpredir.debian.org/debian/ jessie/main liborbit-2-0 amd64 1:2.14.19-0.3 [223 kB]
Get:37 http://httpredir.debian.org/debian/ jessie/main libbonobo2-0 amd64 2.32.1-3 [274 kB]
Get:38 http://httpredir.debian.org/debian/ jessie/main libogg0 amd64 1.3.2-1 [19.9 kB]
Get:39 http://httpredir.debian.org/debian/ jessie/main libtdb1 amd64 1.3.1-1 [41.2 kB]
Get:40 http://httpredir.debian.org/debian/ jessie/main libvorbis0a amd64 1.3.4-2 [92.9 kB]
Get:41 http://httpredir.debian.org/debian/ jessie/main libvorbisfile3 amd64 1.3.4-2 [23.7 kB]
Get:42 http://httpredir.debian.org/debian/ jessie/main libcanberra0 amd64 0.30-2.1 [36.8 kB]
Get:43 http://httpredir.debian.org/debian/ jessie-backports/main libdrm2 amd64 2.4.66-2~bpo8+1 [35.5 kB]
Get:44 http://httpredir.debian.org/debian/ jessie-backports/main libdrm-amdgpu1 amd64 2.4.66-2~bpo8+1 [24.0 kB]
Get:45 http://httpredir.debian.org/debian/ jessie/main libpciaccess0 amd64 0.13.2-3+b1 [47.6 kB]
Get:46 http://httpredir.debian.org/debian/ jessie-backports/main libdrm-intel1 amd64 2.4.66-2~bpo8+1 [65.5 kB]
Get:47 http://httpredir.debian.org/debian/ jessie-backports/main libdrm-nouveau2 amd64 2.4.66-2~bpo8+1 [24.9 kB]
Get:48 http://httpredir.debian.org/debian/ jessie-backports/main libdrm-radeon1 amd64 2.4.66-2~bpo8+1 [29.9 kB]
Get:49 http://httpredir.debian.org/debian/ jessie/main libelf1 amd64 0.159-4.2 [160 kB]
Get:50 http://httpredir.debian.org/debian/ jessie/main libflac8 amd64 1.3.0-3 [89.3 kB]
Get:51 http://httpredir.debian.org/debian/ jessie/main gconf2-common all 3.2.6-3 [1040 kB]
Get:52 http://httpredir.debian.org/debian/ jessie/main libgconf-2-4 amd64 3.2.6-3 [426 kB]
Get:53 http://httpredir.debian.org/debian/ jessie/main libgif4 amd64 4.1.6-11 [39.8 kB]
Get:54 http://httpredir.debian.org/debian/ jessie-backports/main libllvm3.5 amd64 1:3.5.2-3~bpo8+2 [7621 kB]
Get:55 http://httpredir.debian.org/debian/ jessie/main libx11-xcb1 amd64 2:1.6.2-3 [163 kB]
Get:56 http://httpredir.debian.org/debian/ jessie/main libxcb-dri2-0 amd64 1.10-3+b1 [12.9 kB]
Get:57 http://httpredir.debian.org/debian/ jessie/main libxcb-dri3-0 amd64 1.10-3+b1 [11.1 kB]
Get:58 http://httpredir.debian.org/debian/ jessie/main libxcb-glx0 amd64 1.10-3+b1 [27.4 kB]
Get:59 http://httpredir.debian.org/debian/ jessie/main libxcb-sync1 amd64 1.10-3+b1 [14.4 kB]
Get:60 http://httpredir.debian.org/debian/ jessie/main libxshmfence1 amd64 1.1-4 [6736 B]
Get:61 http://httpredir.debian.org/debian/ jessie/main libxxf86vm1 amd64 1:1.1.3-1+b1 [19.6 kB]
Get:62 http://httpredir.debian.org/debian/ jessie-backports/main libgl1-mesa-glx amd64 11.1.2-1~bpo8+1 [163 kB]
Get:63 http://httpredir.debian.org/debian/ jessie/main dbus-x11 amd64 1.8.20-0+deb8u1 [73.3 kB]
Get:64 http://httpredir.debian.org/debian/ jessie/main libatk1.0-data all 2.14.0-1 [181 kB]
Get:65 http://httpredir.debian.org/debian/ jessie/main gnome-mime-data all 2.18.0-1 [725 kB]
Get:66 http://httpredir.debian.org/debian/ jessie/main libgnomevfs2-common all 1:2.24.4-6 [763 kB]
Get:67 http://httpredir.debian.org/debian/ jessie/main libgnomevfs2-0 amd64 1:2.24.4-6+b1 [493 kB]
Get:68 http://httpredir.debian.org/debian/ jessie/main libgnome2-common all 2.32.1-5 [936 kB]
Get:69 http://httpredir.debian.org/debian/ jessie/main libgnome-2-0 amd64 2.32.1-5 [471 kB]
Get:70 http://httpredir.debian.org/debian/ jessie/main x11-common all 1:7.7+7 [287 kB]
Get:71 http://httpredir.debian.org/debian/ jessie/main libice6 amd64 2:1.0.9-1+b1 [58.8 kB]
Get:72 http://httpredir.debian.org/debian/ jessie/main libnss3 amd64 2:3.17.2-1.1+deb8u2 [1130 kB]
Get:73 http://httpredir.debian.org/debian/ jessie/main libsm6 amd64 2:1.2.2-1+b1 [33.6 kB]
Get:74 http://httpredir.debian.org/debian/ jessie/main libvorbisenc2 amd64 1.3.4-2 [77.9 kB]
Get:75 http://httpredir.debian.org/debian/ jessie/main libsndfile1 amd64 1.0.25-9.1 [214 kB]
Get:76 http://httpredir.debian.org/debian/ jessie/main libxtst6 amd64 2:1.2.2-1+b1 [27.3 kB]
Get:77 http://httpredir.debian.org/debian/ jessie/main libpixman-1-0 amd64 0.32.6-3 [507 kB]
Get:78 http://httpredir.debian.org/debian/ jessie/main libxt6 amd64 1:1.1.4-1+b1 [186 kB]
Get:79 http://httpredir.debian.org/debian/ jessie/main ca-certificates-java all 20140324 [13.7 kB]
Get:80 http://httpredir.debian.org/debian/ jessie/main java-common all 0.52 [136 kB]
Get:81 http://httpredir.debian.org/debian/ jessie-backports/main openjdk-8-jre-headless amd64 8u72-b15-1~bpo8+1 [26.9 MB]
Err http://httpredir.debian.org/debian/ jessie/main fonts-dejavu-extra all 2.34-1
  Error reading from server. Remote end closed connection [IP: 5.153.231.35 80]
Get:82 http://httpredir.debian.org/debian/ jessie/main libtxc-dxtn-s2tc0 amd64 0~git20131104-1.1 [51.6 kB]
Get:83 http://httpredir.debian.org/debian/ jessie/main libgnome2-bin amd64 2.32.1-5 [434 kB]
Get:84 http://httpredir.debian.org/debian/ jessie/main libgnome2-0 amd64 2.32.1-5 [430 kB]
Get:85 http://httpredir.debian.org/debian/ jessie/main libgnomevfs2-extra amd64 1:2.24.4-6+b1 [366 kB]
Get:86 http://httpredir.debian.org/debian/ jessie/main xorg-sgml-doctools all 1:1.11-1 [21.9 kB]
Get:87 http://httpredir.debian.org/debian/ jessie/main x11proto-core-dev all 7.0.26-1 [729 kB]
Get:88 http://httpredir.debian.org/debian/ jessie/main libice-dev amd64 2:1.0.9-1+b1 [66.3 kB]
Get:89 http://httpredir.debian.org/debian/ jessie/main libsm-dev amd64 2:1.2.2-1+b1 [35.8 kB]
Get:90 http://httpredir.debian.org/debian/ jessie/main libxau-dev amd64 1:1.0.8-1 [23.6 kB]
Get:91 http://httpredir.debian.org/debian/ jessie/main libxdmcp-dev amd64 1:1.1.1-1+b1 [40.2 kB]
Get:92 http://httpredir.debian.org/debian/ jessie/main x11proto-kb-dev all 1.0.6-2 [269 kB]
Get:93 http://httpredir.debian.org/debian/ jessie/main libxcb1-dev amd64 1.10-3+b1 [83.8 kB]
Get:94 http://httpredir.debian.org/debian/ jessie/main libx11-dev amd64 2:1.6.2-3 [800 kB]
Get:95 http://httpredir.debian.org/debian/ jessie/main libx11-doc all 2:1.6.2-3 [2026 kB]
Get:96 http://httpredir.debian.org/debian/ jessie-backports/main openjdk-8-jre amd64 8u72-b15-1~bpo8+1 [58.3 kB]
Get:97 http://httpredir.debian.org/debian/ jessie/main tcpd amd64 7.6.q-25 [22.9 kB]
Get:98 http://httpredir.debian.org/debian/ jessie/main libxcb-shm0 amd64 1.10-3+b1 [11.5 kB]
Get:99 http://httpredir.debian.org/debian/ jessie/main libxrender1 amd64 1:0.9.8-1+b1 [31.4 kB]
Get:100 http://httpredir.debian.org/debian/ jessie/main libcairo2 amd64 1.14.0-2.1 [742 kB]
Get:101 http://httpredir.debian.org/debian/ jessie/main libavahi-common-data amd64 0.6.31-5 [98.6 kB]
Get:102 http://httpredir.debian.org/debian/ jessie/main libavahi-common3 amd64 0.6.31-5 [51.1 kB]
Get:103 http://httpredir.debian.org/debian/ jessie/main libthai-data all 0.1.21-1 [159 kB]
Get:104 http://httpredir.debian.org/debian/ jessie/main libdatrie1 amd64 0.2.8-1 [32.6 kB]
Get:105 http://httpredir.debian.org/debian/ jessie/main libharfbuzz0b amd64 0.9.35-2 [485 kB]
Get:106 http://httpredir.debian.org/debian/ jessie/main libxcomposite1 amd64 1:0.4.4-1 [17.4 kB]
Get:107 http://httpredir.debian.org/debian/ jessie/main libxfixes3 amd64 1:5.0.1-2+b2 [21.3 kB]
Get:108 http://httpredir.debian.org/debian/ jessie/main libavahi-glib1 amd64 0.6.31-5 [36.4 kB]
Get:109 http://httpredir.debian.org/debian/ jessie/main libbonobo2-common all 2.32.1-3 [243 kB]
Get:110 http://httpredir.debian.org/debian/ jessie/main libltdl7 amd64 2.4.2-1.11 [45.2 kB]
Get:111 http://httpredir.debian.org/debian/ jessie-backports/main libgl1-mesa-dri amd64 11.1.2-1~bpo8+1 [4519 kB]
Get:112 http://httpredir.debian.org/debian/ jessie-backports/main libglapi-mesa amd64 11.1.2-1~bpo8+1 [56.4 kB]
Get:113 http://httpredir.debian.org/debian/ jessie/main libxcb-present0 amd64 1.10-3+b1 [11.1 kB]
Get:114 http://httpredir.debian.org/debian/ jessie/main gconf-service amd64 3.2.6-3 [414 kB]
Get:115 http://httpredir.debian.org/debian/ jessie/main gconf2 amd64 3.2.6-3 [423 kB]
Get:116 http://httpredir.debian.org/debian/ jessie/main liblcms2-2 amd64 2.6-3+b3 [141 kB]
Get:117 http://httpredir.debian.org/debian/ jessie/main libnspr4 amd64 2:4.10.7-1+deb8u1 [117 kB]
Get:118 http://httpredir.debian.org/debian/ jessie/main libpcsclite1 amd64 1.8.13-1 [56.2 kB]
Get:119 http://httpredir.debian.org/debian/ jessie-backports/main libpulse0 amd64 7.1-2~bpo8+1 [268 kB]
Get:120 http://httpredir.debian.org/debian/ jessie/main hicolor-icon-theme all 0.13-1 [8600 B]
Get:121 http://httpredir.debian.org/debian/ jessie/main libgconf2-4 amd64 3.2.6-3 [358 kB]
Get:122 http://httpredir.debian.org/debian/ jessie/main libgtk2.0-bin amd64 2.24.25-3 [534 kB]
Get:123 http://httpredir.debian.org/debian/ jessie/main libpthread-stubs0-dev amd64 0.3-4 [3866 B]
Get:124 http://httpredir.debian.org/debian/ jessie/main x11proto-input-dev all 2.3.1-1 [157 kB]
Get:125 http://httpredir.debian.org/debian/ jessie/main xtrans-dev all 1.3.4-1 [99.3 kB]
Get:126 http://httpredir.debian.org/debian/ jessie/main libxt-dev amd64 1:1.1.4-1+b1 [421 kB]
Get:127 http://httpredir.debian.org/debian/ jessie-backports/main openjdk-8-jdk amd64 8u72-b15-1~bpo8+1 [8599 kB]
Fetched 78.7 MB in 2min 4s (632 kB/s)
E: Failed to fetch http://httpredir.debian.org/debian/pool/main/f/fonts-dejavu/fonts-dejavu-extra_2.34-1_all.deb  Error reading from server. Remote end closed connection [IP: 5.153.231.35 80]

E: Unable to fetch some archives, maybe run apt-get update or try with --fix-missing?
The command '/bin/sh -c apt-get -y -t jessie-backports install openjdk-8-jdk    && update-alternatives --set java /usr/lib/jvm/java-8-openjdk-amd64/jre/bin/java' returned a non-zero code: 100
Build step 'Execute shell' marked build as failure
Skipped archiving because build is not successful

Jenkins build is back to normal : aurora-packaging-nightly #225

Posted by Apache Jenkins Server <je...@builds.apache.org>.
See <https://builds.apache.org/job/aurora-packaging-nightly/225/changes>


Build failed in Jenkins: aurora-packaging-nightly #224

Posted by Apache Jenkins Server <je...@builds.apache.org>.
See <https://builds.apache.org/job/aurora-packaging-nightly/224/>

------------------------------------------
[...truncated 6861 lines...]
00:40:08 00:09     [jvm]
00:40:08 00:09     [dup]
00:40:08 00:09   [complete]
               SUCCESS
/scratch/pants binary src/main/python/apache/aurora/tools:thermos_observer
fatal: Not a git repository (or any of the parent directories): .git

00:40:09 00:00 [main]
               (To run a reporting server: ./pants server)
00:40:09 00:00   [setup]
00:40:09 00:00     [parse]fatal: Not a git repository (or any of the parent directories): .git

               Executing tasks in goals: bootstrap -> imports -> unpack-jars -> deferred-sources -> gen -> jvm-platform-validate -> resolve -> compile -> resources -> binary
00:40:09 00:00   [bootstrap]
00:40:09 00:00     [jar-dependency-management]
00:40:09 00:00     [bootstrap-jvm-tools]
00:40:09 00:00   [imports]
00:40:09 00:00     [ivy-imports]
00:40:09 00:00   [unpack-jars]
00:40:09 00:00     [unpack-jars]
00:40:10 00:01   [deferred-sources]
00:40:10 00:01     [deferred-sources]
00:40:10 00:01   [gen]
00:40:10 00:01     [thrift]
00:40:10 00:01     [protoc]
00:40:10 00:01     [antlr]
00:40:10 00:01     [ragel]
00:40:10 00:01     [jaxb]
00:40:10 00:01     [wire]
00:40:10 00:01   [jvm-platform-validate]
00:40:10 00:01     [jvm-platform-validate]
00:40:10 00:01   [resolve]
00:40:10 00:01     [ivy]
00:40:10 00:01   [compile]
00:40:10 00:01     [compile-jvm-prep-command]
00:40:10 00:01       [jvm_prep_command]
00:40:10 00:01     [compile-prep-command]
00:40:10 00:01     [python-eval]
00:40:10 00:01     [pythonstyle]
00:40:10 00:01       [cache] 
                   No cached artifacts for 1 target.
                   Invalidated 1 target.
00:40:10 00:01     [compile]
00:40:10 00:01     [zinc]
00:40:10 00:01     [jvm-dep-check]
00:40:10 00:01   [resources]
00:40:10 00:01     [prepare]
00:40:10 00:01     [services]
00:40:10 00:01   [binary]
00:40:10 00:01     [binary-jvm-prep-command]
00:40:10 00:01       [jvm_prep_command]
00:40:10 00:01     [binary-prep-command]
00:40:10 00:01     [python-binary-create]
00:40:10 00:01       [chroot]
00:40:12 00:03     [jvm]
00:40:13 00:04     [dup]
00:40:13 00:04   [complete]
               SUCCESS
/scratch/pants binary src/main/python/apache/thermos/runner:thermos_runner
fatal: Not a git repository (or any of the parent directories): .git

00:40:14 00:00 [main]
               (To run a reporting server: ./pants server)
00:40:14 00:00   [setup]
00:40:14 00:00     [parse]fatal: Not a git repository (or any of the parent directories): .git

               Executing tasks in goals: bootstrap -> imports -> unpack-jars -> deferred-sources -> gen -> jvm-platform-validate -> resolve -> compile -> resources -> binary
00:40:14 00:00   [bootstrap]
00:40:14 00:00     [jar-dependency-management]
00:40:14 00:00     [bootstrap-jvm-tools]
00:40:14 00:00   [imports]
00:40:14 00:00     [ivy-imports]
00:40:14 00:00   [unpack-jars]
00:40:14 00:00     [unpack-jars]
00:40:14 00:00   [deferred-sources]
00:40:14 00:00     [deferred-sources]
00:40:14 00:00   [gen]
00:40:14 00:00     [thrift]
00:40:14 00:00     [protoc]
00:40:14 00:00     [antlr]
00:40:14 00:00     [ragel]
00:40:14 00:00     [jaxb]
00:40:14 00:00     [wire]
00:40:14 00:00   [jvm-platform-validate]
00:40:14 00:00     [jvm-platform-validate]
00:40:14 00:00   [resolve]
00:40:14 00:00     [ivy]
00:40:15 00:01   [compile]
00:40:15 00:01     [compile-jvm-prep-command]
00:40:15 00:01       [jvm_prep_command]
00:40:15 00:01     [compile-prep-command]
00:40:15 00:01     [python-eval]
00:40:15 00:01     [pythonstyle]
00:40:15 00:01       [cache] 
                   No cached artifacts for 1 target.
                   Invalidated 1 target.
00:40:15 00:01     [compile]
00:40:15 00:01     [zinc]
00:40:15 00:01     [jvm-dep-check]
00:40:15 00:01   [resources]
00:40:15 00:01     [prepare]
00:40:15 00:01     [services]
00:40:15 00:01   [binary]
00:40:15 00:01     [binary-jvm-prep-command]
00:40:15 00:01       [jvm_prep_command]
00:40:15 00:01     [binary-prep-command]
00:40:15 00:01     [python-binary-create]
00:40:15 00:01       [chroot]
00:40:16 00:02     [jvm]
00:40:16 00:02     [dup]
00:40:16 00:02   [complete]
               SUCCESS
build-support/embed_runner_in_executor.py
dh override_dh_auto_build --exclude=aurora-scheduler.bat
make[1]: Leaving directory `/scratch'
   dh_auto_test -O--exclude=aurora-scheduler.bat
 debian/rules binary
dh binary --exclude=aurora-scheduler.bat
   dh_testroot -O--exclude=aurora-scheduler.bat
   dh_prep -O--exclude=aurora-scheduler.bat
   dh_installdirs -O--exclude=aurora-scheduler.bat
   dh_auto_install -O--exclude=aurora-scheduler.bat
   dh_install -O--exclude=aurora-scheduler.bat
   dh_installdocs -O--exclude=aurora-scheduler.bat
   dh_installchangelogs -O--exclude=aurora-scheduler.bat
   dh_installexamples -O--exclude=aurora-scheduler.bat
   debian/rules override_dh_installinit
make[1]: Entering directory `/scratch'
dh_installinit --name=thermos
dh_installinit
make[1]: Leaving directory `/scratch'
   dh_perl -O--exclude=aurora-scheduler.bat
   dh_link -O--exclude=aurora-scheduler.bat
   dh_compress -O--exclude=aurora-scheduler.bat
   dh_fixperms -O--exclude=aurora-scheduler.bat
   dh_strip -O--exclude=aurora-scheduler.bat
   dh_makeshlibs -O--exclude=aurora-scheduler.bat
   dh_shlibdeps -O--exclude=aurora-scheduler.bat
   dh_installdeb -O--exclude=aurora-scheduler.bat
   dh_gencontrol -O--exclude=aurora-scheduler.bat
dpkg-gencontrol: warning: Depends field of package aurora-scheduler: unknown substitution variable ${shlibs:Depends}
dpkg-gencontrol: warning: Depends field of package aurora-tools: unknown substitution variable ${shlibs:Depends}
dpkg-gencontrol: warning: Depends field of package aurora-executor: unknown substitution variable ${shlibs:Depends}
   dh_md5sums -O--exclude=aurora-scheduler.bat
   dh_builddeb -O--exclude=aurora-scheduler.bat
dpkg-deb: building package `aurora-scheduler' in `../aurora-scheduler_0.13.0snapshot.2016.03.14_amd64.deb'.
dpkg-deb: building package `aurora-tools' in `../aurora-tools_0.13.0snapshot.2016.03.14_amd64.deb'.
dpkg-deb: building package `aurora-executor' in `../aurora-executor_0.13.0snapshot.2016.03.14_amd64.deb'.
dpkg-deb: building package `aurora-doc' in `../aurora-doc_0.13.0snapshot.2016.03.14_all.deb'.
 dpkg-genchanges -b >../apache-aurora_0.13.0snapshot.2016.03.14_amd64.changes
dpkg-genchanges: binary-only upload - not including any source code
 debian/rules clean
dh clean --exclude=aurora-scheduler.bat
   dh_testdir -O--exclude=aurora-scheduler.bat
   dh_auto_clean -O--exclude=aurora-scheduler.bat
   dh_clean -O--exclude=aurora-scheduler.bat
 dpkg-source --after-build scratch
dpkg-buildpackage: binary only upload (no source included)
+ mkdir /dist
+ mv ../aurora-doc_0.13.0snapshot.2016.03.14_all.deb ../aurora-executor_0.13.0snapshot.2016.03.14_amd64.deb ../aurora-scheduler_0.13.0snapshot.2016.03.14_amd64.deb ../aurora-tools_0.13.0snapshot.2016.03.14_amd64.deb /dist
015e00a82203
Produced artifacts in artifacts/aurora-ubuntu-trusty:
artifacts/aurora-ubuntu-trusty:
dist

artifacts/aurora-ubuntu-trusty/dist:
aurora-doc_0.13.0snapshot.2016.02.28_all.deb
aurora-doc_0.13.0snapshot.2016.02.29_all.deb
aurora-doc_0.13.0snapshot.2016.03.07_all.deb
aurora-doc_0.13.0snapshot.2016.03.08_all.deb
aurora-doc_0.13.0snapshot.2016.03.10_all.deb
aurora-doc_0.13.0snapshot.2016.03.12_all.deb
aurora-doc_0.13.0snapshot.2016.03.14_all.deb
aurora-executor_0.13.0snapshot.2016.02.28_amd64.deb
aurora-executor_0.13.0snapshot.2016.02.29_amd64.deb
aurora-executor_0.13.0snapshot.2016.03.07_amd64.deb
aurora-executor_0.13.0snapshot.2016.03.08_amd64.deb
aurora-executor_0.13.0snapshot.2016.03.10_amd64.deb
aurora-executor_0.13.0snapshot.2016.03.12_amd64.deb
aurora-executor_0.13.0snapshot.2016.03.14_amd64.deb
aurora-scheduler_0.13.0snapshot.2016.02.28_amd64.deb
aurora-scheduler_0.13.0snapshot.2016.02.29_amd64.deb
aurora-scheduler_0.13.0snapshot.2016.03.07_amd64.deb
aurora-scheduler_0.13.0snapshot.2016.03.08_amd64.deb
aurora-scheduler_0.13.0snapshot.2016.03.10_amd64.deb
aurora-scheduler_0.13.0snapshot.2016.03.12_amd64.deb
aurora-scheduler_0.13.0snapshot.2016.03.14_amd64.deb
aurora-tools_0.13.0snapshot.2016.02.28_amd64.deb
aurora-tools_0.13.0snapshot.2016.02.29_amd64.deb
aurora-tools_0.13.0snapshot.2016.03.07_amd64.deb
aurora-tools_0.13.0snapshot.2016.03.08_amd64.deb
aurora-tools_0.13.0snapshot.2016.03.10_amd64.deb
aurora-tools_0.13.0snapshot.2016.03.12_amd64.deb
aurora-tools_0.13.0snapshot.2016.03.14_amd64.deb
builder/deb/ubuntu-trusty
Using docker image aurora-centos-7
Sending build context to Docker daemon  5.12 kB
Sending build context to Docker daemon  5.12 kB

Step 1 : FROM centos:7
 ---> eb98cdc284d4
Step 2 : RUN yum update -y
 ---> Using cache
 ---> 94ca2c369042
Step 3 : RUN yum install -y     make     rpm-build     yum-utils     apr-devel     cyrus-sasl-devel     flex     gcc     gcc-c++     git     java-1.8.0-openjdk-devel     krb5-devel     libcurl-devel     openssl     patch     python     python-devel     subversion-devel     tar     unzip     wget     which     zlib-devel
 ---> Using cache
 ---> aecd280535b7
Step 4 : ADD build.sh /build.sh
 ---> Using cache
 ---> ed54f6f4a770
Step 5 : ADD pants.ini /pants.ini
 ---> Using cache
 ---> c3a492db6db8
Successfully built c3a492db6db8
+ mkdir -p /scratch/src
+ cd /scratch
+ tar --strip-components 1 -C src -xf /src.tar.gz
+ cp -R /specs/rpm .
+ cd rpm
++ tr - _
++ echo 0.13.0snapshot.2016.03.14
+ export AURORA_VERSION=0.13.0snapshot.2016.03.14
+ AURORA_VERSION=0.13.0snapshot.2016.03.14
+ make srpm
rm -rf /dist/rpmbuild
mkdir -p /dist/rpmbuild/BUILD
mkdir -p /dist/rpmbuild/BUILDROOT
mkdir -p /dist/rpmbuild/RPMS
mkdir -p /dist/rpmbuild/SOURCES
mkdir -p /dist/rpmbuild/SRPMS
cp /src.tar.gz /dist/rpmbuild/SOURCES/aurora.tar.gz
cp SOURCES/* /dist/rpmbuild/SOURCES
rpmbuild  \
	--define "_topdir /dist" \
	--define "_builddir %{_topdir}/rpmbuild/BUILD" \
	--define "_buildrootdir %{_topdir}/rpmbuild/BUILDROOT" \
	--define "_rpmdir %{_topdir}/rpmbuild/RPMS" \
	--define "_srcrpmdir %{_topdir}/rpmbuild/SRPMS" \
	--define "_specdir %(pwd)" \
	--define "_sourcedir  %{_topdir}/rpmbuild/SOURCES" \
	--define "AURORA_VERSION 0.13.0snapshot.2016.03.14" \
	--define "MESOS_VERSION " \
	--nodeps -bs aurora.spec
error: Macro %MESOS_VERSION has empty body
error: Macro %MESOS_VERSION has empty body
error: File /dist/rpmbuild/SOURCES/0.13.0snapshot.2016.03.14.tar.gz: No such file or directory
make: *** [srpm] Error 1
Build step 'Execute shell' marked build as failure
Skipped archiving because build is not successful

Build failed in Jenkins: aurora-packaging-nightly #223

Posted by Apache Jenkins Server <je...@builds.apache.org>.
See <https://builds.apache.org/job/aurora-packaging-nightly/223/>

------------------------------------------
[...truncated 6771 lines...]
00:40:03 00:01     [unpack-jars]
00:40:03 00:01   [deferred-sources]
00:40:03 00:01     [deferred-sources]
00:40:03 00:01   [gen]
00:40:03 00:01     [thrift]
00:40:03 00:01     [protoc]
00:40:03 00:01     [antlr]
00:40:03 00:01     [ragel]
00:40:03 00:01     [jaxb]
00:40:03 00:01     [wire]
00:40:03 00:01   [jvm-platform-validate]
00:40:03 00:01     [jvm-platform-validate]
00:40:03 00:01   [resolve]
00:40:03 00:01     [ivy]
00:40:03 00:01   [compile]
00:40:03 00:01     [compile-jvm-prep-command]
00:40:03 00:01       [jvm_prep_command]
00:40:03 00:01     [compile-prep-command]
00:40:03 00:01     [python-eval]
00:40:03 00:01     [pythonstyle]
00:40:03 00:01     [compile]
00:40:03 00:01     [zinc]
00:40:03 00:01     [jvm-dep-check]
00:40:03 00:01   [resources]
00:40:03 00:01     [prepare]
00:40:03 00:01     [services]
00:40:03 00:01   [binary]
00:40:03 00:01     [binary-jvm-prep-command]
00:40:03 00:01       [jvm_prep_command]
00:40:03 00:01     [binary-prep-command]
00:40:04 00:02     [python-binary-create]
00:40:04 00:02       [chroot]
00:40:06 00:04     [jvm]
00:40:06 00:04     [dup]
00:40:06 00:04   [complete]
               SUCCESS
/scratch/pants binary src/main/python/apache/aurora/tools:thermos
fatal: Not a git repository (or any of the parent directories): .git

00:40:07 00:00 [main]
               (To run a reporting server: ./pants server)
00:40:07 00:00   [setup]
00:40:07 00:00     [parse]fatal: Not a git repository (or any of the parent directories): .git

               Executing tasks in goals: bootstrap -> imports -> unpack-jars -> deferred-sources -> gen -> jvm-platform-validate -> resolve -> compile -> resources -> binary
00:40:08 00:01   [bootstrap]
00:40:08 00:01     [jar-dependency-management]
00:40:08 00:01     [bootstrap-jvm-tools]
00:40:08 00:01   [imports]
00:40:08 00:01     [ivy-imports]
00:40:08 00:01   [unpack-jars]
00:40:08 00:01     [unpack-jars]
00:40:08 00:01   [deferred-sources]
00:40:08 00:01     [deferred-sources]
00:40:08 00:01   [gen]
00:40:08 00:01     [thrift]
00:40:08 00:01     [protoc]
00:40:08 00:01     [antlr]
00:40:08 00:01     [ragel]
00:40:08 00:01     [jaxb]
00:40:08 00:01     [wire]
00:40:08 00:01   [jvm-platform-validate]
00:40:08 00:01     [jvm-platform-validate]
00:40:08 00:01   [resolve]
00:40:08 00:01     [ivy]
00:40:08 00:01   [compile]
00:40:08 00:01     [compile-jvm-prep-command]
00:40:09 00:02       [jvm_prep_command]
00:40:09 00:02     [compile-prep-command]
00:40:09 00:02     [python-eval]
00:40:09 00:02     [pythonstyle]
00:40:09 00:02       [cache]    
                   No cached artifacts for 4 targets.
                   Invalidated 4 targets.
00:40:11 00:04     [compile]
00:40:11 00:04     [zinc]
00:40:11 00:04     [jvm-dep-check]
00:40:11 00:04   [resources]
00:40:11 00:04     [prepare]
00:40:11 00:04     [services]
00:40:11 00:04   [binary]
00:40:11 00:04     [binary-jvm-prep-command]
00:40:11 00:04       [jvm_prep_command]
00:40:11 00:04     [binary-prep-command]
00:40:11 00:04     [python-binary-create]
00:40:11 00:04       [chroot]
00:40:18 00:11     [jvm]
00:40:18 00:11     [dup]
00:40:18 00:11   [complete]
               SUCCESS
/scratch/pants binary src/main/python/apache/aurora/tools:thermos_observer
fatal: Not a git repository (or any of the parent directories): .git

00:40:19 00:00 [main]
               (To run a reporting server: ./pants server)
00:40:19 00:00   [setup]
00:40:19 00:00     [parse]fatal: Not a git repository (or any of the parent directories): .git

               Executing tasks in goals: bootstrap -> imports -> unpack-jars -> deferred-sources -> gen -> jvm-platform-validate -> resolve -> compile -> resources -> binary
00:40:19 00:00   [bootstrap]
00:40:19 00:00     [jar-dependency-management]
00:40:19 00:00     [bootstrap-jvm-tools]
00:40:19 00:00   [imports]
00:40:19 00:00     [ivy-imports]
00:40:20 00:01   [unpack-jars]
00:40:20 00:01     [unpack-jars]
00:40:20 00:01   [deferred-sources]
00:40:20 00:01     [deferred-sources]
00:40:20 00:01   [gen]
00:40:20 00:01     [thrift]
00:40:20 00:01     [protoc]
00:40:20 00:01     [antlr]
00:40:20 00:01     [ragel]
00:40:20 00:01     [jaxb]
00:40:20 00:01     [wire]
00:40:20 00:01   [jvm-platform-validate]
00:40:20 00:01     [jvm-platform-validate]
00:40:20 00:01   [resolve]
00:40:20 00:01     [ivy]
00:40:20 00:01   [compile]
00:40:20 00:01     [compile-jvm-prep-command]
00:40:20 00:01       [jvm_prep_command]
00:40:20 00:01     [compile-prep-command]
00:40:20 00:01     [python-eval]
00:40:20 00:01     [pythonstyle]
00:40:20 00:01       [cache] 
                   No cached artifacts for 1 target.
                   Invalidated 1 target.
00:40:20 00:01     [compile]
00:40:20 00:01     [zinc]
00:40:20 00:01     [jvm-dep-check]
00:40:20 00:01   [resources]
00:40:20 00:01     [prepare]
00:40:20 00:01     [services]
00:40:20 00:01   [binary]
00:40:20 00:01     [binary-jvm-prep-command]
00:40:20 00:01       [jvm_prep_command]
00:40:20 00:01     [binary-prep-command]
00:40:20 00:01     [python-binary-create]
00:40:20 00:01       [chroot]
00:40:24 00:05     [jvm]
00:40:24 00:05     [dup]
00:40:24 00:05   [complete]
               SUCCESS
/scratch/pants binary src/main/python/apache/thermos/runner:thermos_runner
fatal: Not a git repository (or any of the parent directories): .git

00:40:26 00:00 [main]
               (To run a reporting server: ./pants server)
00:40:26 00:00   [setup]
00:40:26 00:00     [parse]fatal: Not a git repository (or any of the parent directories): .git

               Executing tasks in goals: bootstrap -> imports -> unpack-jars -> deferred-sources -> gen -> jvm-platform-validate -> resolve -> compile -> resources -> binary
00:40:26 00:00   [bootstrap]
00:40:26 00:00     [jar-dependency-management]
00:40:26 00:00     [bootstrap-jvm-tools]
00:40:26 00:00   [imports]
00:40:26 00:00     [ivy-imports]
00:40:26 00:00   [unpack-jars]
00:40:26 00:00     [unpack-jars]
00:40:26 00:00   [deferred-sources]
00:40:26 00:00     [deferred-sources]
00:40:26 00:00   [gen]
00:40:26 00:00     [thrift]
00:40:26 00:00     [protoc]
00:40:26 00:00     [antlr]
00:40:26 00:00     [ragel]
00:40:26 00:00     [jaxb]
00:40:26 00:00     [wire]
00:40:26 00:00   [jvm-platform-validate]
00:40:26 00:00     [jvm-platform-validate]
00:40:26 00:00   [resolve]
00:40:26 00:00     [ivy]
00:40:26 00:00   [compile]
00:40:26 00:00     [compile-jvm-prep-command]
00:40:26 00:00       [jvm_prep_command]
00:40:26 00:00     [compile-prep-command]
00:40:26 00:00     [python-eval]
00:40:27 00:01     [pythonstyle]
00:40:27 00:01       [cache] 
                   No cached artifacts for 1 target.
                   Invalidated 1 target.
00:40:27 00:01     [compile]
00:40:27 00:01     [zinc]
00:40:27 00:01     [jvm-dep-check]
00:40:27 00:01   [resources]
00:40:27 00:01     [prepare]
00:40:27 00:01     [services]
00:40:27 00:01   [binary]
00:40:27 00:01     [binary-jvm-prep-command]
00:40:27 00:01       [jvm_prep_command]
00:40:27 00:01     [binary-prep-command]
00:40:27 00:01     [python-binary-create]
00:40:27 00:01       [chroot]
00:40:28 00:02     [jvm]
00:40:28 00:02     [dup]
00:40:28 00:02   [complete]
               SUCCESS
build-support/embed_runner_in_executor.py
dh override_dh_auto_build --exclude=aurora-scheduler.bat
make[1]: Leaving directory `/scratch'
   dh_auto_test -O--exclude=aurora-scheduler.bat
 debian/rules binary
dh binary --exclude=aurora-scheduler.bat
   dh_testroot -O--exclude=aurora-scheduler.bat
   dh_prep -O--exclude=aurora-scheduler.bat
   dh_installdirs -O--exclude=aurora-scheduler.bat
   dh_auto_install -O--exclude=aurora-scheduler.bat
   dh_install -O--exclude=aurora-scheduler.bat
   dh_installdocs -O--exclude=aurora-scheduler.bat
   dh_installchangelogs -O--exclude=aurora-scheduler.bat
   dh_installexamples -O--exclude=aurora-scheduler.bat
   debian/rules override_dh_installinit
make[1]: Entering directory `/scratch'
dh_installinit --name=thermos
dh_installinit
make[1]: Leaving directory `/scratch'
   dh_perl -O--exclude=aurora-scheduler.bat
   dh_link -O--exclude=aurora-scheduler.bat
   dh_compress -O--exclude=aurora-scheduler.bat
   dh_fixperms -O--exclude=aurora-scheduler.bat
   dh_strip -O--exclude=aurora-scheduler.bat
   dh_makeshlibs -O--exclude=aurora-scheduler.bat
   dh_shlibdeps -O--exclude=aurora-scheduler.bat
   dh_installdeb -O--exclude=aurora-scheduler.bat
   dh_gencontrol -O--exclude=aurora-scheduler.bat
dpkg-gencontrol: warning: Depends field of package aurora-scheduler: unknown substitution variable ${shlibs:Depends}
dpkg-gencontrol: warning: Depends field of package aurora-tools: unknown substitution variable ${shlibs:Depends}
dpkg-gencontrol: warning: Depends field of package aurora-executor: unknown substitution variable ${shlibs:Depends}
   dh_md5sums -O--exclude=aurora-scheduler.bat
   dh_builddeb -O--exclude=aurora-scheduler.bat
dpkg-deb: building package `aurora-scheduler' in `../aurora-scheduler_0.13.0snapshot.2016.03.13_amd64.deb'.
dpkg-deb: building package `aurora-tools' in `../aurora-tools_0.13.0snapshot.2016.03.13_amd64.deb'.
dpkg-deb: building package `aurora-executor' in `../aurora-executor_0.13.0snapshot.2016.03.13_amd64.deb'.
dpkg-deb: building package `aurora-doc' in `../aurora-doc_0.13.0snapshot.2016.03.13_all.deb'.
 dpkg-genchanges -b >../apache-aurora_0.13.0snapshot.2016.03.13_amd64.changes
dpkg-genchanges: binary-only upload - not including any source code
 debian/rules clean
dh clean --exclude=aurora-scheduler.bat
   dh_testdir -O--exclude=aurora-scheduler.bat
   dh_auto_clean -O--exclude=aurora-scheduler.bat
   dh_clean -O--exclude=aurora-scheduler.bat
 dpkg-source --after-build scratch
dpkg-buildpackage: binary only upload (no source included)
+ mkdir /dist
+ mv ../aurora-doc_0.13.0snapshot.2016.03.13_all.deb ../aurora-executor_0.13.0snapshot.2016.03.13_amd64.deb ../aurora-scheduler_0.13.0snapshot.2016.03.13_amd64.deb ../aurora-tools_0.13.0snapshot.2016.03.13_amd64.deb /dist
Error response from daemon: lstat /var/lib/docker/aufs/mnt/f09c974e8ac6c523b6bd5ece0082cc014454986a824664121789c8205d05260d/dist: no such file or directory
Build step 'Execute shell' marked build as failure
Skipped archiving because build is not successful

Build failed in Jenkins: aurora-packaging-nightly #222

Posted by Apache Jenkins Server <je...@builds.apache.org>.
See <https://builds.apache.org/job/aurora-packaging-nightly/222/changes>

Changes:

[jcohen] Log exceptions raised when thermos running attempts to execute a

[john.sirois] Exposing DSL defined variables to shell health checkers

[john.sirois] Limit the scope of hot-reload resources.

------------------------------------------
[...truncated 6856 lines...]
00:41:43 00:03       [chroot]
00:41:49 00:09     [jvm]
00:41:49 00:09     [dup]
00:41:49 00:09   [complete]
               SUCCESS
/scratch/pants binary src/main/python/apache/aurora/tools:thermos_observer
fatal: Not a git repository (or any of the parent directories): .git

00:41:50 00:00 [main]
               (To run a reporting server: ./pants server)
00:41:50 00:00   [setup]
00:41:50 00:00     [parse]fatal: Not a git repository (or any of the parent directories): .git

               Executing tasks in goals: bootstrap -> imports -> unpack-jars -> deferred-sources -> gen -> jvm-platform-validate -> resolve -> compile -> resources -> binary
00:41:50 00:00   [bootstrap]
00:41:50 00:00     [jar-dependency-management]
00:41:51 00:01     [bootstrap-jvm-tools]
00:41:51 00:01   [imports]
00:41:51 00:01     [ivy-imports]
00:41:51 00:01   [unpack-jars]
00:41:51 00:01     [unpack-jars]
00:41:51 00:01   [deferred-sources]
00:41:51 00:01     [deferred-sources]
00:41:51 00:01   [gen]
00:41:51 00:01     [thrift]
00:41:51 00:01     [protoc]
00:41:51 00:01     [antlr]
00:41:51 00:01     [ragel]
00:41:51 00:01     [jaxb]
00:41:51 00:01     [wire]
00:41:51 00:01   [jvm-platform-validate]
00:41:51 00:01     [jvm-platform-validate]
00:41:51 00:01   [resolve]
00:41:51 00:01     [ivy]
00:41:51 00:01   [compile]
00:41:51 00:01     [compile-jvm-prep-command]
00:41:51 00:01       [jvm_prep_command]
00:41:51 00:01     [compile-prep-command]
00:41:51 00:01     [python-eval]
00:41:51 00:01     [pythonstyle]
00:41:51 00:01       [cache] 
                   No cached artifacts for 1 target.
                   Invalidated 1 target.
00:41:51 00:01     [compile]
00:41:51 00:01     [zinc]
00:41:51 00:01     [jvm-dep-check]
00:41:51 00:01   [resources]
00:41:51 00:01     [prepare]
00:41:51 00:01     [services]
00:41:51 00:01   [binary]
00:41:51 00:01     [binary-jvm-prep-command]
00:41:51 00:01       [jvm_prep_command]
00:41:51 00:01     [binary-prep-command]
00:41:51 00:01     [python-binary-create]
00:41:51 00:01       [chroot]
00:41:54 00:04     [jvm]
00:41:54 00:04     [dup]
00:41:54 00:04   [complete]
               SUCCESS
/scratch/pants binary src/main/python/apache/thermos/runner:thermos_runner
fatal: Not a git repository (or any of the parent directories): .git

00:41:55 00:00 [main]
               (To run a reporting server: ./pants server)
00:41:55 00:00   [setup]
00:41:55 00:00     [parse]fatal: Not a git repository (or any of the parent directories): .git

               Executing tasks in goals: bootstrap -> imports -> unpack-jars -> deferred-sources -> gen -> jvm-platform-validate -> resolve -> compile -> resources -> binary
00:41:55 00:00   [bootstrap]
00:41:55 00:00     [jar-dependency-management]
00:41:56 00:01     [bootstrap-jvm-tools]
00:41:56 00:01   [imports]
00:41:56 00:01     [ivy-imports]
00:41:56 00:01   [unpack-jars]
00:41:56 00:01     [unpack-jars]
00:41:56 00:01   [deferred-sources]
00:41:56 00:01     [deferred-sources]
00:41:56 00:01   [gen]
00:41:56 00:01     [thrift]
00:41:56 00:01     [protoc]
00:41:56 00:01     [antlr]
00:41:56 00:01     [ragel]
00:41:56 00:01     [jaxb]
00:41:56 00:01     [wire]
00:41:56 00:01   [jvm-platform-validate]
00:41:56 00:01     [jvm-platform-validate]
00:41:56 00:01   [resolve]
00:41:56 00:01     [ivy]
00:41:56 00:01   [compile]
00:41:56 00:01     [compile-jvm-prep-command]
00:41:56 00:01       [jvm_prep_command]
00:41:56 00:01     [compile-prep-command]
00:41:56 00:01     [python-eval]
00:41:56 00:01     [pythonstyle]
00:41:56 00:01       [cache] 
                   No cached artifacts for 1 target.
                   Invalidated 1 target.
00:41:56 00:01     [compile]
00:41:56 00:01     [zinc]
00:41:56 00:01     [jvm-dep-check]
00:41:56 00:01   [resources]
00:41:56 00:01     [prepare]
00:41:56 00:01     [services]
00:41:56 00:01   [binary]
00:41:56 00:01     [binary-jvm-prep-command]
00:41:56 00:01       [jvm_prep_command]
00:41:56 00:01     [binary-prep-command]
00:41:56 00:01     [python-binary-create]
00:41:56 00:01       [chroot]
00:41:57 00:02     [jvm]
00:41:57 00:02     [dup]
00:41:58 00:03   [complete]
               SUCCESS
build-support/embed_runner_in_executor.py
dh override_dh_auto_build --exclude=aurora-scheduler.bat
make[1]: Leaving directory `/scratch'
   dh_auto_test -O--exclude=aurora-scheduler.bat
 debian/rules binary
dh binary --exclude=aurora-scheduler.bat
   dh_testroot -O--exclude=aurora-scheduler.bat
   dh_prep -O--exclude=aurora-scheduler.bat
   dh_installdirs -O--exclude=aurora-scheduler.bat
   dh_auto_install -O--exclude=aurora-scheduler.bat
   dh_install -O--exclude=aurora-scheduler.bat
   dh_installdocs -O--exclude=aurora-scheduler.bat
   dh_installchangelogs -O--exclude=aurora-scheduler.bat
   dh_installexamples -O--exclude=aurora-scheduler.bat
   debian/rules override_dh_installinit
make[1]: Entering directory `/scratch'
dh_installinit --name=thermos
dh_installinit
make[1]: Leaving directory `/scratch'
   dh_perl -O--exclude=aurora-scheduler.bat
   dh_link -O--exclude=aurora-scheduler.bat
   dh_compress -O--exclude=aurora-scheduler.bat
   dh_fixperms -O--exclude=aurora-scheduler.bat
   dh_strip -O--exclude=aurora-scheduler.bat
   dh_makeshlibs -O--exclude=aurora-scheduler.bat
   dh_shlibdeps -O--exclude=aurora-scheduler.bat
   dh_installdeb -O--exclude=aurora-scheduler.bat
   dh_gencontrol -O--exclude=aurora-scheduler.bat
dpkg-gencontrol: warning: Depends field of package aurora-scheduler: unknown substitution variable ${shlibs:Depends}
dpkg-gencontrol: warning: Depends field of package aurora-tools: unknown substitution variable ${shlibs:Depends}
dpkg-gencontrol: warning: Depends field of package aurora-executor: unknown substitution variable ${shlibs:Depends}
   dh_md5sums -O--exclude=aurora-scheduler.bat
   dh_builddeb -O--exclude=aurora-scheduler.bat
dpkg-deb: building package `aurora-scheduler' in `../aurora-scheduler_0.13.0snapshot.2016.03.12_amd64.deb'.
dpkg-deb: building package `aurora-tools' in `../aurora-tools_0.13.0snapshot.2016.03.12_amd64.deb'.
dpkg-deb: building package `aurora-executor' in `../aurora-executor_0.13.0snapshot.2016.03.12_amd64.deb'.
dpkg-deb: building package `aurora-doc' in `../aurora-doc_0.13.0snapshot.2016.03.12_all.deb'.
 dpkg-genchanges -b >../apache-aurora_0.13.0snapshot.2016.03.12_amd64.changes
dpkg-genchanges: binary-only upload - not including any source code
 debian/rules clean
dh clean --exclude=aurora-scheduler.bat
   dh_testdir -O--exclude=aurora-scheduler.bat
   dh_auto_clean -O--exclude=aurora-scheduler.bat
   dh_clean -O--exclude=aurora-scheduler.bat
 dpkg-source --after-build scratch
dpkg-buildpackage: binary only upload (no source included)
+ mkdir /dist
+ mv ../aurora-doc_0.13.0snapshot.2016.03.12_all.deb ../aurora-executor_0.13.0snapshot.2016.03.12_amd64.deb ../aurora-scheduler_0.13.0snapshot.2016.03.12_amd64.deb ../aurora-tools_0.13.0snapshot.2016.03.12_amd64.deb /dist
9d5ab9e04f02
Produced artifacts in artifacts/aurora-ubuntu-trusty:
artifacts/aurora-ubuntu-trusty:
dist

artifacts/aurora-ubuntu-trusty/dist:
aurora-doc_0.13.0snapshot.2016.02.28_all.deb
aurora-doc_0.13.0snapshot.2016.02.29_all.deb
aurora-doc_0.13.0snapshot.2016.03.07_all.deb
aurora-doc_0.13.0snapshot.2016.03.08_all.deb
aurora-doc_0.13.0snapshot.2016.03.10_all.deb
aurora-doc_0.13.0snapshot.2016.03.12_all.deb
aurora-executor_0.13.0snapshot.2016.02.28_amd64.deb
aurora-executor_0.13.0snapshot.2016.02.29_amd64.deb
aurora-executor_0.13.0snapshot.2016.03.07_amd64.deb
aurora-executor_0.13.0snapshot.2016.03.08_amd64.deb
aurora-executor_0.13.0snapshot.2016.03.10_amd64.deb
aurora-executor_0.13.0snapshot.2016.03.12_amd64.deb
aurora-scheduler_0.13.0snapshot.2016.02.28_amd64.deb
aurora-scheduler_0.13.0snapshot.2016.02.29_amd64.deb
aurora-scheduler_0.13.0snapshot.2016.03.07_amd64.deb
aurora-scheduler_0.13.0snapshot.2016.03.08_amd64.deb
aurora-scheduler_0.13.0snapshot.2016.03.10_amd64.deb
aurora-scheduler_0.13.0snapshot.2016.03.12_amd64.deb
aurora-tools_0.13.0snapshot.2016.02.28_amd64.deb
aurora-tools_0.13.0snapshot.2016.02.29_amd64.deb
aurora-tools_0.13.0snapshot.2016.03.07_amd64.deb
aurora-tools_0.13.0snapshot.2016.03.08_amd64.deb
aurora-tools_0.13.0snapshot.2016.03.10_amd64.deb
aurora-tools_0.13.0snapshot.2016.03.12_amd64.deb
builder/deb/ubuntu-trusty
Using docker image aurora-centos-7
Sending build context to Docker daemon  5.12 kB
Sending build context to Docker daemon  5.12 kB

Step 1 : FROM centos:7
7: Pulling from library/centos
Digest: sha256:3cdc0670fe9130ab3741b126cfac6d7720492dd2c1c8ae033dcd77d32855bab2
Status: Downloaded newer image for centos:7
 ---> eb98cdc284d4
Step 2 : RUN yum update -y
 ---> Using cache
 ---> 94ca2c369042
Step 3 : RUN yum install -y     make     rpm-build     yum-utils     apr-devel     cyrus-sasl-devel     flex     gcc     gcc-c++     git     java-1.8.0-openjdk-devel     krb5-devel     libcurl-devel     openssl     patch     python     python-devel     subversion-devel     tar     unzip     wget     which     zlib-devel
 ---> Using cache
 ---> aecd280535b7
Step 4 : ADD build.sh /build.sh
 ---> Using cache
 ---> ed54f6f4a770
Step 5 : ADD pants.ini /pants.ini
 ---> Using cache
 ---> c3a492db6db8
Successfully built c3a492db6db8
+ mkdir -p /scratch/src
+ cd /scratch
+ tar --strip-components 1 -C src -xf /src.tar.gz
+ cp -R /specs/rpm .
+ cd rpm
++ echo 0.13.0snapshot.2016.03.12
++ tr - _
+ export AURORA_VERSION=0.13.0snapshot.2016.03.12
+ AURORA_VERSION=0.13.0snapshot.2016.03.12
+ make srpm
rm -rf /dist/rpmbuild
mkdir -p /dist/rpmbuild/BUILD
mkdir -p /dist/rpmbuild/BUILDROOT
mkdir -p /dist/rpmbuild/RPMS
mkdir -p /dist/rpmbuild/SOURCES
mkdir -p /dist/rpmbuild/SRPMS
cp /src.tar.gz /dist/rpmbuild/SOURCES/aurora.tar.gz
cp SOURCES/* /dist/rpmbuild/SOURCES
rpmbuild  \
	--define "_topdir /dist" \
	--define "_builddir %{_topdir}/rpmbuild/BUILD" \
	--define "_buildrootdir %{_topdir}/rpmbuild/BUILDROOT" \
	--define "_rpmdir %{_topdir}/rpmbuild/RPMS" \
	--define "_srcrpmdir %{_topdir}/rpmbuild/SRPMS" \
	--define "_specdir %(pwd)" \
	--define "_sourcedir  %{_topdir}/rpmbuild/SOURCES" \
	--define "AURORA_VERSION 0.13.0snapshot.2016.03.12" \
	--define "MESOS_VERSION " \
	--nodeps -bs aurora.spec
error: Macro %MESOS_VERSION has empty body
error: Macro %MESOS_VERSION has empty body
error: File /dist/rpmbuild/SOURCES/0.13.0snapshot.2016.03.12.tar.gz: No such file or directory
make: *** [srpm] Error 1
Build step 'Execute shell' marked build as failure
Skipped archiving because build is not successful

Build failed in Jenkins: aurora-packaging-nightly #221

Posted by Apache Jenkins Server <je...@builds.apache.org>.
See <https://builds.apache.org/job/aurora-packaging-nightly/221/changes>

Changes:

[wfarner] Add installation instructions for aurora-cli on Mac OS X

[maxim] Adding non-role-exclusive dedicated constraint support

[maxim] Log and terminate scheduler on updater thread failure.

------------------------------------------
[...truncated 817 lines...]
  Verifying  : apr-devel-1.4.8-3.el7.x86_64                              74/136 
  Verifying  : perl-Storable-2.45-3.el7.x86_64                           75/136 
  Verifying  : pcre-devel-8.32-15.el7.x86_64                             76/136 
  Verifying  : 4:perl-libs-5.16.3-286.el7.x86_64                         77/136 
  Verifying  : m4-1.4.16-10.el7.x86_64                                   78/136 
  Verifying  : fontpackages-filesystem-1.44-8.el7.noarch                 79/136 
  Verifying  : ttmkfdir-3.0.9-42.el7.x86_64                              80/136 
  Verifying  : zlib-devel-1.2.7-15.el7.x86_64                            81/136 
  Verifying  : 1:perl-parent-0.225-244.el7.noarch                        82/136 
  Verifying  : giflib-4.1.6-9.el7.x86_64                                 83/136 
  Verifying  : perl-srpm-macros-1-8.el7.noarch                           84/136 
  Verifying  : libXrender-0.9.8-2.1.el7.x86_64                           85/136 
  Verifying  : perl-Carp-1.26-244.el7.noarch                             86/136 
  Verifying  : libxslt-1.1.28-5.el7.x86_64                               87/136 
  Verifying  : initscripts-9.49.30-1.el7.x86_64                          88/136 
  Verifying  : rpm-build-4.11.3-17.el7.x86_64                            89/136 
  Verifying  : libICE-1.0.9-2.el7.x86_64                                 90/136 
  Verifying  : libXi-1.7.4-2.el7.x86_64                                  91/136 
  Verifying  : libgnome-keyring-3.8.0-3.el7.x86_64                       92/136 
  Verifying  : alsa-lib-1.0.28-2.el7.x86_64                              93/136 
  Verifying  : libstdc++-devel-4.8.5-4.el7.x86_64                        94/136 
  Verifying  : perl-podlators-2.5.1-3.el7.noarch                         95/136 
  Verifying  : zip-3.0-10.el7.x86_64                                     96/136 
  Verifying  : apr-util-devel-1.5.2-6.el7.x86_64                         97/136 
  Verifying  : libfontenc-1.1.2-3.el7.x86_64                             98/136 
  Verifying  : mpfr-3.1.1-4.el7.x86_64                                   99/136 
  Verifying  : perl-Filter-1.49-3.el7.x86_64                            100/136 
  Verifying  : dwz-0.11-3.el7.x86_64                                    101/136 
  Verifying  : cyrus-sasl-devel-2.1.26-20.el7_2.x86_64                  102/136 
  Verifying  : openssh-6.6.1p1-23.el7_2.x86_64                          103/136 
  Verifying  : rsync-3.0.9-17.el7.x86_64                                104/136 
  Verifying  : fipscheck-1.4.1-5.el7.x86_64                             105/136 
  Verifying  : less-458-9.el7.x86_64                                    106/136 
  Verifying  : freetype-2.4.11-11.el7.x86_64                            107/136 
  Verifying  : perl-Exporter-5.68-3.el7.noarch                          108/136 
  Verifying  : perl-constant-1.27-2.el7.noarch                          109/136 
  Verifying  : perl-PathTools-3.40-5.el7.x86_64                         110/136 
  Verifying  : elfutils-0.163-3.el7.x86_64                              111/136 
  Verifying  : 1:openssl-1.0.1e-51.el7_2.4.x86_64                       112/136 
  Verifying  : glibc-devel-2.17-106.el7_2.4.x86_64                      113/136 
  Verifying  : apr-1.4.8-3.el7.x86_64                                   114/136 
  Verifying  : 4:perl-5.16.3-286.el7.x86_64                             115/136 
  Verifying  : subversion-1.7.14-10.el7.x86_64                          116/136 
  Verifying  : perl-Thread-Queue-3.02-2.el7.noarch                      117/136 
  Verifying  : 1:perl-Pod-Simple-3.28-4.el7.noarch                      118/136 
  Verifying  : perl-Time-Local-1.2300-2.el7.noarch                      119/136 
  Verifying  : systemd-sysv-219-19.el7_2.4.x86_64                       120/136 
  Verifying  : libdb-devel-5.3.21-19.el7.x86_64                         121/136 
  Verifying  : perl-Pod-Perldoc-3.20-4.el7.noarch                       122/136 
  Verifying  : perl-Socket-2.010-3.el7.x86_64                           123/136 
  Verifying  : nettle-2.7.1-4.el7.x86_64                                124/136 
  Verifying  : xorg-x11-fonts-Type1-7.5-9.el7.noarch                    125/136 
  Verifying  : 1:perl-Error-0.17020-2.el7.noarch                        126/136 
  Verifying  : libXfont-1.5.1-2.el7.x86_64                              127/136 
  Verifying  : flex-2.5.37-3.el7.x86_64                                 128/136 
  Verifying  : cyrus-sasl-2.1.26-20.el7_2.x86_64                        129/136 
  Verifying  : unzip-6.0-15.el7.x86_64                                  130/136 
  Verifying  : gdb-7.6.1-80.el7.x86_64                                  131/136 
  Verifying  : perl-Getopt-Long-2.40-2.el7.noarch                       132/136 
  Verifying  : cpp-4.8.5-4.el7.x86_64                                   133/136 
  Verifying  : redhat-rpm-config-9.1.0-68.el7.centos.noarch             134/136 
  Verifying  : expat-devel-2.1.0-8.el7.x86_64                           135/136 
  Verifying  : lksctp-tools-1.0.13-3.el7.x86_64                         136/136 

Installed:
  apr-devel.x86_64 0:1.4.8-3.el7                                                
  cyrus-sasl-devel.x86_64 0:2.1.26-20.el7_2                                     
  flex.x86_64 0:2.5.37-3.el7                                                    
  gcc.x86_64 0:4.8.5-4.el7                                                      
  gcc-c++.x86_64 0:4.8.5-4.el7                                                  
  git.x86_64 0:1.8.3.1-6.el7                                                    
  java-1.8.0-openjdk-devel.x86_64 1:1.8.0.71-2.b15.el7_2                        
  krb5-devel.x86_64 0:1.13.2-10.el7                                             
  libcurl-devel.x86_64 0:7.29.0-25.el7.centos                                   
  make.x86_64 1:3.82-21.el7                                                     
  openssl.x86_64 1:1.0.1e-51.el7_2.4                                            
  patch.x86_64 0:2.7.1-8.el7                                                    
  python-devel.x86_64 0:2.7.5-34.el7                                            
  rpm-build.x86_64 0:4.11.3-17.el7                                              
  subversion-devel.x86_64 0:1.7.14-10.el7                                       
  unzip.x86_64 0:6.0-15.el7                                                     
  wget.x86_64 0:1.14-10.el7_0.1                                                 
  which.x86_64 0:2.20-7.el7                                                     
  zlib-devel.x86_64 0:1.2.7-15.el7                                              

Dependency Installed:
  alsa-lib.x86_64 0:1.0.28-2.el7                                                
  apr.x86_64 0:1.4.8-3.el7                                                      
  apr-util.x86_64 0:1.5.2-6.el7                                                 
  apr-util-devel.x86_64 0:1.5.2-6.el7                                           
  bzip2.x86_64 0:1.0.6-13.el7                                                   
  cpp.x86_64 0:4.8.5-4.el7                                                      
  cyrus-sasl.x86_64 0:2.1.26-20.el7_2                                           
  dwz.x86_64 0:0.11-3.el7                                                       
  elfutils.x86_64 0:0.163-3.el7                                                 
  expat-devel.x86_64 0:2.1.0-8.el7                                              
  file.x86_64 0:5.11-31.el7                                                     
  fipscheck.x86_64 0:1.4.1-5.el7                                                
  fipscheck-lib.x86_64 0:1.4.1-5.el7                                            
  fontconfig.x86_64 0:2.10.95-7.el7                                             
  fontpackages-filesystem.noarch 0:1.44-8.el7                                   
  freetype.x86_64 0:2.4.11-11.el7                                               
  gdb.x86_64 0:7.6.1-80.el7                                                     
  giflib.x86_64 0:4.1.6-9.el7                                                   
  glibc-devel.x86_64 0:2.17-106.el7_2.4                                         
  glibc-headers.x86_64 0:2.17-106.el7_2.4                                       
  gnutls.x86_64 0:3.3.8-14.el7_2                                                
  groff-base.x86_64 0:1.22.2-8.el7                                              
  initscripts.x86_64 0:9.49.30-1.el7                                            
  iproute.x86_64 0:3.10.0-54.el7                                                
  iptables.x86_64 0:1.4.21-16.el7                                               
  java-1.8.0-openjdk.x86_64 1:1.8.0.71-2.b15.el7_2                              
  java-1.8.0-openjdk-headless.x86_64 1:1.8.0.71-2.b15.el7_2                     
  javapackages-tools.noarch 0:3.4.1-11.el7                                      
  kernel-headers.x86_64 0:3.10.0-327.10.1.el7                                   
  keyutils-libs-devel.x86_64 0:1.5.8-3.el7                                      
  less.x86_64 0:458-9.el7                                                       
  libICE.x86_64 0:1.0.9-2.el7                                                   
  libSM.x86_64 0:1.2.2-2.el7                                                    
  libX11.x86_64 0:1.6.3-2.el7                                                   
  libX11-common.noarch 0:1.6.3-2.el7                                            
  libXau.x86_64 0:1.0.8-2.1.el7                                                 
  libXext.x86_64 0:1.3.3-3.el7                                                  
  libXfont.x86_64 0:1.5.1-2.el7                                                 
  libXi.x86_64 0:1.7.4-2.el7                                                    
  libXrender.x86_64 0:0.9.8-2.1.el7                                             
  libXtst.x86_64 0:1.2.2-2.1.el7                                                
  libcom_err-devel.x86_64 0:1.42.9-7.el7                                        
  libdb-devel.x86_64 0:5.3.21-19.el7                                            
  libedit.x86_64 0:3.0-12.20121213cvs.el7                                       
  libfontenc.x86_64 0:1.1.2-3.el7                                               
  libgnome-keyring.x86_64 0:3.8.0-3.el7                                         
  libgomp.x86_64 0:4.8.5-4.el7                                                  
  libjpeg-turbo.x86_64 0:1.2.90-5.el7                                           
  libmnl.x86_64 0:1.0.3-7.el7                                                   
  libmodman.x86_64 0:2.0.1-8.el7                                                
  libmpc.x86_64 0:1.0.1-3.el7                                                   
  libnetfilter_conntrack.x86_64 0:1.0.4-2.el7                                   
  libnfnetlink.x86_64 0:1.0.1-4.el7                                             
  libpng.x86_64 2:1.5.13-7.el7_2                                                
  libproxy.x86_64 0:0.4.11-8.el7                                                
  libselinux-devel.x86_64 0:2.2.2-6.el7                                         
  libsepol-devel.x86_64 0:2.1.9-3.el7                                           
  libstdc++-devel.x86_64 0:4.8.5-4.el7                                          
  libverto-devel.x86_64 0:0.2.5-4.el7                                           
  libxcb.x86_64 0:1.11-4.el7                                                    
  libxslt.x86_64 0:1.1.28-5.el7                                                 
  lksctp-tools.x86_64 0:1.0.13-3.el7                                            
  m4.x86_64 0:1.4.16-10.el7                                                     
  mpfr.x86_64 0:3.1.1-4.el7                                                     
  neon.x86_64 0:0.30.0-3.el7                                                    
  nettle.x86_64 0:2.7.1-4.el7                                                   
  openldap-devel.x86_64 0:2.4.40-8.el7                                          
  openssh.x86_64 0:6.6.1p1-23.el7_2                                             
  openssh-clients.x86_64 0:6.6.1p1-23.el7_2                                     
  pakchois.x86_64 0:0.4-10.el7                                                  
  pcre-devel.x86_64 0:8.32-15.el7                                               
  perl.x86_64 4:5.16.3-286.el7                                                  
  perl-Carp.noarch 0:1.26-244.el7                                               
  perl-Encode.x86_64 0:2.51-7.el7                                               
  perl-Error.noarch 1:0.17020-2.el7                                             
  perl-Exporter.noarch 0:5.68-3.el7                                             
  perl-File-Path.noarch 0:2.09-2.el7                                            
  perl-File-Temp.noarch 0:0.23.01-3.el7                                         
  perl-Filter.x86_64 0:1.49-3.el7                                               
  perl-Getopt-Long.noarch 0:2.40-2.el7                                          
  perl-Git.noarch 0:1.8.3.1-6.el7                                               
  perl-HTTP-Tiny.noarch 0:0.033-3.el7                                           
  perl-PathTools.x86_64 0:3.40-5.el7                                            
  perl-Pod-Escapes.noarch 1:1.04-286.el7                                        
  perl-Pod-Perldoc.noarch 0:3.20-4.el7                                          
  perl-Pod-Simple.noarch 1:3.28-4.el7                                           
  perl-Pod-Usage.noarch 0:1.63-3.el7                                            
  perl-Scalar-List-Utils.x86_64 0:1.27-248.el7                                  
  perl-Socket.x86_64 0:2.010-3.el7                                              
  perl-Storable.x86_64 0:2.45-3.el7                                             
  perl-TermReadKey.x86_64 0:2.30-20.el7                                         
  perl-Text-ParseWords.noarch 0:3.29-4.el7                                      
  perl-Thread-Queue.noarch 0:3.02-2.el7                                         
  perl-Time-HiRes.x86_64 4:1.9725-3.el7                                         
  perl-Time-Local.noarch 0:1.2300-2.el7                                         
  perl-constant.noarch 0:1.27-2.el7                                             
  perl-libs.x86_64 4:5.16.3-286.el7                                             
  perl-macros.x86_64 4:5.16.3-286.el7                                           
  perl-parent.noarch 1:0.225-244.el7                                            
  perl-podlators.noarch 0:2.5.1-3.el7                                           
  perl-srpm-macros.noarch 0:1-8.el7                                             
  perl-threads.x86_64 0:1.87-4.el7                                              
  perl-threads-shared.x86_64 0:1.43-6.el7                                       
  python-javapackages.noarch 0:3.4.1-11.el7                                     
  python-lxml.x86_64 0:3.2.1-4.el7                                              
  redhat-rpm-config.noarch 0:9.1.0-68.el7.centos                                
  rsync.x86_64 0:3.0.9-17.el7                                                   
  subversion.x86_64 0:1.7.14-10.el7                                             
  subversion-libs.x86_64 0:1.7.14-10.el7                                        
  systemd-sysv.x86_64 0:219-19.el7_2.4                                          
  sysvinit-tools.x86_64 0:2.88-14.dsf.el7                                       
  trousers.x86_64 0:0.3.13-1.el7                                                
  ttmkfdir.x86_64 0:3.0.9-42.el7                                                
  tzdata-java.noarch 0:2016a-1.el7                                              
  xorg-x11-font-utils.x86_64 1:7.5-20.el7                                       
  xorg-x11-fonts-Type1.noarch 0:7.5-9.el7                                       
  zip.x86_64 0:3.0-10.el7                                                       

Complete!
 ---> c21e3e416347
Removing intermediate container afce9d68069c
Step 4 : ADD build.sh /build.sh
 ---> 328ec3db6396
Removing intermediate container f5d5e4db90c8
Step 5 : ADD pants.ini /pants.ini
 ---> 632d434dc8a6
Removing intermediate container d741883c584d
Successfully built 632d434dc8a6
+ mkdir -p /scratch/src
+ cd /scratch
+ tar --strip-components 1 -C src -xf /src.tar.gz
+ cp -R /specs/rpm .
+ cd rpm
++ echo 0.13.0snapshot.2016.03.11
++ tr - _
+ export AURORA_VERSION=0.13.0snapshot.2016.03.11
+ AURORA_VERSION=0.13.0snapshot.2016.03.11
+ make srpm
rm -rf /dist/rpmbuild
mkdir -p /dist/rpmbuild/BUILD
mkdir -p /dist/rpmbuild/BUILDROOT
mkdir -p /dist/rpmbuild/RPMS
mkdir -p /dist/rpmbuild/SOURCES
mkdir -p /dist/rpmbuild/SRPMS
cp /src.tar.gz /dist/rpmbuild/SOURCES/aurora.tar.gz
cp SOURCES/* /dist/rpmbuild/SOURCES
rpmbuild  \
	--define "_topdir /dist" \
	--define "_builddir %{_topdir}/rpmbuild/BUILD" \
	--define "_buildrootdir %{_topdir}/rpmbuild/BUILDROOT" \
	--define "_rpmdir %{_topdir}/rpmbuild/RPMS" \
	--define "_srcrpmdir %{_topdir}/rpmbuild/SRPMS" \
	--define "_specdir %(pwd)" \
	--define "_sourcedir  %{_topdir}/rpmbuild/SOURCES" \
	--define "AURORA_VERSION 0.13.0snapshot.2016.03.11" \
	--define "MESOS_VERSION " \
	--nodeps -bs aurora.spec
error: Macro %MESOS_VERSION has empty body
error: Macro %MESOS_VERSION has empty body
error: File /dist/rpmbuild/SOURCES/0.13.0snapshot.2016.03.11.tar.gz: No such file or directory
make: *** [srpm] Error 1
Build step 'Execute shell' marked build as failure
Skipped archiving because build is not successful

Build failed in Jenkins: aurora-packaging-nightly #220

Posted by Apache Jenkins Server <je...@builds.apache.org>.
See <https://builds.apache.org/job/aurora-packaging-nightly/220/changes>

Changes:

[stephan] Update configuration-reference.md documentation on supporting private

[stephan] Don't destroy session between requests with TRequestsTransport

[john.sirois] Upgrade pants to 0.0.75.

[stephan] Add latest design documents

[john.sirois] Correct url for source0

[john.sirois] Introduce a helper script for preparing RCs.

[john.sirois] Fixup rpm builder and tester.

------------------------------------------
[...truncated 15607 lines...]
  Verifying  : apr-devel-1.4.8-3.el7.x86_64                              74/136 
  Verifying  : perl-Storable-2.45-3.el7.x86_64                           75/136 
  Verifying  : pcre-devel-8.32-15.el7.x86_64                             76/136 
  Verifying  : 4:perl-libs-5.16.3-286.el7.x86_64                         77/136 
  Verifying  : m4-1.4.16-10.el7.x86_64                                   78/136 
  Verifying  : fontpackages-filesystem-1.44-8.el7.noarch                 79/136 
  Verifying  : ttmkfdir-3.0.9-42.el7.x86_64                              80/136 
  Verifying  : zlib-devel-1.2.7-15.el7.x86_64                            81/136 
  Verifying  : 1:perl-parent-0.225-244.el7.noarch                        82/136 
  Verifying  : giflib-4.1.6-9.el7.x86_64                                 83/136 
  Verifying  : perl-srpm-macros-1-8.el7.noarch                           84/136 
  Verifying  : libXrender-0.9.8-2.1.el7.x86_64                           85/136 
  Verifying  : perl-Carp-1.26-244.el7.noarch                             86/136 
  Verifying  : libxslt-1.1.28-5.el7.x86_64                               87/136 
  Verifying  : initscripts-9.49.30-1.el7.x86_64                          88/136 
  Verifying  : rpm-build-4.11.3-17.el7.x86_64                            89/136 
  Verifying  : libICE-1.0.9-2.el7.x86_64                                 90/136 
  Verifying  : libXi-1.7.4-2.el7.x86_64                                  91/136 
  Verifying  : libgnome-keyring-3.8.0-3.el7.x86_64                       92/136 
  Verifying  : alsa-lib-1.0.28-2.el7.x86_64                              93/136 
  Verifying  : libstdc++-devel-4.8.5-4.el7.x86_64                        94/136 
  Verifying  : perl-podlators-2.5.1-3.el7.noarch                         95/136 
  Verifying  : zip-3.0-10.el7.x86_64                                     96/136 
  Verifying  : apr-util-devel-1.5.2-6.el7.x86_64                         97/136 
  Verifying  : libfontenc-1.1.2-3.el7.x86_64                             98/136 
  Verifying  : mpfr-3.1.1-4.el7.x86_64                                   99/136 
  Verifying  : perl-Filter-1.49-3.el7.x86_64                            100/136 
  Verifying  : dwz-0.11-3.el7.x86_64                                    101/136 
  Verifying  : cyrus-sasl-devel-2.1.26-20.el7_2.x86_64                  102/136 
  Verifying  : openssh-6.6.1p1-23.el7_2.x86_64                          103/136 
  Verifying  : rsync-3.0.9-17.el7.x86_64                                104/136 
  Verifying  : fipscheck-1.4.1-5.el7.x86_64                             105/136 
  Verifying  : less-458-9.el7.x86_64                                    106/136 
  Verifying  : freetype-2.4.11-11.el7.x86_64                            107/136 
  Verifying  : perl-Exporter-5.68-3.el7.noarch                          108/136 
  Verifying  : perl-constant-1.27-2.el7.noarch                          109/136 
  Verifying  : perl-PathTools-3.40-5.el7.x86_64                         110/136 
  Verifying  : elfutils-0.163-3.el7.x86_64                              111/136 
  Verifying  : 1:openssl-1.0.1e-51.el7_2.4.x86_64                       112/136 
  Verifying  : glibc-devel-2.17-106.el7_2.4.x86_64                      113/136 
  Verifying  : apr-1.4.8-3.el7.x86_64                                   114/136 
  Verifying  : 4:perl-5.16.3-286.el7.x86_64                             115/136 
  Verifying  : subversion-1.7.14-10.el7.x86_64                          116/136 
  Verifying  : perl-Thread-Queue-3.02-2.el7.noarch                      117/136 
  Verifying  : 1:perl-Pod-Simple-3.28-4.el7.noarch                      118/136 
  Verifying  : perl-Time-Local-1.2300-2.el7.noarch                      119/136 
  Verifying  : systemd-sysv-219-19.el7_2.4.x86_64                       120/136 
  Verifying  : libdb-devel-5.3.21-19.el7.x86_64                         121/136 
  Verifying  : perl-Pod-Perldoc-3.20-4.el7.noarch                       122/136 
  Verifying  : perl-Socket-2.010-3.el7.x86_64                           123/136 
  Verifying  : nettle-2.7.1-4.el7.x86_64                                124/136 
  Verifying  : xorg-x11-fonts-Type1-7.5-9.el7.noarch                    125/136 
  Verifying  : 1:perl-Error-0.17020-2.el7.noarch                        126/136 
  Verifying  : libXfont-1.5.1-2.el7.x86_64                              127/136 
  Verifying  : flex-2.5.37-3.el7.x86_64                                 128/136 
  Verifying  : cyrus-sasl-2.1.26-20.el7_2.x86_64                        129/136 
  Verifying  : unzip-6.0-15.el7.x86_64                                  130/136 
  Verifying  : gdb-7.6.1-80.el7.x86_64                                  131/136 
  Verifying  : perl-Getopt-Long-2.40-2.el7.noarch                       132/136 
  Verifying  : cpp-4.8.5-4.el7.x86_64                                   133/136 
  Verifying  : redhat-rpm-config-9.1.0-68.el7.centos.noarch             134/136 
  Verifying  : expat-devel-2.1.0-8.el7.x86_64                           135/136 
  Verifying  : lksctp-tools-1.0.13-3.el7.x86_64                         136/136 

Installed:
  apr-devel.x86_64 0:1.4.8-3.el7                                                
  cyrus-sasl-devel.x86_64 0:2.1.26-20.el7_2                                     
  flex.x86_64 0:2.5.37-3.el7                                                    
  gcc.x86_64 0:4.8.5-4.el7                                                      
  gcc-c++.x86_64 0:4.8.5-4.el7                                                  
  git.x86_64 0:1.8.3.1-6.el7                                                    
  java-1.8.0-openjdk-devel.x86_64 1:1.8.0.71-2.b15.el7_2                        
  krb5-devel.x86_64 0:1.13.2-10.el7                                             
  libcurl-devel.x86_64 0:7.29.0-25.el7.centos                                   
  make.x86_64 1:3.82-21.el7                                                     
  openssl.x86_64 1:1.0.1e-51.el7_2.4                                            
  patch.x86_64 0:2.7.1-8.el7                                                    
  python-devel.x86_64 0:2.7.5-34.el7                                            
  rpm-build.x86_64 0:4.11.3-17.el7                                              
  subversion-devel.x86_64 0:1.7.14-10.el7                                       
  unzip.x86_64 0:6.0-15.el7                                                     
  wget.x86_64 0:1.14-10.el7_0.1                                                 
  which.x86_64 0:2.20-7.el7                                                     
  zlib-devel.x86_64 0:1.2.7-15.el7                                              

Dependency Installed:
  alsa-lib.x86_64 0:1.0.28-2.el7                                                
  apr.x86_64 0:1.4.8-3.el7                                                      
  apr-util.x86_64 0:1.5.2-6.el7                                                 
  apr-util-devel.x86_64 0:1.5.2-6.el7                                           
  bzip2.x86_64 0:1.0.6-13.el7                                                   
  cpp.x86_64 0:4.8.5-4.el7                                                      
  cyrus-sasl.x86_64 0:2.1.26-20.el7_2                                           
  dwz.x86_64 0:0.11-3.el7                                                       
  elfutils.x86_64 0:0.163-3.el7                                                 
  expat-devel.x86_64 0:2.1.0-8.el7                                              
  file.x86_64 0:5.11-31.el7                                                     
  fipscheck.x86_64 0:1.4.1-5.el7                                                
  fipscheck-lib.x86_64 0:1.4.1-5.el7                                            
  fontconfig.x86_64 0:2.10.95-7.el7                                             
  fontpackages-filesystem.noarch 0:1.44-8.el7                                   
  freetype.x86_64 0:2.4.11-11.el7                                               
  gdb.x86_64 0:7.6.1-80.el7                                                     
  giflib.x86_64 0:4.1.6-9.el7                                                   
  glibc-devel.x86_64 0:2.17-106.el7_2.4                                         
  glibc-headers.x86_64 0:2.17-106.el7_2.4                                       
  gnutls.x86_64 0:3.3.8-14.el7_2                                                
  groff-base.x86_64 0:1.22.2-8.el7                                              
  initscripts.x86_64 0:9.49.30-1.el7                                            
  iproute.x86_64 0:3.10.0-54.el7                                                
  iptables.x86_64 0:1.4.21-16.el7                                               
  java-1.8.0-openjdk.x86_64 1:1.8.0.71-2.b15.el7_2                              
  java-1.8.0-openjdk-headless.x86_64 1:1.8.0.71-2.b15.el7_2                     
  javapackages-tools.noarch 0:3.4.1-11.el7                                      
  kernel-headers.x86_64 0:3.10.0-327.10.1.el7                                   
  keyutils-libs-devel.x86_64 0:1.5.8-3.el7                                      
  less.x86_64 0:458-9.el7                                                       
  libICE.x86_64 0:1.0.9-2.el7                                                   
  libSM.x86_64 0:1.2.2-2.el7                                                    
  libX11.x86_64 0:1.6.3-2.el7                                                   
  libX11-common.noarch 0:1.6.3-2.el7                                            
  libXau.x86_64 0:1.0.8-2.1.el7                                                 
  libXext.x86_64 0:1.3.3-3.el7                                                  
  libXfont.x86_64 0:1.5.1-2.el7                                                 
  libXi.x86_64 0:1.7.4-2.el7                                                    
  libXrender.x86_64 0:0.9.8-2.1.el7                                             
  libXtst.x86_64 0:1.2.2-2.1.el7                                                
  libcom_err-devel.x86_64 0:1.42.9-7.el7                                        
  libdb-devel.x86_64 0:5.3.21-19.el7                                            
  libedit.x86_64 0:3.0-12.20121213cvs.el7                                       
  libfontenc.x86_64 0:1.1.2-3.el7                                               
  libgnome-keyring.x86_64 0:3.8.0-3.el7                                         
  libgomp.x86_64 0:4.8.5-4.el7                                                  
  libjpeg-turbo.x86_64 0:1.2.90-5.el7                                           
  libmnl.x86_64 0:1.0.3-7.el7                                                   
  libmodman.x86_64 0:2.0.1-8.el7                                                
  libmpc.x86_64 0:1.0.1-3.el7                                                   
  libnetfilter_conntrack.x86_64 0:1.0.4-2.el7                                   
  libnfnetlink.x86_64 0:1.0.1-4.el7                                             
  libpng.x86_64 2:1.5.13-7.el7_2                                                
  libproxy.x86_64 0:0.4.11-8.el7                                                
  libselinux-devel.x86_64 0:2.2.2-6.el7                                         
  libsepol-devel.x86_64 0:2.1.9-3.el7                                           
  libstdc++-devel.x86_64 0:4.8.5-4.el7                                          
  libverto-devel.x86_64 0:0.2.5-4.el7                                           
  libxcb.x86_64 0:1.11-4.el7                                                    
  libxslt.x86_64 0:1.1.28-5.el7                                                 
  lksctp-tools.x86_64 0:1.0.13-3.el7                                            
  m4.x86_64 0:1.4.16-10.el7                                                     
  mpfr.x86_64 0:3.1.1-4.el7                                                     
  neon.x86_64 0:0.30.0-3.el7                                                    
  nettle.x86_64 0:2.7.1-4.el7                                                   
  openldap-devel.x86_64 0:2.4.40-8.el7                                          
  openssh.x86_64 0:6.6.1p1-23.el7_2                                             
  openssh-clients.x86_64 0:6.6.1p1-23.el7_2                                     
  pakchois.x86_64 0:0.4-10.el7                                                  
  pcre-devel.x86_64 0:8.32-15.el7                                               
  perl.x86_64 4:5.16.3-286.el7                                                  
  perl-Carp.noarch 0:1.26-244.el7                                               
  perl-Encode.x86_64 0:2.51-7.el7                                               
  perl-Error.noarch 1:0.17020-2.el7                                             
  perl-Exporter.noarch 0:5.68-3.el7                                             
  perl-File-Path.noarch 0:2.09-2.el7                                            
  perl-File-Temp.noarch 0:0.23.01-3.el7                                         
  perl-Filter.x86_64 0:1.49-3.el7                                               
  perl-Getopt-Long.noarch 0:2.40-2.el7                                          
  perl-Git.noarch 0:1.8.3.1-6.el7                                               
  perl-HTTP-Tiny.noarch 0:0.033-3.el7                                           
  perl-PathTools.x86_64 0:3.40-5.el7                                            
  perl-Pod-Escapes.noarch 1:1.04-286.el7                                        
  perl-Pod-Perldoc.noarch 0:3.20-4.el7                                          
  perl-Pod-Simple.noarch 1:3.28-4.el7                                           
  perl-Pod-Usage.noarch 0:1.63-3.el7                                            
  perl-Scalar-List-Utils.x86_64 0:1.27-248.el7                                  
  perl-Socket.x86_64 0:2.010-3.el7                                              
  perl-Storable.x86_64 0:2.45-3.el7                                             
  perl-TermReadKey.x86_64 0:2.30-20.el7                                         
  perl-Text-ParseWords.noarch 0:3.29-4.el7                                      
  perl-Thread-Queue.noarch 0:3.02-2.el7                                         
  perl-Time-HiRes.x86_64 4:1.9725-3.el7                                         
  perl-Time-Local.noarch 0:1.2300-2.el7                                         
  perl-constant.noarch 0:1.27-2.el7                                             
  perl-libs.x86_64 4:5.16.3-286.el7                                             
  perl-macros.x86_64 4:5.16.3-286.el7                                           
  perl-parent.noarch 1:0.225-244.el7                                            
  perl-podlators.noarch 0:2.5.1-3.el7                                           
  perl-srpm-macros.noarch 0:1-8.el7                                             
  perl-threads.x86_64 0:1.87-4.el7                                              
  perl-threads-shared.x86_64 0:1.43-6.el7                                       
  python-javapackages.noarch 0:3.4.1-11.el7                                     
  python-lxml.x86_64 0:3.2.1-4.el7                                              
  redhat-rpm-config.noarch 0:9.1.0-68.el7.centos                                
  rsync.x86_64 0:3.0.9-17.el7                                                   
  subversion.x86_64 0:1.7.14-10.el7                                             
  subversion-libs.x86_64 0:1.7.14-10.el7                                        
  systemd-sysv.x86_64 0:219-19.el7_2.4                                          
  sysvinit-tools.x86_64 0:2.88-14.dsf.el7                                       
  trousers.x86_64 0:0.3.13-1.el7                                                
  ttmkfdir.x86_64 0:3.0.9-42.el7                                                
  tzdata-java.noarch 0:2016a-1.el7                                              
  xorg-x11-font-utils.x86_64 1:7.5-20.el7                                       
  xorg-x11-fonts-Type1.noarch 0:7.5-9.el7                                       
  zip.x86_64 0:3.0-10.el7                                                       

Complete!
 ---> aecd280535b7
Removing intermediate container cb9d6864c120
Step 4 : ADD build.sh /build.sh
 ---> ed54f6f4a770
Removing intermediate container d11068f1e77c
Step 5 : ADD pants.ini /pants.ini
 ---> c3a492db6db8
Removing intermediate container 8805e194b665
Successfully built c3a492db6db8
+ mkdir -p /scratch/src
+ cd /scratch
+ tar --strip-components 1 -C src -xf /src.tar.gz
+ cp -R /specs/rpm .
+ cd rpm
++ echo 0.13.0snapshot.2016.03.10
++ tr - _
+ export AURORA_VERSION=0.13.0snapshot.2016.03.10
+ AURORA_VERSION=0.13.0snapshot.2016.03.10
+ make srpm
rm -rf /dist/rpmbuild
mkdir -p /dist/rpmbuild/BUILD
mkdir -p /dist/rpmbuild/BUILDROOT
mkdir -p /dist/rpmbuild/RPMS
mkdir -p /dist/rpmbuild/SOURCES
mkdir -p /dist/rpmbuild/SRPMS
cp /src.tar.gz /dist/rpmbuild/SOURCES/aurora.tar.gz
cp SOURCES/* /dist/rpmbuild/SOURCES
rpmbuild  \
	--define "_topdir /dist" \
	--define "_builddir %{_topdir}/rpmbuild/BUILD" \
	--define "_buildrootdir %{_topdir}/rpmbuild/BUILDROOT" \
	--define "_rpmdir %{_topdir}/rpmbuild/RPMS" \
	--define "_srcrpmdir %{_topdir}/rpmbuild/SRPMS" \
	--define "_specdir %(pwd)" \
	--define "_sourcedir  %{_topdir}/rpmbuild/SOURCES" \
	--define "AURORA_VERSION 0.13.0snapshot.2016.03.10" \
	--define "MESOS_VERSION " \
	--nodeps -bs aurora.spec
error: Macro %MESOS_VERSION has empty body
error: Macro %MESOS_VERSION has empty body
error: File /dist/rpmbuild/SOURCES/0.13.0snapshot.2016.03.10.tar.gz: No such file or directory
make: *** [srpm] Error 1
Build step 'Execute shell' marked build as failure
Skipped archiving because build is not successful